{"text_format":"1","workbook":"xlsx","n_sheets":4,"sheets":["Magacin","Firme","Fakture","Otpremnice"],"not_rendered":{"charts":0,"images":0,"macros":1,"external_links":0,"defined_names":0,"comments":0,"pivot_tables":0},"unopened":[],"bounds":{"document_bytes":16777216,"sheet_cells":100000,"rows_first":2000,"rows_last":500,"rows_between":2000,"halvings":0,"cell_chars":16384,"cell_head_chars":4096},"cells_cut":0,"cells_raw":0,"read":"whole","date_system":"1900"}

{"sheet":"Magacin","index":0,"n_rows":6,"n_cols":10,"rows_kept":6,"cut":false,"hidden":false,"merged":[[0,0,0,7]]}
["ARTIKLI"]
["ŠIFRA","NAZIV ARTIKLA","J.M.","KOLIČINA","VP CIJENA sa pdv","nabavna cijena","vp cijena","mp cijena",null,"Izdato"]
[11,"Artikal 1 - 25kg","kg",150,0.48599999999999999,0.48599999999999999,0.91,1.4,null,{"$f":"D3-Fakture!E18","v":100}]
[22,"Artikal 2 - 15kg","kg",250,0.39900000000000002,0.39900000000000002,0.92800000000000005,1.2,null,{"$f":"D4-Fakture!E19","v":150}]
[33,"Artikal 3 - 15kg","kg",150,1.119,1.119,2.1419999999999999,2.8,null,{"$f":"D5-Fakture!E23","v":150}]
[44,"Artikal 4 - 12kg","kg",10,1.111,1.111,2.0699999999999998,2.6,null,{"$f":"D6-Fakture!E24","v":10}]

{"sheet":"Firme","index":1,"n_rows":15,"n_cols":5,"rows_kept":15,"cut":false,"hidden":false,"merged":[[0,0,0,4]]}
["KUPCI"]
["ŠIFRA","NAZIV","ADRESA","PIB","PDV"]
[1,"Firma 1","Adresa 1",11,111]
[2,"Firma 2","Adresa 2",22,222]
[3,"Firma 3","Adresa 3",33,333]
[4,"Firma 4","Adresa 4",44,444]
[5,"Firma 5","Adresa 5",55,555]
[6,"Firma 6","Adresa 6",66,666]
[7,"Firma 7","Adresa 7",77,777]
[8,"Firma 8","Adresa 8",88,888]
[9,"Firma 9","Adresa 9",99,999]
[10,"Firma 10","Adresa 10",110,1110]
[11,"Firma 11","Adresa 11",121,1221]
[12,"Firma 12","Adresa 12",132,1332]
[13,"Firma 13","Adresa 13",143,1443]

{"sheet":"Fakture","index":2,"n_rows":2350,"n_cols":13,"rows_kept":2350,"cut":false,"hidden":false,"merged":[[1,8,6,11],[14,4,14,6],[2,2,2,3],[3,2,3,3],[4,2,4,3],[8,3,8,4]]}
[]
[]
[]
[]
[]
[]
[]
[]
[null,"RAČUN BR.",null,null,null,null,null,null,"KUPAC (ID):",8]
[null,null,null,null,null,null,null,null,"Naziv kupca:",{"$f":"IF(J9=\"\",\"\",VLOOKUP(J9,Firme!A3:E50000,2,FALSE))","v":"Firma 8"}]
[null,"Datum:",null,null,null,null,null,null,"Adresa:",{"$f":"IF(J9=\"\",\"\",VLOOKUP(J9,Firme!A3:E50000,3,FALSE))","v":"Adresa 8"}]
[null,null,null,null,null,null,null,null,"PIB",{"$f":"IF(J9=\"\",\"\",VLOOKUP(J9,Firme!A3:E50000,4,FALSE))","v":88}]
[null,null,null,null,null,null,null,null,"PDV:",{"$f":"IF(J9=\"\",\"\",VLOOKUP(J9,Firme!A3:E50000,5,FALSE))","v":888}]
[]
[]
[]
["R.br","Šifra","Naziv artikla","J.M","Kol","Cijena\nbez\nPDV","Vrijednost\nbez\nPDV","Rabat %","Iznos\nrabata","Vrijednost\nbez PDV-a\nsa rabatom","PDV%","Cijena sa\nPDV","Vrijednost"]
[1,11,{"$f":"IF(B18=\"\",\"\",VLOOKUP(B18,Magacin!$A$3:$E$48683,2,FALSE))","v":"Artikal 1 - 25kg"},{"$f":"IF(C18=\"\",\"\",VLOOKUP(C18,Magacin!$B$3:$H$48683,2,FALSE))","v":"kg"},50,{"$f":"IF(C18=\"\",\"\",VLOOKUP(C18,Magacin!$B$3:$H$48683,4,FALSE))-21%","v":0.27600000000000002},{"$f":"IF(B18<>\"\",E18*F18,\"\")","v":13.8},0,{"$f":"IF(B18<>\"\",G18*H18,\"\")","v":0},{"$f":"IF(B18<>\"\",G18-I18,\"\")","v":13.8},{"$f":"IF(B18<>\"\",21%,\"\")","v":0.21},{"$f":"IF(B18=\"\",\"\",VLOOKUP(B18,Magacin!$A$3:$E$48683,5,FALSE))","v":0.48599999999999999},{"$f":"IF(B18<>\"\",L18*E18,\"\")","v":24.3}]
[{"$f":"IF(B19=\"\",\"\",A18+1)","v":2},33,{"$f":"IF(B19=\"\",\"\",VLOOKUP(B19,Magacin!$A$3:$E$48683,2,FALSE))","v":"Artikal 3 - 15kg"},{"$f":"IF(C19=\"\",\"\",VLOOKUP(C19,Magacin!$B$3:$H$48683,2,FALSE))","v":"kg"},100,{"$f":"IF(C19=\"\",\"\",VLOOKUP(C19,Magacin!$B$3:$H$48683,4,FALSE))-21%","v":0.90900000000000003},90.9,0,{"$f":"IF(B19<>\"\",G19*H19,\"\")","v":0},{"$f":"IF(B19<>\"\",G19-I19,\"\")","v":90.9},0.21,{"$f":"IF(B19=\"\",\"\",VLOOKUP(B19,Magacin!$A$3:$E$48683,5,FALSE))","v":1.119},{"$f":"IF(B19<>\"\",L19*E19,\"\")","v":111.9}]
[{"$f":"IF(B20=\"\",\"\",A16+1)","v":""},null,{"$f":"IF(B20=\"\",\"\",VLOOKUP(B20,Magacin!$A$3:$E$48683,2,FALSE))","v":""},{"$f":"IF(C20=\"\",\"\",VLOOKUP(C20,Magacin!$B$3:$H$48683,2,FALSE))","v":""},null,{"$f":"IF(B20<>\"\",VLOOKUP(C20,Magacin!$B$3:$H$48683,4,FALSE)*(1-0.21),\"\")","v":""},"",0,{"$f":"IF(B20<>\"\",G20*H20,\"\")","v":""},{"$f":"IF(B20<>\"\",G20-I20,\"\")","v":""},"",{"$f":"IF(B20=\"\",\"\",VLOOKUP(B20,Magacin!$A$3:$E$48683,5,FALSE))","v":""},{"$f":"IF(B20<>\"\",L20*E20,\"\")","v":""}]
["",null,{"$f":"IF(B21=\"\",\"\",VLOOKUP(B21,Magacin!$A$3:$E$48683,2,FALSE))","v":""},{"$f":"IF(C21=\"\",\"\",VLOOKUP(C21,Magacin!$B$3:$H$48683,2,FALSE))","v":""},null,{"$f":"IF(B21<>\"\",VLOOKUP(C21,Magacin!$B$3:$H$48683,4,FALSE)*(1-0.21),\"\")","v":""},"",0,"","","",{"$f":"IF(B21=\"\",\"\",VLOOKUP(B21,Magacin!$A$3:$E$48683,5,FALSE))","v":""},""]
["",null,{"$f":"IF(B22=\"\",\"\",VLOOKUP(B22,Magacin!$A$3:$E$48683,2,FALSE))","v":""},{"$f":"IF(C22=\"\",\"\",VLOOKUP(C22,Magacin!$B$3:$H$48683,2,FALSE))","v":""},null,{"$f":"IF(B22<>\"\",VLOOKUP(C22,Magacin!$B$3:$H$48683,4,FALSE)*(1-0.21),\"\")","v":""},"",0,"","","",{"$f":"IF(B22=\"\",\"\",VLOOKUP(B22,Magacin!$A$3:$E$48683,5,FALSE))","v":""},""]
[{"$f":"IF(B23=\"\",\"\",A19+1)","v":""},null,{"$f":"IF(B23=\"\",\"\",VLOOKUP(B23,Magacin!$A$3:$E$48683,2,FALSE))","v":""},{"$f":"IF(C23=\"\",\"\",VLOOKUP(C23,Magacin!$B$3:$H$48683,2,FALSE))","v":""},null,{"$f":"IF(B23<>\"\",VLOOKUP(C23,Magacin!$B$3:$H$48683,4,FALSE)*(1-0.21),\"\")","v":""},{"$f":"IF(B23<>\"\",E23*F23,\"\")","v":""},0,{"$f":"IF(B23<>\"\",G23*H23,\"\")","v":""},{"$f":"IF(B23<>\"\",G23-I23,\"\")","v":""},{"$f":"IF(B23<>\"\",21%,\"\")","v":""},{"$f":"IF(B23=\"\",\"\",VLOOKUP(B23,Magacin!$A$3:$E$48683,5,FALSE))","v":""},{"$f":"IF(B23<>\"\",L23*E23,\"\")","v":""}]
[{"$f":"IF(B24=\"\",\"\",A23+1)","v":""},null,{"$f":"IF(B24=\"\",\"\",VLOOKUP(B24,Magacin!$A$3:$E$48683,2,FALSE))","v":""},{"$f":"IF(C24=\"\",\"\",VLOOKUP(C24,Magacin!$B$3:$H$48683,2,FALSE))","v":""},null,{"$f":"IF(B24<>\"\",VLOOKUP(C24,Magacin!$B$3:$H$48683,4,FALSE)*(1-0.21),\"\")","v":""},"",0,{"$f":"IF(B24<>\"\",G24*H24,\"\")","v":""},{"$f":"IF(B24<>\"\",G24-I24,\"\")","v":""},"",{"$f":"IF(B24=\"\",\"\",VLOOKUP(B24,Magacin!$A$3:$E$48683,5,FALSE))","v":""},""]
[null,null,{"$f":"IF(B25=\"\",\"\",VLOOKUP(B25,Magacin!A7:E3726,2,FALSE))","v":""},{"$f":"IF(C25=\"\",\"\",VLOOKUP(C25,Magacin!B7:H3727,2,FALSE))","v":""},null,{"$f":"IF(E25=\"\",\"\",VLOOKUP(E25,Magacin!D7:H3727,2,FALSE))","v":""},null,null,null,null,null,"UKUPNO:",{"$f":"SUM(M18:M24)","v":136.20000000000002}]
[null,null,{"$f":"IF(B26=\"\",\"\",VLOOKUP(B26,Magacin!A7:E3727,2,FALSE))","v":""},{"$f":"IF(C26=\"\",\"\",VLOOKUP(C26,Magacin!B7:H3728,2,FALSE))","v":""},null,{"$f":"IF(E26=\"\",\"\",VLOOKUP(E26,Magacin!D7:H3728,2,FALSE))","v":""}]
[null,null,{"$f":"IF(B27=\"\",\"\",VLOOKUP(B27,Magacin!A7:E3728,2,FALSE))","v":""},{"$f":"IF(C27=\"\",\"\",VLOOKUP(C27,Magacin!B7:H3729,2,FALSE))","v":""},null,{"$f":"IF(E27=\"\",\"\",VLOOKUP(E27,Magacin!D7:H3729,2,FALSE))","v":""}]
[null,null,{"$f":"IF(B28=\"\",\"\",VLOOKUP(B28,Magacin!A7:E3729,2,FALSE))","v":""},{"$f":"IF(C28=\"\",\"\",VLOOKUP(C28,Magacin!B7:H3730,2,FALSE))","v":""},null,{"$f":"IF(E28=\"\",\"\",VLOOKUP(E28,Magacin!D7:H3730,2,FALSE))","v":""}]
[null,null,{"$f":"IF(B29=\"\",\"\",VLOOKUP(B29,Magacin!A7:E3730,2,FALSE))","v":""},{"$f":"IF(C29=\"\",\"\",VLOOKUP(C29,Magacin!B7:H3731,2,FALSE))","v":""},null,{"$f":"IF(E29=\"\",\"\",VLOOKUP(E29,Magacin!D7:H3731,2,FALSE))","v":""}]
[null,null,{"$f":"IF(B30=\"\",\"\",VLOOKUP(B30,Magacin!A7:E3731,2,FALSE))","v":""},{"$f":"IF(C30=\"\",\"\",VLOOKUP(C30,Magacin!B7:H3732,2,FALSE))","v":""},null,{"$f":"IF(E30=\"\",\"\",VLOOKUP(E30,Magacin!D7:H3732,2,FALSE))","v":""}]
[null,null,{"$f":"IF(B31=\"\",\"\",VLOOKUP(B31,Magacin!A7:E3732,2,FALSE))","v":""},{"$f":"IF(C31=\"\",\"\",VLOOKUP(C31,Magacin!B7:H3733,2,FALSE))","v":""},null,{"$f":"IF(E31=\"\",\"\",VLOOKUP(E31,Magacin!D7:H3733,2,FALSE))","v":""}]
[null,null,{"$f":"IF(B32=\"\",\"\",VLOOKUP(B32,Magacin!A7:E3733,2,FALSE))","v":""},{"$f":"IF(C32=\"\",\"\",VLOOKUP(C32,Magacin!B7:H3734,2,FALSE))","v":""},null,{"$f":"IF(E32=\"\",\"\",VLOOKUP(E32,Magacin!D7:H3734,2,FALSE))","v":""}]
[null,null,{"$f":"IF(B33=\"\",\"\",VLOOKUP(B33,Magacin!A7:E3734,2,FALSE))","v":""},{"$f":"IF(C33=\"\",\"\",VLOOKUP(C33,Magacin!B7:H3735,2,FALSE))","v":""},null,{"$f":"IF(E33=\"\",\"\",VLOOKUP(E33,Magacin!D7:H3735,2,FALSE))","v":""}]
[null,null,{"$f":"IF(B34=\"\",\"\",VLOOKUP(B34,Magacin!A7:E3735,2,FALSE))","v":""},{"$f":"IF(C34=\"\",\"\",VLOOKUP(C34,Magacin!B7:H3736,2,FALSE))","v":""},null,{"$f":"IF(E34=\"\",\"\",VLOOKUP(E34,Magacin!D7:H3736,2,FALSE))","v":""}]
[null,null,{"$f":"IF(B35=\"\",\"\",VLOOKUP(B35,Magacin!A7:E3736,2,FALSE))","v":""},{"$f":"IF(C35=\"\",\"\",VLOOKUP(C35,Magacin!B7:H3737,2,FALSE))","v":""},null,{"$f":"IF(E35=\"\",\"\",VLOOKUP(E35,Magacin!D7:H3737,2,FALSE))","v":""}]
[null,null,{"$f":"IF(B36=\"\",\"\",VLOOKUP(B36,Magacin!A7:E3737,2,FALSE))","v":""},{"$f":"IF(C36=\"\",\"\",VLOOKUP(C36,Magacin!B7:H3738,2,FALSE))","v":""},null,{"$f":"IF(E36=\"\",\"\",VLOOKUP(E36,Magacin!D7:H3738,2,FALSE))","v":""}]
[null,null,{"$f":"IF(B37=\"\",\"\",VLOOKUP(B37,Magacin!A7:E3738,2,FALSE))","v":""},{"$f":"IF(C37=\"\",\"\",VLOOKUP(C37,Magacin!B7:H3739,2,FALSE))","v":""},null,{"$f":"IF(E37=\"\",\"\",VLOOKUP(E37,Magacin!D7:H3739,2,FALSE))","v":""}]
[null,null,{"$f":"IF(B38=\"\",\"\",VLOOKUP(B38,Magacin!A7:E3739,2,FALSE))","v":""},{"$f":"IF(C38=\"\",\"\",VLOOKUP(C38,Magacin!B7:H3740,2,FALSE))","v":""},null,{"$f":"IF(E38=\"\",\"\",VLOOKUP(E38,Magacin!D7:H3740,2,FALSE))","v":""}]
[null,null,{"$f":"IF(B39=\"\",\"\",VLOOKUP(B39,Magacin!A7:E3740,2,FALSE))","v":""},{"$f":"IF(C39=\"\",\"\",VLOOKUP(C39,Magacin!B7:H3741,2,FALSE))","v":""},null,{"$f":"IF(E39=\"\",\"\",VLOOKUP(E39,Magacin!D7:H3741,2,FALSE))","v":""}]
[null,null,{"$f":"IF(B40=\"\",\"\",VLOOKUP(B40,Magacin!A7:E3792,2,FALSE))","v":""}]
[null,null,{"$f":"IF(B41=\"\",\"\",VLOOKUP(B41,Magacin!A7:E3793,2,FALSE))","v":""}]
[null,null,{"$f":"IF(B42=\"\",\"\",VLOOKUP(B42,Magacin!A7:E3794,2,FALSE))","v":""}]
[null,null,{"$f":"IF(B43=\"\",\"\",VLOOKUP(B43,Magacin!A7:E3795,2,FALSE))","v":""}]
[null,null,{"$f":"IF(B44=\"\",\"\",VLOOKUP(B44,Magacin!A7:E3796,2,FALSE))","v":""}]
[null,null,{"$f":"IF(B45=\"\",\"\",VLOOKUP(B45,Magacin!A7:E3797,2,FALSE))","v":""}]
[null,null,{"$f":"IF(B46=\"\",\"\",VLOOKUP(B46,Magacin!A7:E3798,2,FALSE))","v":""}]
[null,null,{"$f":"IF(B47=\"\",\"\",VLOOKUP(B47,Magacin!A7:E3799,2,FALSE))","v":""}]
[null,null,{"$f":"IF(B48=\"\",\"\",VLOOKUP(B48,Magacin!A7:E3800,2,FALSE))","v":""}]
[null,null,{"$f":"IF(B49=\"\",\"\",VLOOKUP(B49,Magacin!A7:E3801,2,FALSE))","v":""}]
[null,null,{"$f":"IF(B50=\"\",\"\",VLOOKUP(B50,Magacin!A7:E3802,2,FALSE))","v":""}]
[null,null,{"$f":"IF(B51=\"\",\"\",VLOOKUP(B51,Magacin!A7:E3803,2,FALSE))","v":""}]
[null,null,{"$f":"IF(B52=\"\",\"\",VLOOKUP(B52,Magacin!A7:E3804,2,FALSE))","v":""}]
[null,null,{"$f":"IF(B53=\"\",\"\",VLOOKUP(B53,Magacin!A7:E3805,2,FALSE))","v":""}]
[null,null,{"$f":"IF(B54=\"\",\"\",VLOOKUP(B54,Magacin!A7:E3806,2,FALSE))","v":""}]
[null,null,{"$f":"IF(B55=\"\",\"\",VLOOKUP(B55,Magacin!A7:E3807,2,FALSE))","v":""}]
[null,null,{"$f":"IF(B56=\"\",\"\",VLOOKUP(B56,Magacin!A7:E3808,2,FALSE))","v":""}]
[null,null,{"$f":"IF(B57=\"\",\"\",VLOOKUP(B57,Magacin!A7:E3809,2,FALSE))","v":""}]
[null,null,{"$f":"IF(B58=\"\",\"\",VLOOKUP(B58,Magacin!A7:E3810,2,FALSE))","v":""}]
[null,null,{"$f":"IF(B59=\"\",\"\",VLOOKUP(B59,Magacin!A7:E3811,2,FALSE))","v":""}]
[null,null,{"$f":"IF(B60=\"\",\"\",VLOOKUP(B60,Magacin!A7:E3812,2,FALSE))","v":""}]
[null,null,{"$f":"IF(B61=\"\",\"\",VLOOKUP(B61,Magacin!A7:E3813,2,FALSE))","v":""}]
[null,null,{"$f":"IF(B62=\"\",\"\",VLOOKUP(B62,Magacin!A7:E3814,2,FALSE))","v":""}]
[null,null,{"$f":"IF(B63=\"\",\"\",VLOOKUP(B63,Magacin!A7:E3815,2,FALSE))","v":""}]
[null,null,{"$f":"IF(B64=\"\",\"\",VLOOKUP(B64,Magacin!A7:E3816,2,FALSE))","v":""}]
[null,null,{"$f":"IF(B65=\"\",\"\",VLOOKUP(B65,Magacin!A7:E3817,2,FALSE))","v":""}]
[null,null,{"$f":"IF(B66=\"\",\"\",VLOOKUP(B66,Magacin!A7:E3818,2,FALSE))","v":""}]
[null,null,{"$f":"IF(B67=\"\",\"\",VLOOKUP(B67,Magacin!A7:E3819,2,FALSE))","v":""}]
[null,null,{"$f":"IF(B68=\"\",\"\",VLOOKUP(B68,Magacin!A7:E3820,2,FALSE))","v":""}]
[null,null,{"$f":"IF(B69=\"\",\"\",VLOOKUP(B69,Magacin!A7:E3821,2,FALSE))","v":""}]
[null,null,{"$f":"IF(B70=\"\",\"\",VLOOKUP(B70,Magacin!A7:E3822,2,FALSE))","v":""}]
[null,null,{"$f":"IF(B71=\"\",\"\",VLOOKUP(B71,Magacin!A7:E3823,2,FALSE))","v":""}]
[null,null,{"$f":"IF(B72=\"\",\"\",VLOOKUP(B72,Magacin!A7:E3824,2,FALSE))","v":""}]
[null,null,{"$f":"IF(B73=\"\",\"\",VLOOKUP(B73,Magacin!A7:E3825,2,FALSE))","v":""}]
[null,null,{"$f":"IF(B74=\"\",\"\",VLOOKUP(B74,Magacin!A7:E3826,2,FALSE))","v":""}]
[null,null,{"$f":"IF(B75=\"\",\"\",VLOOKUP(B75,Magacin!A7:E3827,2,FALSE))","v":""}]
[null,null,{"$f":"IF(B76=\"\",\"\",VLOOKUP(B76,Magacin!A7:E3828,2,FALSE))","v":""}]
[null,null,{"$f":"IF(B77=\"\",\"\",VLOOKUP(B77,Magacin!A7:E3829,2,FALSE))","v":""}]
[null,null,{"$f":"IF(B78=\"\",\"\",VLOOKUP(B78,Magacin!A7:E3830,2,FALSE))","v":""}]
[null,null,{"$f":"IF(B79=\"\",\"\",VLOOKUP(B79,Magacin!A7:E3831,2,FALSE))","v":""}]
[null,null,{"$f":"IF(B80=\"\",\"\",VLOOKUP(B80,Magacin!A7:E3832,2,FALSE))","v":""}]
[null,null,{"$f":"IF(B81=\"\",\"\",VLOOKUP(B81,Magacin!A7:E3833,2,FALSE))","v":""}]
[null,null,{"$f":"IF(B82=\"\",\"\",VLOOKUP(B82,Magacin!A7:E3834,2,FALSE))","v":""}]
[null,null,{"$f":"IF(B83=\"\",\"\",VLOOKUP(B83,Magacin!A7:E3835,2,FALSE))","v":""}]
[null,null,{"$f":"IF(B84=\"\",\"\",VLOOKUP(B84,Magacin!A7:E3836,2,FALSE))","v":""}]
[null,null,{"$f":"IF(B85=\"\",\"\",VLOOKUP(B85,Magacin!A7:E3837,2,FALSE))","v":""}]
[null,null,{"$f":"IF(B86=\"\",\"\",VLOOKUP(B86,Magacin!A7:E3838,2,FALSE))","v":""}]
[null,null,{"$f":"IF(B87=\"\",\"\",VLOOKUP(B87,Magacin!A7:E3839,2,FALSE))","v":""}]
[null,null,{"$f":"IF(B88=\"\",\"\",VLOOKUP(B88,Magacin!A7:E3840,2,FALSE))","v":""}]
[null,null,{"$f":"IF(B89=\"\",\"\",VLOOKUP(B89,Magacin!A7:E3841,2,FALSE))","v":""}]
[null,null,{"$f":"IF(B90=\"\",\"\",VLOOKUP(B90,Magacin!A7:E3842,2,FALSE))","v":""}]
[null,null,{"$f":"IF(B91=\"\",\"\",VLOOKUP(B91,Magacin!A7:E3843,2,FALSE))","v":""}]
[null,null,{"$f":"IF(B92=\"\",\"\",VLOOKUP(B92,Magacin!A7:E3844,2,FALSE))","v":""}]
[null,null,{"$f":"IF(B93=\"\",\"\",VLOOKUP(B93,Magacin!A7:E3845,2,FALSE))","v":""}]
[null,null,{"$f":"IF(B94=\"\",\"\",VLOOKUP(B94,Magacin!A7:E3846,2,FALSE))","v":""}]
[null,null,{"$f":"IF(B95=\"\",\"\",VLOOKUP(B95,Magacin!A7:E3847,2,FALSE))","v":""}]
[null,null,{"$f":"IF(B96=\"\",\"\",VLOOKUP(B96,Magacin!A7:E3848,2,FALSE))","v":""}]
[null,null,{"$f":"IF(B97=\"\",\"\",VLOOKUP(B97,Magacin!A7:E3849,2,FALSE))","v":""}]
[null,null,{"$f":"IF(B98=\"\",\"\",VLOOKUP(B98,Magacin!A7:E3850,2,FALSE))","v":""}]
[null,null,{"$f":"IF(B99=\"\",\"\",VLOOKUP(B99,Magacin!A7:E3851,2,FALSE))","v":""}]
[null,null,{"$f":"IF(B100=\"\",\"\",VLOOKUP(B100,Magacin!A7:E3852,2,FALSE))","v":""}]
[null,null,{"$f":"IF(B101=\"\",\"\",VLOOKUP(B101,Magacin!A7:E3853,2,FALSE))","v":""}]
[null,null,{"$f":"IF(B102=\"\",\"\",VLOOKUP(B102,Magacin!A7:E3854,2,FALSE))","v":""}]
[null,null,{"$f":"IF(B103=\"\",\"\",VLOOKUP(B103,Magacin!A7:E3855,2,FALSE))","v":""}]
[null,null,{"$f":"IF(B104=\"\",\"\",VLOOKUP(B104,Magacin!A7:E3856,2,FALSE))","v":""}]
[null,null,{"$f":"IF(B105=\"\",\"\",VLOOKUP(B105,Magacin!A7:E3857,2,FALSE))","v":""}]
[null,null,{"$f":"IF(B106=\"\",\"\",VLOOKUP(B106,Magacin!A7:E3858,2,FALSE))","v":""}]
[null,null,{"$f":"IF(B107=\"\",\"\",VLOOKUP(B107,Magacin!A7:E3859,2,FALSE))","v":""}]
[null,null,{"$f":"IF(B108=\"\",\"\",VLOOKUP(B108,Magacin!A7:E3860,2,FALSE))","v":""}]
[null,null,{"$f":"IF(B109=\"\",\"\",VLOOKUP(B109,Magacin!A7:E3861,2,FALSE))","v":""}]
[null,null,{"$f":"IF(B110=\"\",\"\",VLOOKUP(B110,Magacin!A7:E3862,2,FALSE))","v":""}]
[null,null,{"$f":"IF(B111=\"\",\"\",VLOOKUP(B111,Magacin!A7:E3863,2,FALSE))","v":""}]
[null,null,{"$f":"IF(B112=\"\",\"\",VLOOKUP(B112,Magacin!A7:E3864,2,FALSE))","v":""}]
[null,null,{"$f":"IF(B113=\"\",\"\",VLOOKUP(B113,Magacin!A7:E3865,2,FALSE))","v":""}]
[null,null,{"$f":"IF(B114=\"\",\"\",VLOOKUP(B114,Magacin!A7:E3866,2,FALSE))","v":""}]
[null,null,{"$f":"IF(B115=\"\",\"\",VLOOKUP(B115,Magacin!A7:E3867,2,FALSE))","v":""}]
[null,null,{"$f":"IF(B116=\"\",\"\",VLOOKUP(B116,Magacin!A7:E3868,2,FALSE))","v":""}]
[null,null,{"$f":"IF(B117=\"\",\"\",VLOOKUP(B117,Magacin!A7:E3869,2,FALSE))","v":""}]
[null,null,{"$f":"IF(B118=\"\",\"\",VLOOKUP(B118,Magacin!A7:E3870,2,FALSE))","v":""}]
[null,null,{"$f":"IF(B119=\"\",\"\",VLOOKUP(B119,Magacin!A7:E3871,2,FALSE))","v":""}]
[null,null,{"$f":"IF(B120=\"\",\"\",VLOOKUP(B120,Magacin!A7:E3872,2,FALSE))","v":""}]
{"$rows_left_out":2231}
{"sheet":"Otpremnice","index":3,"n_rows":19,"n_cols":10,"rows_kept":19,"cut":false,"hidden":false,"merged":[[2,2,2,3],[3,2,3,3],[4,2,4,3]]}
[]
[]
[]
[]
[]
[]
[]
[]
[]
[]
[]
["r.br","šifra","Naziv artikla","Količina","Nabavna\nCijena","Nabavna.\nVrijednost","Veleprod.\n Cijena","Veleprod. \nVijednost","Maloprod.\nCijena","Maloprod.\nCijena"]
[1,33,{"$f":"IF(B13=\"\",\"\",VLOOKUP(B13,Magacin!$A$3:$H$49985,2,FALSE))","v":"Artikal 3 - 15kg"},30,{"$f":"IF(C13=\"\",\"\",VLOOKUP(C13,Magacin!$B$3:$H49985,5,FALSE))","v":1.119},{"$f":"D13*E13","v":33.57},{"$f":"IF(C13=\"\",\"\",VLOOKUP(C13,Magacin!$B$3:$H49985,6,FALSE))","v":2.1419999999999999},{"$f":"D13*G13","v":64.259999999999991},{"$f":"IF(C13=\"\",\"\",VLOOKUP(C13,Magacin!$B$3:$H49985,7,TRUE))","v":2.8},{"$f":"D13*I13","v":84}]
[{"$f":"IF(B14=\"\",\"\",A13+1)","v":2},11,{"$f":"IF(B14=\"\",\"\",VLOOKUP(B14,Magacin!$A$3:$H$49985,2,FALSE))","v":"Artikal 1 - 25kg"},684,{"$f":"IF(C14=\"\",\"\",VLOOKUP(C14,Magacin!$B$3:$H49986,5,FALSE))","v":0.48599999999999999},{"$f":"D14*E14","v":332.42399999999998},{"$f":"IF(C14=\"\",\"\",VLOOKUP(C14,Magacin!$B$3:$H49986,6,FALSE))","v":0.91},{"$f":"D14*G14","v":622.44000000000005},{"$f":"IF(C14=\"\",\"\",VLOOKUP(C14,Magacin!$B$3:$H49986,7,TRUE))","v":1.4},{"$f":"D14*I14","v":957.59999999999991}]
[{"$f":"IF(B15=\"\",\"\",A14+1)","v":3},22,{"$f":"IF(B15=\"\",\"\",VLOOKUP(B15,Magacin!$A$3:$H$49985,2,FALSE))","v":"Artikal 2 - 15kg"},108,{"$f":"IF(C15=\"\",\"\",VLOOKUP(C15,Magacin!$B$3:$H49987,5,FALSE))","v":0.39900000000000002},43.091999999999999,{"$f":"IF(C15=\"\",\"\",VLOOKUP(C15,Magacin!$B$3:$H49987,6,FALSE))","v":0.92800000000000005},100.224,{"$f":"IF(C15=\"\",\"\",VLOOKUP(C15,Magacin!$B$3:$H49987,7,TRUE))","v":1.2},129.6]
["",null,{"$f":"IF(B16=\"\",\"\",VLOOKUP(B16,Magacin!$A$3:$H$49985,2,FALSE))","v":""},null,{"$f":"IF(C16=\"\",\"\",VLOOKUP(C16,Magacin!$B$3:$H49988,5,FALSE))","v":""},{"$error":"#VALUE!"},{"$f":"IF(C16=\"\",\"\",VLOOKUP(C16,Magacin!$B$3:$H49988,6,FALSE))","v":""},{"$error":"#VALUE!"},{"$f":"IF(C16=\"\",\"\",VLOOKUP(C16,Magacin!$B$3:$H49988,7,TRUE))","v":""},{"$error":"#VALUE!"}]
["",null,{"$f":"IF(B17=\"\",\"\",VLOOKUP(B17,Magacin!$A$3:$H$49985,2,FALSE))","v":""},null,{"$f":"IF(C17=\"\",\"\",VLOOKUP(C17,Magacin!$B$3:$H49989,5,FALSE))","v":""},{"$error":"#VALUE!"},{"$f":"IF(C17=\"\",\"\",VLOOKUP(C17,Magacin!$B$3:$H49989,6,FALSE))","v":""},{"$error":"#VALUE!"},{"$f":"IF(C17=\"\",\"\",VLOOKUP(C17,Magacin!$B$3:$H49989,7,TRUE))","v":""},{"$error":"#VALUE!"}]
["",null,{"$f":"IF(B18=\"\",\"\",VLOOKUP(B18,Magacin!$A$3:$H$49985,2,FALSE))","v":""},null,{"$f":"IF(C18=\"\",\"\",VLOOKUP(C18,Magacin!$B$3:$H49990,5,FALSE))","v":""},{"$error":"#VALUE!"},{"$f":"IF(C18=\"\",\"\",VLOOKUP(C18,Magacin!$B$3:$H49990,6,FALSE))","v":""},{"$error":"#VALUE!"},{"$f":"IF(C18=\"\",\"\",VLOOKUP(C18,Magacin!$B$3:$H49990,7,TRUE))","v":""},{"$error":"#VALUE!"}]
["",null,{"$f":"IF(B19=\"\",\"\",VLOOKUP(B19,Magacin!$A$3:$H$49985,2,FALSE))","v":""},null,{"$f":"IF(C19=\"\",\"\",VLOOKUP(C19,Magacin!$B$3:$H49991,5,FALSE))","v":""},{"$error":"#VALUE!"},{"$f":"IF(C19=\"\",\"\",VLOOKUP(C19,Magacin!$B$3:$H49991,6,FALSE))","v":""},{"$error":"#VALUE!"},{"$f":"IF(C19=\"\",\"\",VLOOKUP(C19,Magacin!$B$3:$H49991,7,TRUE))","v":""},{"$error":"#VALUE!"}]