{"text_format":"1","workbook":"xlsx","n_sheets":4,"sheets":["Magacin","Firme","Fakture","Otpremnice"],"not_rendered":{"charts":0,"images":0,"macros":1,"external_links":0,"defined_names":0,"comments":0,"pivot_tables":0},"unopened":[],"bounds":{"document_bytes":16777216,"sheet_cells":100000,"rows_first":2000,"rows_last":500,"rows_between":2000,"halvings":0,"cell_chars":16384,"cell_head_chars":4096},"cells_cut":0,"cells_raw":0,"read":"whole","date_system":"1900"}

{"sheet":"Magacin","index":0,"n_rows":6,"n_cols":10,"rows_kept":6,"cut":false,"hidden":false,"merged":[[0,0,0,7]]}
["ARTIKLI"]
["ŠIFRA","NAZIV ARTIKLA","J.M.","KOLIČINA","VP CIJENA sa pdv","nabavna cijena","vp cijena","mp cijena",null,"Izdato"]
[11,"Artikal 1 - 25kg","kg",150,0.48599999999999999,0.48599999999999999,0.91,1.4,null,{"$f":"D3-Fakture!E18","v":100}]
[22,"Artikal 2 - 15kg","kg",250,0.39900000000000002,0.39900000000000002,0.92800000000000005,1.2,null,{"$f":"D4-Fakture!E19","v":150}]
[33,"Artikal 3 - 15kg","kg",150,1.119,1.119,2.1419999999999999,2.8,null,{"$f":"D5-Fakture!E23","v":150}]
[44,"Artikal 4 - 12kg","kg",10,1.111,1.111,2.0699999999999998,2.6,null,{"$f":"D6-Fakture!E24","v":10}]

{"sheet":"Firme","index":1,"n_rows":15,"n_cols":5,"rows_kept":15,"cut":false,"hidden":false,"merged":[[0,0,0,4]]}
["KUPCI"]
["ŠIFRA","NAZIV","ADRESA","PIB","PDV"]
[1,"Firma 1","Adresa 1",11,111]
[2,"Firma 2","Adresa 2",22,222]
[3,"Firma 3","Adresa 3",33,333]
[4,"Firma 4","Adresa 4",44,444]
[5,"Firma 5","Adresa 5",55,555]
[6,"Firma 6","Adresa 6",66,666]
[7,"Firma 7","Adresa 7",77,777]
[8,"Firma 8","Adresa 8",88,888]
[9,"Firma 9","Adresa 9",99,999]
[10,"Firma 10","Adresa 10",110,1110]
[11,"Firma 11","Adresa 11",121,1221]
[12,"Firma 12","Adresa 12",132,1332]
[13,"Firma 13","Adresa 13",143,1443]

{"sheet":"Fakture","index":2,"n_rows":2350,"n_cols":13,"rows_kept":2350,"cut":false,"hidden":false,"merged":[[1,8,6,11],[14,4,14,6],[2,2,2,3],[3,2,3,3],[4,2,4,3],[8,3,8,4]]}
[]
[]
[]
[]
[]
[]
[]
[]
[null,"RAČUN BR.",null,null,null,null,null,null,"KUPAC (ID):",8]
[null,null,null,null,null,null,null,null,"Naziv kupca:",{"$f":"IF(J9=\"\",\"\",VLOOKUP(J9,Firme!A3:E50000,2,FALSE))","v":"Firma 8"}]
[null,"Datum:",null,null,null,null,null,null,"Adresa:",{"$f":"IF(J9=\"\",\"\",VLOOKUP(J9,Firme!A3:E50000,3,FALSE))","v":"Adresa 8"}]
[null,null,null,null,null,null,null,null,"PIB",{"$f":"IF(J9=\"\",\"\",VLOOKUP(J9,Firme!A3:E50000,4,FALSE))","v":88}]
[null,null,null,null,null,null,null,null,"PDV:",{"$f":"IF(J9=\"\",\"\",VLOOKUP(J9,Firme!A3:E50000,5,FALSE))","v":888}]
[]
[]
[]
["R.br","Šifra","Naziv artikla","J.M","Kol","Cijena\nbez\nPDV","Vrijednost\nbez\nPDV","Rabat %","Iznos\nrabata","Vrijednost\nbez PDV-a\nsa rabatom","PDV%","Cijena sa\nPDV","Vrijednost"]
[1,11,{"$f":"IF(B18=\"\",\"\",VLOOKUP(B18,Magacin!$A$3:$E$48683,2,FALSE))","v":"Artikal 1 - 25kg"},{"$f":"IF(C18=\"\",\"\",VLOOKUP(C18,Magacin!$B$3:$H$48683,2,FALSE))","v":"kg"},50,{"$f":"IF(C18=\"\",\"\",VLOOKUP(C18,Magacin!$B$3:$H$48683,4,FALSE))-21%","v":0.27600000000000002},{"$f":"IF(B18<>\"\",E18*F18,\"\")","v":13.8},0,{"$f":"IF(B18<>\"\",G18*H18,\"\")","v":0},{"$f":"IF(B18<>\"\",G18-I18,\"\")","v":13.8},{"$f":"IF(B18<>\"\",21%,\"\")","v":0.21},{"$f":"IF(B18=\"\",\"\",VLOOKUP(B18,Magacin!$A$3:$E$48683,5,FALSE))","v":0.48599999999999999},{"$f":"IF(B18<>\"\",L18*E18,\"\")","v":24.3}]
[{"$f":"IF(B19=\"\",\"\",A18+1)","v":2},33,{"$f":"IF(B19=\"\",\"\",VLOOKUP(B19,Magacin!$A$3:$E$48683,2,FALSE))","v":"Artikal 3 - 15kg"},{"$f":"IF(C19=\"\",\"\",VLOOKUP(C19,Magacin!$B$3:$H$48683,2,FALSE))","v":"kg"},100,{"$f":"IF(C19=\"\",\"\",VLOOKUP(C19,Magacin!$B$3:$H$48683,4,FALSE))-21%","v":0.90900000000000003},90.9,0,{"$f":"IF(B19<>\"\",G19*H19,\"\")","v":0},{"$f":"IF(B19<>\"\",G19-I19,\"\")","v":90.9},0.21,{"$f":"IF(B19=\"\",\"\",VLOOKUP(B19,Magacin!$A$3:$E$48683,5,FALSE))","v":1.119},{"$f":"IF(B19<>\"\",L19*E19,\"\")","v":111.9}]
[{"$f":"IF(B20=\"\",\"\",A16+1)","v":""},null,{"$f":"IF(B20=\"\",\"\",VLOOKUP(B20,Magacin!$A$3:$E$48683,2,FALSE))","v":""},{"$f":"IF(C20=\"\",\"\",VLOOKUP(C20,Magacin!$B$3:$H$48683,2,FALSE))","v":""},null,{"$f":"IF(B20<>\"\",VLOOKUP(C20,Magacin!$B$3:$H$48683,4,FALSE)*(1-0.21),\"\")","v":""},"",0,{"$f":"IF(B20<>\"\",G20*H20,\"\")","v":""},{"$f":"IF(B20<>\"\",G20-I20,\"\")","v":""},"",{"$f":"IF(B20=\"\",\"\",VLOOKUP(B20,Magacin!$A$3:$E$48683,5,FALSE))","v":""},{"$f":"IF(B20<>\"\",L20*E20,\"\")","v":""}]
["",null,{"$f":"IF(B21=\"\",\"\",VLOOKUP(B21,Magacin!$A$3:$E$48683,2,FALSE))","v":""},{"$f":"IF(C21=\"\",\"\",VLOOKUP(C21,Magacin!$B$3:$H$48683,2,FALSE))","v":""},null,{"$f":"IF(B21<>\"\",VLOOKUP(C21,Magacin!$B$3:$H$48683,4,FALSE)*(1-0.21),\"\")","v":""},"",0,"","","",{"$f":"IF(B21=\"\",\"\",VLOOKUP(B21,Magacin!$A$3:$E$48683,5,FALSE))","v":""},""]
["",null,{"$f":"IF(B22=\"\",\"\",VLOOKUP(B22,Magacin!$A$3:$E$48683,2,FALSE))","v":""},{"$f":"IF(C22=\"\",\"\",VLOOKUP(C22,Magacin!$B$3:$H$48683,2,FALSE))","v":""},null,{"$f":"IF(B22<>\"\",VLOOKUP(C22,Magacin!$B$3:$H$48683,4,FALSE)*(1-0.21),\"\")","v":""},"",0,"","","",{"$f":"IF(B22=\"\",\"\",VLOOKUP(B22,Magacin!$A$3:$E$48683,5,FALSE))","v":""},""]
[{"$f":"IF(B23=\"\",\"\",A19+1)","v":""},null,{"$f":"IF(B23=\"\",\"\",VLOOKUP(B23,Magacin!$A$3:$E$48683,2,FALSE))","v":""},{"$f":"IF(C23=\"\",\"\",VLOOKUP(C23,Magacin!$B$3:$H$48683,2,FALSE))","v":""},null,{"$f":"IF(B23<>\"\",VLOOKUP(C23,Magacin!$B$3:$H$48683,4,FALSE)*(1-0.21),\"\")","v":""},{"$f":"IF(B23<>\"\",E23*F23,\"\")","v":""},0,{"$f":"IF(B23<>\"\",G23*H23,\"\")","v":""},{"$f":"IF(B23<>\"\",G23-I23,\"\")","v":""},{"$f":"IF(B23<>\"\",21%,\"\")","v":""},{"$f":"IF(B23=\"\",\"\",VLOOKUP(B23,Magacin!$A$3:$E$48683,5,FALSE))","v":""},{"$f":"IF(B23<>\"\",L23*E23,\"\")","v":""}]
[{"$f":"IF(B24=\"\",\"\",A23+1)","v":""},null,{"$f":"IF(B24=\"\",\"\",VLOOKUP(B24,Magacin!$A$3:$E$48683,2,FALSE))","v":""},{"$f":"IF(C24=\"\",\"\",VLOOKUP(C24,Magacin!$B$3:$H$48683,2,FALSE))","v":""},null,{"$f":"IF(B24<>\"\",VLOOKUP(C24,Magacin!$B$3:$H$48683,4,FALSE)*(1-0.21),\"\")","v":""},"",0,{"$f":"IF(B24<>\"\",G24*H24,\"\")","v":""},{"$f":"IF(B24<>\"\",G24-I24,\"\")","v":""},"",{"$f":"IF(B24=\"\",\"\",VLOOKUP(B24,Magacin!$A$3:$E$48683,5,FALSE))","v":""},""]
[null,null,{"$f":"IF(B25=\"\",\"\",VLOOKUP(B25,Magacin!A7:E3726,2,FALSE))","v":""},{"$f":"IF(C25=\"\",\"\",VLOOKUP(C25,Magacin!B7:H3727,2,FALSE))","v":""},null,{"$f":"IF(E25=\"\",\"\",VLOOKUP(E25,Magacin!D7:H3727,2,FALSE))","v":""},null,null,null,null,null,"UKUPNO:",{"$f":"SUM(M18:M24)","v":136.20000000000002}]
[null,null,{"$f":"IF(B26=\"\",\"\",VLOOKUP(B26,Magacin!A7:E3727,2,FALSE))","v":""},{"$f":"IF(C26=\"\",\"\",VLOOKUP(C26,Magacin!B7:H3728,2,FALSE))","v":""},null,{"$f":"IF(E26=\"\",\"\",VLOOKUP(E26,Magacin!D7:H3728,2,FALSE))","v":""}]
[null,null,{"$f":"IF(B27=\"\",\"\",VLOOKUP(B27,Magacin!A7:E3728,2,FALSE))","v":""},{"$f":"IF(C27=\"\",\"\",VLOOKUP(C27,Magacin!B7:H3729,2,FALSE))","v":""},null,{"$f":"IF(E27=\"\",\"\",VLOOKUP(E27,Magacin!D7:H3729,2,FALSE))","v":""}]
[null,null,{"$f":"IF(B28=\"\",\"\",VLOOKUP(B28,Magacin!A7:E3729,2,FALSE))","v":""},{"$f":"IF(C28=\"\",\"\",VLOOKUP(C28,Magacin!B7:H3730,2,FALSE))","v":""},null,{"$f":"IF(E28=\"\",\"\",VLOOKUP(E28,Magacin!D7:H3730,2,FALSE))","v":""}]
[null,null,{"$f":"IF(B29=\"\",\"\",VLOOKUP(B29,Magacin!A7:E3730,2,FALSE))","v":""},{"$f":"IF(C29=\"\",\"\",VLOOKUP(C29,Magacin!B7:H3731,2,FALSE))","v":""},null,{"$f":"IF(E29=\"\",\"\",VLOOKUP(E29,Magacin!D7:H3731,2,FALSE))","v":""}]
[null,null,{"$f":"IF(B30=\"\",\"\",VLOOKUP(B30,Magacin!A7:E3731,2,FALSE))","v":""},{"$f":"IF(C30=\"\",\"\",VLOOKUP(C30,Magacin!B7:H3732,2,FALSE))","v":""},null,{"$f":"IF(E30=\"\",\"\",VLOOKUP(E30,Magacin!D7:H3732,2,FALSE))","v":""}]
[null,null,{"$f":"IF(B31=\"\",\"\",VLOOKUP(B31,Magacin!A7:E3732,2,FALSE))","v":""},{"$f":"IF(C31=\"\",\"\",VLOOKUP(C31,Magacin!B7:H3733,2,FALSE))","v":""},null,{"$f":"IF(E31=\"\",\"\",VLOOKUP(E31,Magacin!D7:H3733,2,FALSE))","v":""}]
[null,null,{"$f":"IF(B32=\"\",\"\",VLOOKUP(B32,Magacin!A7:E3733,2,FALSE))","v":""},{"$f":"IF(C32=\"\",\"\",VLOOKUP(C32,Magacin!B7:H3734,2,FALSE))","v":""},null,{"$f":"IF(E32=\"\",\"\",VLOOKUP(E32,Magacin!D7:H3734,2,FALSE))","v":""}]
[null,null,{"$f":"IF(B33=\"\",\"\",VLOOKUP(B33,Magacin!A7:E3734,2,FALSE))","v":""},{"$f":"IF(C33=\"\",\"\",VLOOKUP(C33,Magacin!B7:H3735,2,FALSE))","v":""},null,{"$f":"IF(E33=\"\",\"\",VLOOKUP(E33,Magacin!D7:H3735,2,FALSE))","v":""}]
[null,null,{"$f":"IF(B34=\"\",\"\",VLOOKUP(B34,Magacin!A7:E3735,2,FALSE))","v":""},{"$f":"IF(C34=\"\",\"\",VLOOKUP(C34,Magacin!B7:H3736,2,FALSE))","v":""},null,{"$f":"IF(E34=\"\",\"\",VLOOKUP(E34,Magacin!D7:H3736,2,FALSE))","v":""}]
[null,null,{"$f":"IF(B35=\"\",\"\",VLOOKUP(B35,Magacin!A7:E3736,2,FALSE))","v":""},{"$f":"IF(C35=\"\",\"\",VLOOKUP(C35,Magacin!B7:H3737,2,FALSE))","v":""},null,{"$f":"IF(E35=\"\",\"\",VLOOKUP(E35,Magacin!D7:H3737,2,FALSE))","v":""}]
[null,null,{"$f":"IF(B36=\"\",\"\",VLOOKUP(B36,Magacin!A7:E3737,2,FALSE))","v":""},{"$f":"IF(C36=\"\",\"\",VLOOKUP(C36,Magacin!B7:H3738,2,FALSE))","v":""},null,{"$f":"IF(E36=\"\",\"\",VLOOKUP(E36,Magacin!D7:H3738,2,FALSE))","v":""}]
[null,null,{"$f":"IF(B37=\"\",\"\",VLOOKUP(B37,Magacin!A7:E3738,2,FALSE))","v":""},{"$f":"IF(C37=\"\",\"\",VLOOKUP(C37,Magacin!B7:H3739,2,FALSE))","v":""},null,{"$f":"IF(E37=\"\",\"\",VLOOKUP(E37,Magacin!D7:H3739,2,FALSE))","v":""}]
[null,null,{"$f":"IF(B38=\"\",\"\",VLOOKUP(B38,Magacin!A7:E3739,2,FALSE))","v":""},{"$f":"IF(C38=\"\",\"\",VLOOKUP(C38,Magacin!B7:H3740,2,FALSE))","v":""},null,{"$f":"IF(E38=\"\",\"\",VLOOKUP(E38,Magacin!D7:H3740,2,FALSE))","v":""}]
[null,null,{"$f":"IF(B39=\"\",\"\",VLOOKUP(B39,Magacin!A7:E3740,2,FALSE))","v":""},{"$f":"IF(C39=\"\",\"\",VLOOKUP(C39,Magacin!B7:H3741,2,FALSE))","v":""},null,{"$f":"IF(E39=\"\",\"\",VLOOKUP(E39,Magacin!D7:H3741,2,FALSE))","v":""}]
[null,null,{"$f":"IF(B40=\"\",\"\",VLOOKUP(B40,Magacin!A7:E3792,2,FALSE))","v":""}]
[null,null,{"$f":"IF(B41=\"\",\"\",VLOOKUP(B41,Magacin!A7:E3793,2,FALSE))","v":""}]
[null,null,{"$f":"IF(B42=\"\",\"\",VLOOKUP(B42,Magacin!A7:E3794,2,FALSE))","v":""}]
[null,null,{"$f":"IF(B43=\"\",\"\",VLOOKUP(B43,Magacin!A7:E3795,2,FALSE))","v":""}]
[null,null,{"$f":"IF(B44=\"\",\"\",VLOOKUP(B44,Magacin!A7:E3796,2,FALSE))","v":""}]
[null,null,{"$f":"IF(B45=\"\",\"\",VLOOKUP(B45,Magacin!A7:E3797,2,FALSE))","v":""}]
[null,null,{"$f":"IF(B46=\"\",\"\",VLOOKUP(B46,Magacin!A7:E3798,2,FALSE))","v":""}]
[null,null,{"$f":"IF(B47=\"\",\"\",VLOOKUP(B47,Magacin!A7:E3799,2,FALSE))","v":""}]
[null,null,{"$f":"IF(B48=\"\",\"\",VLOOKUP(B48,Magacin!A7:E3800,2,FALSE))","v":""}]
[null,null,{"$f":"IF(B49=\"\",\"\",VLOOKUP(B49,Magacin!A7:E3801,2,FALSE))","v":""}]
[null,null,{"$f":"IF(B50=\"\",\"\",VLOOKUP(B50,Magacin!A7:E3802,2,FALSE))","v":""}]
[null,null,{"$f":"IF(B51=\"\",\"\",VLOOKUP(B51,Magacin!A7:E3803,2,FALSE))","v":""}]
[null,null,{"$f":"IF(B52=\"\",\"\",VLOOKUP(B52,Magacin!A7:E3804,2,FALSE))","v":""}]
[null,null,{"$f":"IF(B53=\"\",\"\",VLOOKUP(B53,Magacin!A7:E3805,2,FALSE))","v":""}]
[null,null,{"$f":"IF(B54=\"\",\"\",VLOOKUP(B54,Magacin!A7:E3806,2,FALSE))","v":""}]
[null,null,{"$f":"IF(B55=\"\",\"\",VLOOKUP(B55,Magacin!A7:E3807,2,FALSE))","v":""}]
[null,null,{"$f":"IF(B56=\"\",\"\",VLOOKUP(B56,Magacin!A7:E3808,2,FALSE))","v":""}]
[null,null,{"$f":"IF(B57=\"\",\"\",VLOOKUP(B57,Magacin!A7:E3809,2,FALSE))","v":""}]
[null,null,{"$f":"IF(B58=\"\",\"\",VLOOKUP(B58,Magacin!A7:E3810,2,FALSE))","v":""}]
[null,null,{"$f":"IF(B59=\"\",\"\",VLOOKUP(B59,Magacin!A7:E3811,2,FALSE))","v":""}]
[null,null,{"$f":"IF(B60=\"\",\"\",VLOOKUP(B60,Magacin!A7:E3812,2,FALSE))","v":""}]
[null,null,{"$f":"IF(B61=\"\",\"\",VLOOKUP(B61,Magacin!A7:E3813,2,FALSE))","v":""}]
[null,null,{"$f":"IF(B62=\"\",\"\",VLOOKUP(B62,Magacin!A7:E3814,2,FALSE))","v":""}]
[null,null,{"$f":"IF(B63=\"\",\"\",VLOOKUP(B63,Magacin!A7:E3815,2,FALSE))","v":""}]
[null,null,{"$f":"IF(B64=\"\",\"\",VLOOKUP(B64,Magacin!A7:E3816,2,FALSE))","v":""}]
[null,null,{"$f":"IF(B65=\"\",\"\",VLOOKUP(B65,Magacin!A7:E3817,2,FALSE))","v":""}]
[null,null,{"$f":"IF(B66=\"\",\"\",VLOOKUP(B66,Magacin!A7:E3818,2,FALSE))","v":""}]
[null,null,{"$f":"IF(B67=\"\",\"\",VLOOKUP(B67,Magacin!A7:E3819,2,FALSE))","v":""}]
[null,null,{"$f":"IF(B68=\"\",\"\",VLOOKUP(B68,Magacin!A7:E3820,2,FALSE))","v":""}]
[null,null,{"$f":"IF(B69=\"\",\"\",VLOOKUP(B69,Magacin!A7:E3821,2,FALSE))","v":""}]
[null,null,{"$f":"IF(B70=\"\",\"\",VLOOKUP(B70,Magacin!A7:E3822,2,FALSE))","v":""}]
[null,null,{"$f":"IF(B71=\"\",\"\",VLOOKUP(B71,Magacin!A7:E3823,2,FALSE))","v":""}]
[null,null,{"$f":"IF(B72=\"\",\"\",VLOOKUP(B72,Magacin!A7:E3824,2,FALSE))","v":""}]
[null,null,{"$f":"IF(B73=\"\",\"\",VLOOKUP(B73,Magacin!A7:E3825,2,FALSE))","v":""}]
[null,null,{"$f":"IF(B74=\"\",\"\",VLOOKUP(B74,Magacin!A7:E3826,2,FALSE))","v":""}]
[null,null,{"$f":"IF(B75=\"\",\"\",VLOOKUP(B75,Magacin!A7:E3827,2,FALSE))","v":""}]
[null,null,{"$f":"IF(B76=\"\",\"\",VLOOKUP(B76,Magacin!A7:E3828,2,FALSE))","v":""}]
[null,null,{"$f":"IF(B77=\"\",\"\",VLOOKUP(B77,Magacin!A7:E3829,2,FALSE))","v":""}]
[null,null,{"$f":"IF(B78=\"\",\"\",VLOOKUP(B78,Magacin!A7:E3830,2,FALSE))","v":""}]
[null,null,{"$f":"IF(B79=\"\",\"\",VLOOKUP(B79,Magacin!A7:E3831,2,FALSE))","v":""}]
[null,null,{"$f":"IF(B80=\"\",\"\",VLOOKUP(B80,Magacin!A7:E3832,2,FALSE))","v":""}]
[null,null,{"$f":"IF(B81=\"\",\"\",VLOOKUP(B81,Magacin!A7:E3833,2,FALSE))","v":""}]
[null,null,{"$f":"IF(B82=\"\",\"\",VLOOKUP(B82,Magacin!A7:E3834,2,FALSE))","v":""}]
[null,null,{"$f":"IF(B83=\"\",\"\",VLOOKUP(B83,Magacin!A7:E3835,2,FALSE))","v":""}]
[null,null,{"$f":"IF(B84=\"\",\"\",VLOOKUP(B84,Magacin!A7:E3836,2,FALSE))","v":""}]
[null,null,{"$f":"IF(B85=\"\",\"\",VLOOKUP(B85,Magacin!A7:E3837,2,FALSE))","v":""}]
[null,null,{"$f":"IF(B86=\"\",\"\",VLOOKUP(B86,Magacin!A7:E3838,2,FALSE))","v":""}]
[null,null,{"$f":"IF(B87=\"\",\"\",VLOOKUP(B87,Magacin!A7:E3839,2,FALSE))","v":""}]
[null,null,{"$f":"IF(B88=\"\",\"\",VLOOKUP(B88,Magacin!A7:E3840,2,FALSE))","v":""}]
[null,null,{"$f":"IF(B89=\"\",\"\",VLOOKUP(B89,Magacin!A7:E3841,2,FALSE))","v":""}]
[null,null,{"$f":"IF(B90=\"\",\"\",VLOOKUP(B90,Magacin!A7:E3842,2,FALSE))","v":""}]
[null,null,{"$f":"IF(B91=\"\",\"\",VLOOKUP(B91,Magacin!A7:E3843,2,FALSE))","v":""}]
[null,null,{"$f":"IF(B92=\"\",\"\",VLOOKUP(B92,Magacin!A7:E3844,2,FALSE))","v":""}]
[null,null,{"$f":"IF(B93=\"\",\"\",VLOOKUP(B93,Magacin!A7:E3845,2,FALSE))","v":""}]
[null,null,{"$f":"IF(B94=\"\",\"\",VLOOKUP(B94,Magacin!A7:E3846,2,FALSE))","v":""}]
[null,null,{"$f":"IF(B95=\"\",\"\",VLOOKUP(B95,Magacin!A7:E3847,2,FALSE))","v":""}]
[null,null,{"$f":"IF(B96=\"\",\"\",VLOOKUP(B96,Magacin!A7:E3848,2,FALSE))","v":""}]
[null,null,{"$f":"IF(B97=\"\",\"\",VLOOKUP(B97,Magacin!A7:E3849,2,FALSE))","v":""}]
[null,null,{"$f":"IF(B98=\"\",\"\",VLOOKUP(B98,Magacin!A7:E3850,2,FALSE))","v":""}]
[null,null,{"$f":"IF(B99=\"\",\"\",VLOOKUP(B99,Magacin!A7:E3851,2,FALSE))","v":""}]
[null,null,{"$f":"IF(B100=\"\",\"\",VLOOKUP(B100,Magacin!A7:E3852,2,FALSE))","v":""}]
[null,null,{"$f":"IF(B101=\"\",\"\",VLOOKUP(B101,Magacin!A7:E3853,2,FALSE))","v":""}]
[null,null,{"$f":"IF(B102=\"\",\"\",VLOOKUP(B102,Magacin!A7:E3854,2,FALSE))","v":""}]
[null,null,{"$f":"IF(B103=\"\",\"\",VLOOKUP(B103,Magacin!A7:E3855,2,FALSE))","v":""}]
[null,null,{"$f":"IF(B104=\"\",\"\",VLOOKUP(B104,Magacin!A7:E3856,2,FALSE))","v":""}]
[null,null,{"$f":"IF(B105=\"\",\"\",VLOOKUP(B105,Magacin!A7:E3857,2,FALSE))","v":""}]
[null,null,{"$f":"IF(B106=\"\",\"\",VLOOKUP(B106,Magacin!A7:E3858,2,FALSE))","v":""}]
[null,null,{"$f":"IF(B107=\"\",\"\",VLOOKUP(B107,Magacin!A7:E3859,2,FALSE))","v":""}]
[null,null,{"$f":"IF(B108=\"\",\"\",VLOOKUP(B108,Magacin!A7:E3860,2,FALSE))","v":""}]
[null,null,{"$f":"IF(B109=\"\",\"\",VLOOKUP(B109,Magacin!A7:E3861,2,FALSE))","v":""}]
[null,null,{"$f":"IF(B110=\"\",\"\",VLOOKUP(B110,Magacin!A7:E3862,2,FALSE))","v":""}]
[null,null,{"$f":"IF(B111=\"\",\"\",VLOOKUP(B111,Magacin!A7:E3863,2,FALSE))","v":""}]
[null,null,{"$f":"IF(B112=\"\",\"\",VLOOKUP(B112,Magacin!A7:E3864,2,FALSE))","v":""}]
[null,null,{"$f":"IF(B113=\"\",\"\",VLOOKUP(B113,Magacin!A7:E3865,2,FALSE))","v":""}]
[null,null,{"$f":"IF(B114=\"\",\"\",VLOOKUP(B114,Magacin!A7:E3866,2,FALSE))","v":""}]
[null,null,{"$f":"IF(B115=\"\",\"\",VLOOKUP(B115,Magacin!A7:E3867,2,FALSE))","v":""}]
[null,null,{"$f":"IF(B116=\"\",\"\",VLOOKUP(B116,Magacin!A7:E3868,2,FALSE))","v":""}]
[null,null,{"$f":"IF(B117=\"\",\"\",VLOOKUP(B117,Magacin!A7:E3869,2,FALSE))","v":""}]
[null,null,{"$f":"IF(B118=\"\",\"\",VLOOKUP(B118,Magacin!A7:E3870,2,FALSE))","v":""}]
[null,null,{"$f":"IF(B119=\"\",\"\",VLOOKUP(B119,Magacin!A7:E3871,2,FALSE))","v":""}]
[null,null,{"$f":"IF(B120=\"\",\"\",VLOOKUP(B120,Magacin!A7:E3872,2,FALSE))","v":""}]
[null,null,{"$f":"IF(B121=\"\",\"\",VLOOKUP(B121,Magacin!A7:E3873,2,FALSE))","v":""}]
[null,null,{"$f":"IF(B122=\"\",\"\",VLOOKUP(B122,Magacin!A7:E3874,2,FALSE))","v":""}]
[null,null,{"$f":"IF(B123=\"\",\"\",VLOOKUP(B123,Magacin!A7:E3875,2,FALSE))","v":""}]
[null,null,{"$f":"IF(B124=\"\",\"\",VLOOKUP(B124,Magacin!A7:E3876,2,FALSE))","v":""}]
[null,null,{"$f":"IF(B125=\"\",\"\",VLOOKUP(B125,Magacin!A7:E3877,2,FALSE))","v":""}]
[null,null,{"$f":"IF(B126=\"\",\"\",VLOOKUP(B126,Magacin!A7:E3878,2,FALSE))","v":""}]
[null,null,{"$f":"IF(B127=\"\",\"\",VLOOKUP(B127,Magacin!A7:E3879,2,FALSE))","v":""}]
[null,null,{"$f":"IF(B128=\"\",\"\",VLOOKUP(B128,Magacin!A7:E3880,2,FALSE))","v":""}]
[null,null,{"$f":"IF(B129=\"\",\"\",VLOOKUP(B129,Magacin!A7:E3881,2,FALSE))","v":""}]
[null,null,{"$f":"IF(B130=\"\",\"\",VLOOKUP(B130,Magacin!A7:E3882,2,FALSE))","v":""}]
[null,null,{"$f":"IF(B131=\"\",\"\",VLOOKUP(B131,Magacin!A7:E3883,2,FALSE))","v":""}]
[null,null,{"$f":"IF(B132=\"\",\"\",VLOOKUP(B132,Magacin!A7:E3884,2,FALSE))","v":""}]
[null,null,{"$f":"IF(B133=\"\",\"\",VLOOKUP(B133,Magacin!A7:E3885,2,FALSE))","v":""}]
[null,null,{"$f":"IF(B134=\"\",\"\",VLOOKUP(B134,Magacin!A7:E3886,2,FALSE))","v":""}]
[null,null,{"$f":"IF(B135=\"\",\"\",VLOOKUP(B135,Magacin!A7:E3887,2,FALSE))","v":""}]
[null,null,{"$f":"IF(B136=\"\",\"\",VLOOKUP(B136,Magacin!A7:E3888,2,FALSE))","v":""}]
[null,null,{"$f":"IF(B137=\"\",\"\",VLOOKUP(B137,Magacin!A7:E3889,2,FALSE))","v":""}]
[null,null,{"$f":"IF(B138=\"\",\"\",VLOOKUP(B138,Magacin!A7:E3890,2,FALSE))","v":""}]
[null,null,{"$f":"IF(B139=\"\",\"\",VLOOKUP(B139,Magacin!A7:E3891,2,FALSE))","v":""}]
[null,null,{"$f":"IF(B140=\"\",\"\",VLOOKUP(B140,Magacin!A7:E3892,2,FALSE))","v":""}]
[null,null,{"$f":"IF(B141=\"\",\"\",VLOOKUP(B141,Magacin!A7:E3893,2,FALSE))","v":""}]
[null,null,{"$f":"IF(B142=\"\",\"\",VLOOKUP(B142,Magacin!A7:E3894,2,FALSE))","v":""}]
[null,null,{"$f":"IF(B143=\"\",\"\",VLOOKUP(B143,Magacin!A7:E3895,2,FALSE))","v":""}]
[null,null,{"$f":"IF(B144=\"\",\"\",VLOOKUP(B144,Magacin!A7:E3896,2,FALSE))","v":""}]
[null,null,{"$f":"IF(B145=\"\",\"\",VLOOKUP(B145,Magacin!A7:E3897,2,FALSE))","v":""}]
[null,null,{"$f":"IF(B146=\"\",\"\",VLOOKUP(B146,Magacin!A7:E3898,2,FALSE))","v":""}]
[null,null,{"$f":"IF(B147=\"\",\"\",VLOOKUP(B147,Magacin!A7:E3899,2,FALSE))","v":""}]
[null,null,{"$f":"IF(B148=\"\",\"\",VLOOKUP(B148,Magacin!A7:E3900,2,FALSE))","v":""}]
[null,null,{"$f":"IF(B149=\"\",\"\",VLOOKUP(B149,Magacin!A7:E3901,2,FALSE))","v":""}]
[null,null,{"$f":"IF(B150=\"\",\"\",VLOOKUP(B150,Magacin!A7:E3902,2,FALSE))","v":""}]
[null,null,{"$f":"IF(B151=\"\",\"\",VLOOKUP(B151,Magacin!A7:E3903,2,FALSE))","v":""}]
[null,null,{"$f":"IF(B152=\"\",\"\",VLOOKUP(B152,Magacin!A7:E3904,2,FALSE))","v":""}]
[null,null,{"$f":"IF(B153=\"\",\"\",VLOOKUP(B153,Magacin!A7:E3905,2,FALSE))","v":""}]
[null,null,{"$f":"IF(B154=\"\",\"\",VLOOKUP(B154,Magacin!A7:E3906,2,FALSE))","v":""}]
[null,null,{"$f":"IF(B155=\"\",\"\",VLOOKUP(B155,Magacin!A7:E3907,2,FALSE))","v":""}]
[null,null,{"$f":"IF(B156=\"\",\"\",VLOOKUP(B156,Magacin!A7:E3908,2,FALSE))","v":""}]
[null,null,{"$f":"IF(B157=\"\",\"\",VLOOKUP(B157,Magacin!A7:E3909,2,FALSE))","v":""}]
[null,null,{"$f":"IF(B158=\"\",\"\",VLOOKUP(B158,Magacin!A7:E3910,2,FALSE))","v":""}]
[null,null,{"$f":"IF(B159=\"\",\"\",VLOOKUP(B159,Magacin!A7:E3911,2,FALSE))","v":""}]
[null,null,{"$f":"IF(B160=\"\",\"\",VLOOKUP(B160,Magacin!A7:E3912,2,FALSE))","v":""}]
[null,null,{"$f":"IF(B161=\"\",\"\",VLOOKUP(B161,Magacin!A7:E3913,2,FALSE))","v":""}]
[null,null,{"$f":"IF(B162=\"\",\"\",VLOOKUP(B162,Magacin!A7:E3914,2,FALSE))","v":""}]
[null,null,{"$f":"IF(B163=\"\",\"\",VLOOKUP(B163,Magacin!A7:E3915,2,FALSE))","v":""}]
[null,null,{"$f":"IF(B164=\"\",\"\",VLOOKUP(B164,Magacin!A7:E3916,2,FALSE))","v":""}]
[null,null,{"$f":"IF(B165=\"\",\"\",VLOOKUP(B165,Magacin!A7:E3917,2,FALSE))","v":""}]
[null,null,{"$f":"IF(B166=\"\",\"\",VLOOKUP(B166,Magacin!A7:E3918,2,FALSE))","v":""}]
[null,null,{"$f":"IF(B167=\"\",\"\",VLOOKUP(B167,Magacin!A7:E3919,2,FALSE))","v":""}]
[null,null,{"$f":"IF(B168=\"\",\"\",VLOOKUP(B168,Magacin!A7:E3920,2,FALSE))","v":""}]
[null,null,{"$f":"IF(B169=\"\",\"\",VLOOKUP(B169,Magacin!A7:E3921,2,FALSE))","v":""}]
[null,null,{"$f":"IF(B170=\"\",\"\",VLOOKUP(B170,Magacin!A7:E3922,2,FALSE))","v":""}]
[null,null,{"$f":"IF(B171=\"\",\"\",VLOOKUP(B171,Magacin!A7:E3923,2,FALSE))","v":""}]
[null,null,{"$f":"IF(B172=\"\",\"\",VLOOKUP(B172,Magacin!A7:E3924,2,FALSE))","v":""}]
[null,null,{"$f":"IF(B173=\"\",\"\",VLOOKUP(B173,Magacin!A7:E3925,2,FALSE))","v":""}]
[null,null,{"$f":"IF(B174=\"\",\"\",VLOOKUP(B174,Magacin!A7:E3926,2,FALSE))","v":""}]
[null,null,{"$f":"IF(B175=\"\",\"\",VLOOKUP(B175,Magacin!A7:E3927,2,FALSE))","v":""}]
[null,null,{"$f":"IF(B176=\"\",\"\",VLOOKUP(B176,Magacin!A7:E3928,2,FALSE))","v":""}]
[null,null,{"$f":"IF(B177=\"\",\"\",VLOOKUP(B177,Magacin!A7:E3929,2,FALSE))","v":""}]
[null,null,{"$f":"IF(B178=\"\",\"\",VLOOKUP(B178,Magacin!A7:E3930,2,FALSE))","v":""}]
[null,null,{"$f":"IF(B179=\"\",\"\",VLOOKUP(B179,Magacin!A7:E3931,2,FALSE))","v":""}]
[null,null,{"$f":"IF(B180=\"\",\"\",VLOOKUP(B180,Magacin!A7:E3932,2,FALSE))","v":""}]
[null,null,{"$f":"IF(B181=\"\",\"\",VLOOKUP(B181,Magacin!A7:E3933,2,FALSE))","v":""}]
[null,null,{"$f":"IF(B182=\"\",\"\",VLOOKUP(B182,Magacin!A7:E3934,2,FALSE))","v":""}]
[null,null,{"$f":"IF(B183=\"\",\"\",VLOOKUP(B183,Magacin!A7:E3935,2,FALSE))","v":""}]
[null,null,{"$f":"IF(B184=\"\",\"\",VLOOKUP(B184,Magacin!A7:E3936,2,FALSE))","v":""}]
[null,null,{"$f":"IF(B185=\"\",\"\",VLOOKUP(B185,Magacin!A7:E3937,2,FALSE))","v":""}]
[null,null,{"$f":"IF(B186=\"\",\"\",VLOOKUP(B186,Magacin!A7:E3938,2,FALSE))","v":""}]
[null,null,{"$f":"IF(B187=\"\",\"\",VLOOKUP(B187,Magacin!A7:E3939,2,FALSE))","v":""}]
[null,null,{"$f":"IF(B188=\"\",\"\",VLOOKUP(B188,Magacin!A7:E3940,2,FALSE))","v":""}]
[null,null,{"$f":"IF(B189=\"\",\"\",VLOOKUP(B189,Magacin!A7:E3941,2,FALSE))","v":""}]
[null,null,{"$f":"IF(B190=\"\",\"\",VLOOKUP(B190,Magacin!A7:E3942,2,FALSE))","v":""}]
[null,null,{"$f":"IF(B191=\"\",\"\",VLOOKUP(B191,Magacin!A7:E3943,2,FALSE))","v":""}]
[null,null,{"$f":"IF(B192=\"\",\"\",VLOOKUP(B192,Magacin!A7:E3944,2,FALSE))","v":""}]
[null,null,{"$f":"IF(B193=\"\",\"\",VLOOKUP(B193,Magacin!A7:E3945,2,FALSE))","v":""}]
[null,null,{"$f":"IF(B194=\"\",\"\",VLOOKUP(B194,Magacin!A7:E3946,2,FALSE))","v":""}]
[null,null,{"$f":"IF(B195=\"\",\"\",VLOOKUP(B195,Magacin!A7:E3947,2,FALSE))","v":""}]
[null,null,{"$f":"IF(B196=\"\",\"\",VLOOKUP(B196,Magacin!A7:E3948,2,FALSE))","v":""}]
[null,null,{"$f":"IF(B197=\"\",\"\",VLOOKUP(B197,Magacin!A7:E3949,2,FALSE))","v":""}]
[null,null,{"$f":"IF(B198=\"\",\"\",VLOOKUP(B198,Magacin!A7:E3950,2,FALSE))","v":""}]
[null,null,{"$f":"IF(B199=\"\",\"\",VLOOKUP(B199,Magacin!A7:E3951,2,FALSE))","v":""}]
[null,null,{"$f":"IF(B200=\"\",\"\",VLOOKUP(B200,Magacin!A7:E3952,2,FALSE))","v":""}]
[null,null,{"$f":"IF(B201=\"\",\"\",VLOOKUP(B201,Magacin!A7:E3953,2,FALSE))","v":""}]
[null,null,{"$f":"IF(B202=\"\",\"\",VLOOKUP(B202,Magacin!A7:E3954,2,FALSE))","v":""}]
[null,null,{"$f":"IF(B203=\"\",\"\",VLOOKUP(B203,Magacin!A7:E3955,2,FALSE))","v":""}]
[null,null,{"$f":"IF(B204=\"\",\"\",VLOOKUP(B204,Magacin!A7:E3956,2,FALSE))","v":""}]
[null,null,{"$f":"IF(B205=\"\",\"\",VLOOKUP(B205,Magacin!A7:E3957,2,FALSE))","v":""}]
[null,null,{"$f":"IF(B206=\"\",\"\",VLOOKUP(B206,Magacin!A7:E3958,2,FALSE))","v":""}]
[null,null,{"$f":"IF(B207=\"\",\"\",VLOOKUP(B207,Magacin!A7:E3959,2,FALSE))","v":""}]
[null,null,{"$f":"IF(B208=\"\",\"\",VLOOKUP(B208,Magacin!A7:E3960,2,FALSE))","v":""}]
[null,null,{"$f":"IF(B209=\"\",\"\",VLOOKUP(B209,Magacin!A7:E3961,2,FALSE))","v":""}]
[null,null,{"$f":"IF(B210=\"\",\"\",VLOOKUP(B210,Magacin!A7:E3962,2,FALSE))","v":""}]
[null,null,{"$f":"IF(B211=\"\",\"\",VLOOKUP(B211,Magacin!A7:E3963,2,FALSE))","v":""}]
[null,null,{"$f":"IF(B212=\"\",\"\",VLOOKUP(B212,Magacin!A7:E3964,2,FALSE))","v":""}]
[null,null,{"$f":"IF(B213=\"\",\"\",VLOOKUP(B213,Magacin!A7:E3965,2,FALSE))","v":""}]
[null,null,{"$f":"IF(B214=\"\",\"\",VLOOKUP(B214,Magacin!A7:E3966,2,FALSE))","v":""}]
[null,null,{"$f":"IF(B215=\"\",\"\",VLOOKUP(B215,Magacin!A7:E3967,2,FALSE))","v":""}]
[null,null,{"$f":"IF(B216=\"\",\"\",VLOOKUP(B216,Magacin!A7:E3968,2,FALSE))","v":""}]
[null,null,{"$f":"IF(B217=\"\",\"\",VLOOKUP(B217,Magacin!A7:E3969,2,FALSE))","v":""}]
[null,null,{"$f":"IF(B218=\"\",\"\",VLOOKUP(B218,Magacin!A7:E3970,2,FALSE))","v":""}]
[null,null,{"$f":"IF(B219=\"\",\"\",VLOOKUP(B219,Magacin!A7:E3971,2,FALSE))","v":""}]
[null,null,{"$f":"IF(B220=\"\",\"\",VLOOKUP(B220,Magacin!A7:E3972,2,FALSE))","v":""}]
[null,null,{"$f":"IF(B221=\"\",\"\",VLOOKUP(B221,Magacin!A7:E3973,2,FALSE))","v":""}]
[null,null,{"$f":"IF(B222=\"\",\"\",VLOOKUP(B222,Magacin!A7:E3974,2,FALSE))","v":""}]
[null,null,{"$f":"IF(B223=\"\",\"\",VLOOKUP(B223,Magacin!A7:E3975,2,FALSE))","v":""}]
[null,null,{"$f":"IF(B224=\"\",\"\",VLOOKUP(B224,Magacin!A7:E3976,2,FALSE))","v":""}]
[null,null,{"$f":"IF(B225=\"\",\"\",VLOOKUP(B225,Magacin!A7:E3977,2,FALSE))","v":""}]
[null,null,{"$f":"IF(B226=\"\",\"\",VLOOKUP(B226,Magacin!A7:E3978,2,FALSE))","v":""}]
[null,null,{"$f":"IF(B227=\"\",\"\",VLOOKUP(B227,Magacin!A7:E3979,2,FALSE))","v":""}]
[null,null,{"$f":"IF(B228=\"\",\"\",VLOOKUP(B228,Magacin!A7:E3980,2,FALSE))","v":""}]
[null,null,{"$f":"IF(B229=\"\",\"\",VLOOKUP(B229,Magacin!A7:E3981,2,FALSE))","v":""}]
[null,null,{"$f":"IF(B230=\"\",\"\",VLOOKUP(B230,Magacin!A7:E3982,2,FALSE))","v":""}]
[null,null,{"$f":"IF(B231=\"\",\"\",VLOOKUP(B231,Magacin!A7:E3983,2,FALSE))","v":""}]
[null,null,{"$f":"IF(B232=\"\",\"\",VLOOKUP(B232,Magacin!A7:E3984,2,FALSE))","v":""}]
[null,null,{"$f":"IF(B233=\"\",\"\",VLOOKUP(B233,Magacin!A7:E3985,2,FALSE))","v":""}]
[null,null,{"$f":"IF(B234=\"\",\"\",VLOOKUP(B234,Magacin!A7:E3986,2,FALSE))","v":""}]
[null,null,{"$f":"IF(B235=\"\",\"\",VLOOKUP(B235,Magacin!A7:E3987,2,FALSE))","v":""}]
[null,null,{"$f":"IF(B236=\"\",\"\",VLOOKUP(B236,Magacin!A7:E3988,2,FALSE))","v":""}]
[null,null,{"$f":"IF(B237=\"\",\"\",VLOOKUP(B237,Magacin!A7:E3989,2,FALSE))","v":""}]
[null,null,{"$f":"IF(B238=\"\",\"\",VLOOKUP(B238,Magacin!A7:E3990,2,FALSE))","v":""}]
[null,null,{"$f":"IF(B239=\"\",\"\",VLOOKUP(B239,Magacin!A7:E3991,2,FALSE))","v":""}]
[null,null,{"$f":"IF(B240=\"\",\"\",VLOOKUP(B240,Magacin!A7:E3992,2,FALSE))","v":""}]
[null,null,{"$f":"IF(B241=\"\",\"\",VLOOKUP(B241,Magacin!A7:E3993,2,FALSE))","v":""}]
[null,null,{"$f":"IF(B242=\"\",\"\",VLOOKUP(B242,Magacin!A7:E3994,2,FALSE))","v":""}]
[null,null,{"$f":"IF(B243=\"\",\"\",VLOOKUP(B243,Magacin!A7:E3995,2,FALSE))","v":""}]
[null,null,{"$f":"IF(B244=\"\",\"\",VLOOKUP(B244,Magacin!A7:E3996,2,FALSE))","v":""}]
[null,null,{"$f":"IF(B245=\"\",\"\",VLOOKUP(B245,Magacin!A7:E3997,2,FALSE))","v":""}]
[null,null,{"$f":"IF(B246=\"\",\"\",VLOOKUP(B246,Magacin!A7:E3998,2,FALSE))","v":""}]
[null,null,{"$f":"IF(B247=\"\",\"\",VLOOKUP(B247,Magacin!A7:E3999,2,FALSE))","v":""}]
[null,null,{"$f":"IF(B248=\"\",\"\",VLOOKUP(B248,Magacin!A7:E4000,2,FALSE))","v":""}]
[null,null,{"$f":"IF(B249=\"\",\"\",VLOOKUP(B249,Magacin!A7:E4001,2,FALSE))","v":""}]
[null,null,{"$f":"IF(B250=\"\",\"\",VLOOKUP(B250,Magacin!A7:E4002,2,FALSE))","v":""}]
[null,null,{"$f":"IF(B251=\"\",\"\",VLOOKUP(B251,Magacin!A7:E4003,2,FALSE))","v":""}]
[null,null,{"$f":"IF(B252=\"\",\"\",VLOOKUP(B252,Magacin!A7:E4004,2,FALSE))","v":""}]
[null,null,{"$f":"IF(B253=\"\",\"\",VLOOKUP(B253,Magacin!A7:E4005,2,FALSE))","v":""}]
[null,null,{"$f":"IF(B254=\"\",\"\",VLOOKUP(B254,Magacin!A7:E4006,2,FALSE))","v":""}]
[null,null,{"$f":"IF(B255=\"\",\"\",VLOOKUP(B255,Magacin!A7:E4007,2,FALSE))","v":""}]
[null,null,{"$f":"IF(B256=\"\",\"\",VLOOKUP(B256,Magacin!A7:E4008,2,FALSE))","v":""}]
[null,null,{"$f":"IF(B257=\"\",\"\",VLOOKUP(B257,Magacin!A7:E4009,2,FALSE))","v":""}]
[null,null,{"$f":"IF(B258=\"\",\"\",VLOOKUP(B258,Magacin!A7:E4010,2,FALSE))","v":""}]
[null,null,{"$f":"IF(B259=\"\",\"\",VLOOKUP(B259,Magacin!A7:E4011,2,FALSE))","v":""}]
[null,null,{"$f":"IF(B260=\"\",\"\",VLOOKUP(B260,Magacin!A7:E4012,2,FALSE))","v":""}]
[null,null,{"$f":"IF(B261=\"\",\"\",VLOOKUP(B261,Magacin!A7:E4013,2,FALSE))","v":""}]
[null,null,{"$f":"IF(B262=\"\",\"\",VLOOKUP(B262,Magacin!A7:E4014,2,FALSE))","v":""}]
[null,null,{"$f":"IF(B263=\"\",\"\",VLOOKUP(B263,Magacin!A7:E4015,2,FALSE))","v":""}]
[null,null,{"$f":"IF(B264=\"\",\"\",VLOOKUP(B264,Magacin!A7:E4016,2,FALSE))","v":""}]
[null,null,{"$f":"IF(B265=\"\",\"\",VLOOKUP(B265,Magacin!A7:E4017,2,FALSE))","v":""}]
[null,null,{"$f":"IF(B266=\"\",\"\",VLOOKUP(B266,Magacin!A7:E4018,2,FALSE))","v":""}]
[null,null,{"$f":"IF(B267=\"\",\"\",VLOOKUP(B267,Magacin!A7:E4019,2,FALSE))","v":""}]
[null,null,{"$f":"IF(B268=\"\",\"\",VLOOKUP(B268,Magacin!A7:E4020,2,FALSE))","v":""}]
[null,null,{"$f":"IF(B269=\"\",\"\",VLOOKUP(B269,Magacin!A7:E4021,2,FALSE))","v":""}]
[null,null,{"$f":"IF(B270=\"\",\"\",VLOOKUP(B270,Magacin!A7:E4022,2,FALSE))","v":""}]
[null,null,{"$f":"IF(B271=\"\",\"\",VLOOKUP(B271,Magacin!A7:E4023,2,FALSE))","v":""}]
[null,null,{"$f":"IF(B272=\"\",\"\",VLOOKUP(B272,Magacin!A7:E4024,2,FALSE))","v":""}]
[null,null,{"$f":"IF(B273=\"\",\"\",VLOOKUP(B273,Magacin!A7:E4025,2,FALSE))","v":""}]
[null,null,{"$f":"IF(B274=\"\",\"\",VLOOKUP(B274,Magacin!A7:E4026,2,FALSE))","v":""}]
[null,null,{"$f":"IF(B275=\"\",\"\",VLOOKUP(B275,Magacin!A7:E4027,2,FALSE))","v":""}]
[null,null,{"$f":"IF(B276=\"\",\"\",VLOOKUP(B276,Magacin!A7:E4028,2,FALSE))","v":""}]
[null,null,{"$f":"IF(B277=\"\",\"\",VLOOKUP(B277,Magacin!A7:E4029,2,FALSE))","v":""}]
[null,null,{"$f":"IF(B278=\"\",\"\",VLOOKUP(B278,Magacin!A7:E4030,2,FALSE))","v":""}]
[null,null,{"$f":"IF(B279=\"\",\"\",VLOOKUP(B279,Magacin!A7:E4031,2,FALSE))","v":""}]
[null,null,{"$f":"IF(B280=\"\",\"\",VLOOKUP(B280,Magacin!A7:E4032,2,FALSE))","v":""}]
[null,null,{"$f":"IF(B281=\"\",\"\",VLOOKUP(B281,Magacin!A7:E4033,2,FALSE))","v":""}]
[null,null,{"$f":"IF(B282=\"\",\"\",VLOOKUP(B282,Magacin!A7:E4034,2,FALSE))","v":""}]
[null,null,{"$f":"IF(B283=\"\",\"\",VLOOKUP(B283,Magacin!A7:E4035,2,FALSE))","v":""}]
[null,null,{"$f":"IF(B284=\"\",\"\",VLOOKUP(B284,Magacin!A7:E4036,2,FALSE))","v":""}]
[null,null,{"$f":"IF(B285=\"\",\"\",VLOOKUP(B285,Magacin!A7:E4037,2,FALSE))","v":""}]
[null,null,{"$f":"IF(B286=\"\",\"\",VLOOKUP(B286,Magacin!A7:E4038,2,FALSE))","v":""}]
[null,null,{"$f":"IF(B287=\"\",\"\",VLOOKUP(B287,Magacin!A7:E4039,2,FALSE))","v":""}]
[null,null,{"$f":"IF(B288=\"\",\"\",VLOOKUP(B288,Magacin!A7:E4040,2,FALSE))","v":""}]
[null,null,{"$f":"IF(B289=\"\",\"\",VLOOKUP(B289,Magacin!A7:E4041,2,FALSE))","v":""}]
[null,null,{"$f":"IF(B290=\"\",\"\",VLOOKUP(B290,Magacin!A7:E4042,2,FALSE))","v":""}]
[null,null,{"$f":"IF(B291=\"\",\"\",VLOOKUP(B291,Magacin!A7:E4043,2,FALSE))","v":""}]
[null,null,{"$f":"IF(B292=\"\",\"\",VLOOKUP(B292,Magacin!A7:E4044,2,FALSE))","v":""}]
[null,null,{"$f":"IF(B293=\"\",\"\",VLOOKUP(B293,Magacin!A7:E4045,2,FALSE))","v":""}]
[null,null,{"$f":"IF(B294=\"\",\"\",VLOOKUP(B294,Magacin!A7:E4046,2,FALSE))","v":""}]
[null,null,{"$f":"IF(B295=\"\",\"\",VLOOKUP(B295,Magacin!A7:E4047,2,FALSE))","v":""}]
[null,null,{"$f":"IF(B296=\"\",\"\",VLOOKUP(B296,Magacin!A7:E4048,2,FALSE))","v":""}]
[null,null,{"$f":"IF(B297=\"\",\"\",VLOOKUP(B297,Magacin!A7:E4049,2,FALSE))","v":""}]
[null,null,{"$f":"IF(B298=\"\",\"\",VLOOKUP(B298,Magacin!A7:E4050,2,FALSE))","v":""}]
[null,null,{"$f":"IF(B299=\"\",\"\",VLOOKUP(B299,Magacin!A7:E4051,2,FALSE))","v":""}]
[null,null,{"$f":"IF(B300=\"\",\"\",VLOOKUP(B300,Magacin!A7:E4052,2,FALSE))","v":""}]
[null,null,{"$f":"IF(B301=\"\",\"\",VLOOKUP(B301,Magacin!A7:E4053,2,FALSE))","v":""}]
[null,null,{"$f":"IF(B302=\"\",\"\",VLOOKUP(B302,Magacin!A7:E4054,2,FALSE))","v":""}]
[null,null,{"$f":"IF(B303=\"\",\"\",VLOOKUP(B303,Magacin!A7:E4055,2,FALSE))","v":""}]
[null,null,{"$f":"IF(B304=\"\",\"\",VLOOKUP(B304,Magacin!A7:E4056,2,FALSE))","v":""}]
[null,null,{"$f":"IF(B305=\"\",\"\",VLOOKUP(B305,Magacin!A7:E4057,2,FALSE))","v":""}]
[null,null,{"$f":"IF(B306=\"\",\"\",VLOOKUP(B306,Magacin!A7:E4058,2,FALSE))","v":""}]
[null,null,{"$f":"IF(B307=\"\",\"\",VLOOKUP(B307,Magacin!A7:E4059,2,FALSE))","v":""}]
[null,null,{"$f":"IF(B308=\"\",\"\",VLOOKUP(B308,Magacin!A7:E4060,2,FALSE))","v":""}]
[null,null,{"$f":"IF(B309=\"\",\"\",VLOOKUP(B309,Magacin!A7:E4061,2,FALSE))","v":""}]
[null,null,{"$f":"IF(B310=\"\",\"\",VLOOKUP(B310,Magacin!A7:E4062,2,FALSE))","v":""}]
[null,null,{"$f":"IF(B311=\"\",\"\",VLOOKUP(B311,Magacin!A7:E4063,2,FALSE))","v":""}]
[null,null,{"$f":"IF(B312=\"\",\"\",VLOOKUP(B312,Magacin!A7:E4064,2,FALSE))","v":""}]
[null,null,{"$f":"IF(B313=\"\",\"\",VLOOKUP(B313,Magacin!A7:E4065,2,FALSE))","v":""}]
[null,null,{"$f":"IF(B314=\"\",\"\",VLOOKUP(B314,Magacin!A7:E4066,2,FALSE))","v":""}]
[null,null,{"$f":"IF(B315=\"\",\"\",VLOOKUP(B315,Magacin!A7:E4067,2,FALSE))","v":""}]
[null,null,{"$f":"IF(B316=\"\",\"\",VLOOKUP(B316,Magacin!A7:E4068,2,FALSE))","v":""}]
[null,null,{"$f":"IF(B317=\"\",\"\",VLOOKUP(B317,Magacin!A7:E4069,2,FALSE))","v":""}]
[null,null,{"$f":"IF(B318=\"\",\"\",VLOOKUP(B318,Magacin!A7:E4070,2,FALSE))","v":""}]
[null,null,{"$f":"IF(B319=\"\",\"\",VLOOKUP(B319,Magacin!A7:E4071,2,FALSE))","v":""}]
[null,null,{"$f":"IF(B320=\"\",\"\",VLOOKUP(B320,Magacin!A7:E4072,2,FALSE))","v":""}]
[null,null,{"$f":"IF(B321=\"\",\"\",VLOOKUP(B321,Magacin!A7:E4073,2,FALSE))","v":""}]
[null,null,{"$f":"IF(B322=\"\",\"\",VLOOKUP(B322,Magacin!A7:E4074,2,FALSE))","v":""}]
[null,null,{"$f":"IF(B323=\"\",\"\",VLOOKUP(B323,Magacin!A7:E4075,2,FALSE))","v":""}]
[null,null,{"$f":"IF(B324=\"\",\"\",VLOOKUP(B324,Magacin!A7:E4076,2,FALSE))","v":""}]
[null,null,{"$f":"IF(B325=\"\",\"\",VLOOKUP(B325,Magacin!A7:E4077,2,FALSE))","v":""}]
[null,null,{"$f":"IF(B326=\"\",\"\",VLOOKUP(B326,Magacin!A7:E4078,2,FALSE))","v":""}]
[null,null,{"$f":"IF(B327=\"\",\"\",VLOOKUP(B327,Magacin!A7:E4079,2,FALSE))","v":""}]
[null,null,{"$f":"IF(B328=\"\",\"\",VLOOKUP(B328,Magacin!A7:E4080,2,FALSE))","v":""}]
[null,null,{"$f":"IF(B329=\"\",\"\",VLOOKUP(B329,Magacin!A7:E4081,2,FALSE))","v":""}]
[null,null,{"$f":"IF(B330=\"\",\"\",VLOOKUP(B330,Magacin!A7:E4082,2,FALSE))","v":""}]
[null,null,{"$f":"IF(B331=\"\",\"\",VLOOKUP(B331,Magacin!A7:E4083,2,FALSE))","v":""}]
[null,null,{"$f":"IF(B332=\"\",\"\",VLOOKUP(B332,Magacin!A7:E4084,2,FALSE))","v":""}]
[null,null,{"$f":"IF(B333=\"\",\"\",VLOOKUP(B333,Magacin!A7:E4085,2,FALSE))","v":""}]
[null,null,{"$f":"IF(B334=\"\",\"\",VLOOKUP(B334,Magacin!A7:E4086,2,FALSE))","v":""}]
[null,null,{"$f":"IF(B335=\"\",\"\",VLOOKUP(B335,Magacin!A7:E4087,2,FALSE))","v":""}]
[null,null,{"$f":"IF(B336=\"\",\"\",VLOOKUP(B336,Magacin!A7:E4088,2,FALSE))","v":""}]
[null,null,{"$f":"IF(B337=\"\",\"\",VLOOKUP(B337,Magacin!A7:E4089,2,FALSE))","v":""}]
[null,null,{"$f":"IF(B338=\"\",\"\",VLOOKUP(B338,Magacin!A7:E4090,2,FALSE))","v":""}]
[null,null,{"$f":"IF(B339=\"\",\"\",VLOOKUP(B339,Magacin!A7:E4091,2,FALSE))","v":""}]
[null,null,{"$f":"IF(B340=\"\",\"\",VLOOKUP(B340,Magacin!A7:E4092,2,FALSE))","v":""}]
[null,null,{"$f":"IF(B341=\"\",\"\",VLOOKUP(B341,Magacin!A7:E4093,2,FALSE))","v":""}]
[null,null,{"$f":"IF(B342=\"\",\"\",VLOOKUP(B342,Magacin!A7:E4094,2,FALSE))","v":""}]
[null,null,{"$f":"IF(B343=\"\",\"\",VLOOKUP(B343,Magacin!A7:E4095,2,FALSE))","v":""}]
[null,null,{"$f":"IF(B344=\"\",\"\",VLOOKUP(B344,Magacin!A7:E4096,2,FALSE))","v":""}]
[null,null,{"$f":"IF(B345=\"\",\"\",VLOOKUP(B345,Magacin!A7:E4097,2,FALSE))","v":""}]
[null,null,{"$f":"IF(B346=\"\",\"\",VLOOKUP(B346,Magacin!A7:E4098,2,FALSE))","v":""}]
[null,null,{"$f":"IF(B347=\"\",\"\",VLOOKUP(B347,Magacin!A7:E4099,2,FALSE))","v":""}]
[null,null,{"$f":"IF(B348=\"\",\"\",VLOOKUP(B348,Magacin!A7:E4100,2,FALSE))","v":""}]
[null,null,{"$f":"IF(B349=\"\",\"\",VLOOKUP(B349,Magacin!A7:E4101,2,FALSE))","v":""}]
[null,null,{"$f":"IF(B350=\"\",\"\",VLOOKUP(B350,Magacin!A7:E4102,2,FALSE))","v":""}]
[null,null,{"$f":"IF(B351=\"\",\"\",VLOOKUP(B351,Magacin!A7:E4103,2,FALSE))","v":""}]
[null,null,{"$f":"IF(B352=\"\",\"\",VLOOKUP(B352,Magacin!A7:E4104,2,FALSE))","v":""}]
[null,null,{"$f":"IF(B353=\"\",\"\",VLOOKUP(B353,Magacin!A7:E4105,2,FALSE))","v":""}]
[null,null,{"$f":"IF(B354=\"\",\"\",VLOOKUP(B354,Magacin!A7:E4106,2,FALSE))","v":""}]
[null,null,{"$f":"IF(B355=\"\",\"\",VLOOKUP(B355,Magacin!A7:E4107,2,FALSE))","v":""}]
[null,null,{"$f":"IF(B356=\"\",\"\",VLOOKUP(B356,Magacin!A7:E4108,2,FALSE))","v":""}]
[null,null,{"$f":"IF(B357=\"\",\"\",VLOOKUP(B357,Magacin!A7:E4109,2,FALSE))","v":""}]
[null,null,{"$f":"IF(B358=\"\",\"\",VLOOKUP(B358,Magacin!A7:E4110,2,FALSE))","v":""}]
[null,null,{"$f":"IF(B359=\"\",\"\",VLOOKUP(B359,Magacin!A7:E4111,2,FALSE))","v":""}]
[null,null,{"$f":"IF(B360=\"\",\"\",VLOOKUP(B360,Magacin!A7:E4112,2,FALSE))","v":""}]
[null,null,{"$f":"IF(B361=\"\",\"\",VLOOKUP(B361,Magacin!A7:E4113,2,FALSE))","v":""}]
[null,null,{"$f":"IF(B362=\"\",\"\",VLOOKUP(B362,Magacin!A7:E4114,2,FALSE))","v":""}]
[null,null,{"$f":"IF(B363=\"\",\"\",VLOOKUP(B363,Magacin!A7:E4115,2,FALSE))","v":""}]
[null,null,{"$f":"IF(B364=\"\",\"\",VLOOKUP(B364,Magacin!A7:E4116,2,FALSE))","v":""}]
[null,null,{"$f":"IF(B365=\"\",\"\",VLOOKUP(B365,Magacin!A7:E4117,2,FALSE))","v":""}]
[null,null,{"$f":"IF(B366=\"\",\"\",VLOOKUP(B366,Magacin!A7:E4118,2,FALSE))","v":""}]
[null,null,{"$f":"IF(B367=\"\",\"\",VLOOKUP(B367,Magacin!A7:E4119,2,FALSE))","v":""}]
[null,null,{"$f":"IF(B368=\"\",\"\",VLOOKUP(B368,Magacin!A7:E4120,2,FALSE))","v":""}]
[null,null,{"$f":"IF(B369=\"\",\"\",VLOOKUP(B369,Magacin!A7:E4121,2,FALSE))","v":""}]
[null,null,{"$f":"IF(B370=\"\",\"\",VLOOKUP(B370,Magacin!A7:E4122,2,FALSE))","v":""}]
[null,null,{"$f":"IF(B371=\"\",\"\",VLOOKUP(B371,Magacin!A7:E4123,2,FALSE))","v":""}]
[null,null,{"$f":"IF(B372=\"\",\"\",VLOOKUP(B372,Magacin!A7:E4124,2,FALSE))","v":""}]
[null,null,{"$f":"IF(B373=\"\",\"\",VLOOKUP(B373,Magacin!A7:E4125,2,FALSE))","v":""}]
[null,null,{"$f":"IF(B374=\"\",\"\",VLOOKUP(B374,Magacin!A7:E4126,2,FALSE))","v":""}]
[null,null,{"$f":"IF(B375=\"\",\"\",VLOOKUP(B375,Magacin!A7:E4127,2,FALSE))","v":""}]
[null,null,{"$f":"IF(B376=\"\",\"\",VLOOKUP(B376,Magacin!A7:E4128,2,FALSE))","v":""}]
[null,null,{"$f":"IF(B377=\"\",\"\",VLOOKUP(B377,Magacin!A7:E4129,2,FALSE))","v":""}]
[null,null,{"$f":"IF(B378=\"\",\"\",VLOOKUP(B378,Magacin!A7:E4130,2,FALSE))","v":""}]
[null,null,{"$f":"IF(B379=\"\",\"\",VLOOKUP(B379,Magacin!A7:E4131,2,FALSE))","v":""}]
[null,null,{"$f":"IF(B380=\"\",\"\",VLOOKUP(B380,Magacin!A7:E4132,2,FALSE))","v":""}]
[null,null,{"$f":"IF(B381=\"\",\"\",VLOOKUP(B381,Magacin!A7:E4133,2,FALSE))","v":""}]
[null,null,{"$f":"IF(B382=\"\",\"\",VLOOKUP(B382,Magacin!A7:E4134,2,FALSE))","v":""}]
[null,null,{"$f":"IF(B383=\"\",\"\",VLOOKUP(B383,Magacin!A7:E4135,2,FALSE))","v":""}]
[null,null,{"$f":"IF(B384=\"\",\"\",VLOOKUP(B384,Magacin!A7:E4136,2,FALSE))","v":""}]
[null,null,{"$f":"IF(B385=\"\",\"\",VLOOKUP(B385,Magacin!A7:E4137,2,FALSE))","v":""}]
[null,null,{"$f":"IF(B386=\"\",\"\",VLOOKUP(B386,Magacin!A7:E4138,2,FALSE))","v":""}]
[null,null,{"$f":"IF(B387=\"\",\"\",VLOOKUP(B387,Magacin!A7:E4139,2,FALSE))","v":""}]
[null,null,{"$f":"IF(B388=\"\",\"\",VLOOKUP(B388,Magacin!A7:E4140,2,FALSE))","v":""}]
[null,null,{"$f":"IF(B389=\"\",\"\",VLOOKUP(B389,Magacin!A7:E4141,2,FALSE))","v":""}]
[null,null,{"$f":"IF(B390=\"\",\"\",VLOOKUP(B390,Magacin!A7:E4142,2,FALSE))","v":""}]
[null,null,{"$f":"IF(B391=\"\",\"\",VLOOKUP(B391,Magacin!A7:E4143,2,FALSE))","v":""}]
[null,null,{"$f":"IF(B392=\"\",\"\",VLOOKUP(B392,Magacin!A7:E4144,2,FALSE))","v":""}]
[null,null,{"$f":"IF(B393=\"\",\"\",VLOOKUP(B393,Magacin!A7:E4145,2,FALSE))","v":""}]
[null,null,{"$f":"IF(B394=\"\",\"\",VLOOKUP(B394,Magacin!A7:E4146,2,FALSE))","v":""}]
[null,null,{"$f":"IF(B395=\"\",\"\",VLOOKUP(B395,Magacin!A7:E4147,2,FALSE))","v":""}]
[null,null,{"$f":"IF(B396=\"\",\"\",VLOOKUP(B396,Magacin!A7:E4148,2,FALSE))","v":""}]
[null,null,{"$f":"IF(B397=\"\",\"\",VLOOKUP(B397,Magacin!A7:E4149,2,FALSE))","v":""}]
[null,null,{"$f":"IF(B398=\"\",\"\",VLOOKUP(B398,Magacin!A7:E4150,2,FALSE))","v":""}]
[null,null,{"$f":"IF(B399=\"\",\"\",VLOOKUP(B399,Magacin!A7:E4151,2,FALSE))","v":""}]
[null,null,{"$f":"IF(B400=\"\",\"\",VLOOKUP(B400,Magacin!A7:E4152,2,FALSE))","v":""}]
[null,null,{"$f":"IF(B401=\"\",\"\",VLOOKUP(B401,Magacin!A7:E4153,2,FALSE))","v":""}]
[null,null,{"$f":"IF(B402=\"\",\"\",VLOOKUP(B402,Magacin!A7:E4154,2,FALSE))","v":""}]
[null,null,{"$f":"IF(B403=\"\",\"\",VLOOKUP(B403,Magacin!A7:E4155,2,FALSE))","v":""}]
[null,null,{"$f":"IF(B404=\"\",\"\",VLOOKUP(B404,Magacin!A7:E4156,2,FALSE))","v":""}]
[null,null,{"$f":"IF(B405=\"\",\"\",VLOOKUP(B405,Magacin!A7:E4157,2,FALSE))","v":""}]
[null,null,{"$f":"IF(B406=\"\",\"\",VLOOKUP(B406,Magacin!A7:E4158,2,FALSE))","v":""}]
[null,null,{"$f":"IF(B407=\"\",\"\",VLOOKUP(B407,Magacin!A7:E4159,2,FALSE))","v":""}]
[null,null,{"$f":"IF(B408=\"\",\"\",VLOOKUP(B408,Magacin!A7:E4160,2,FALSE))","v":""}]
[null,null,{"$f":"IF(B409=\"\",\"\",VLOOKUP(B409,Magacin!A7:E4161,2,FALSE))","v":""}]
[null,null,{"$f":"IF(B410=\"\",\"\",VLOOKUP(B410,Magacin!A7:E4162,2,FALSE))","v":""}]
[null,null,{"$f":"IF(B411=\"\",\"\",VLOOKUP(B411,Magacin!A7:E4163,2,FALSE))","v":""}]
[null,null,{"$f":"IF(B412=\"\",\"\",VLOOKUP(B412,Magacin!A7:E4164,2,FALSE))","v":""}]
[null,null,{"$f":"IF(B413=\"\",\"\",VLOOKUP(B413,Magacin!A7:E4165,2,FALSE))","v":""}]
[null,null,{"$f":"IF(B414=\"\",\"\",VLOOKUP(B414,Magacin!A7:E4166,2,FALSE))","v":""}]
[null,null,{"$f":"IF(B415=\"\",\"\",VLOOKUP(B415,Magacin!A7:E4167,2,FALSE))","v":""}]
[null,null,{"$f":"IF(B416=\"\",\"\",VLOOKUP(B416,Magacin!A7:E4168,2,FALSE))","v":""}]
[null,null,{"$f":"IF(B417=\"\",\"\",VLOOKUP(B417,Magacin!A7:E4169,2,FALSE))","v":""}]
[null,null,{"$f":"IF(B418=\"\",\"\",VLOOKUP(B418,Magacin!A7:E4170,2,FALSE))","v":""}]
[null,null,{"$f":"IF(B419=\"\",\"\",VLOOKUP(B419,Magacin!A7:E4171,2,FALSE))","v":""}]
[null,null,{"$f":"IF(B420=\"\",\"\",VLOOKUP(B420,Magacin!A7:E4172,2,FALSE))","v":""}]
[null,null,{"$f":"IF(B421=\"\",\"\",VLOOKUP(B421,Magacin!A7:E4173,2,FALSE))","v":""}]
[null,null,{"$f":"IF(B422=\"\",\"\",VLOOKUP(B422,Magacin!A7:E4174,2,FALSE))","v":""}]
[null,null,{"$f":"IF(B423=\"\",\"\",VLOOKUP(B423,Magacin!A7:E4175,2,FALSE))","v":""}]
[null,null,{"$f":"IF(B424=\"\",\"\",VLOOKUP(B424,Magacin!A7:E4176,2,FALSE))","v":""}]
[null,null,{"$f":"IF(B425=\"\",\"\",VLOOKUP(B425,Magacin!A7:E4177,2,FALSE))","v":""}]
[null,null,{"$f":"IF(B426=\"\",\"\",VLOOKUP(B426,Magacin!A7:E4178,2,FALSE))","v":""}]
[null,null,{"$f":"IF(B427=\"\",\"\",VLOOKUP(B427,Magacin!A7:E4179,2,FALSE))","v":""}]
[null,null,{"$f":"IF(B428=\"\",\"\",VLOOKUP(B428,Magacin!A7:E4180,2,FALSE))","v":""}]
[null,null,{"$f":"IF(B429=\"\",\"\",VLOOKUP(B429,Magacin!A7:E4181,2,FALSE))","v":""}]
[null,null,{"$f":"IF(B430=\"\",\"\",VLOOKUP(B430,Magacin!A7:E4182,2,FALSE))","v":""}]
[null,null,{"$f":"IF(B431=\"\",\"\",VLOOKUP(B431,Magacin!A7:E4183,2,FALSE))","v":""}]
[null,null,{"$f":"IF(B432=\"\",\"\",VLOOKUP(B432,Magacin!A7:E4184,2,FALSE))","v":""}]
[null,null,{"$f":"IF(B433=\"\",\"\",VLOOKUP(B433,Magacin!A7:E4185,2,FALSE))","v":""}]
[null,null,{"$f":"IF(B434=\"\",\"\",VLOOKUP(B434,Magacin!A7:E4186,2,FALSE))","v":""}]
[null,null,{"$f":"IF(B435=\"\",\"\",VLOOKUP(B435,Magacin!A7:E4187,2,FALSE))","v":""}]
[null,null,{"$f":"IF(B436=\"\",\"\",VLOOKUP(B436,Magacin!A7:E4188,2,FALSE))","v":""}]
[null,null,{"$f":"IF(B437=\"\",\"\",VLOOKUP(B437,Magacin!A7:E4189,2,FALSE))","v":""}]
[null,null,{"$f":"IF(B438=\"\",\"\",VLOOKUP(B438,Magacin!A7:E4190,2,FALSE))","v":""}]
[null,null,{"$f":"IF(B439=\"\",\"\",VLOOKUP(B439,Magacin!A7:E4191,2,FALSE))","v":""}]
[null,null,{"$f":"IF(B440=\"\",\"\",VLOOKUP(B440,Magacin!A7:E4192,2,FALSE))","v":""}]
[null,null,{"$f":"IF(B441=\"\",\"\",VLOOKUP(B441,Magacin!A7:E4193,2,FALSE))","v":""}]
[null,null,{"$f":"IF(B442=\"\",\"\",VLOOKUP(B442,Magacin!A7:E4194,2,FALSE))","v":""}]
[null,null,{"$f":"IF(B443=\"\",\"\",VLOOKUP(B443,Magacin!A7:E4195,2,FALSE))","v":""}]
[null,null,{"$f":"IF(B444=\"\",\"\",VLOOKUP(B444,Magacin!A7:E4196,2,FALSE))","v":""}]
[null,null,{"$f":"IF(B445=\"\",\"\",VLOOKUP(B445,Magacin!A7:E4197,2,FALSE))","v":""}]
[null,null,{"$f":"IF(B446=\"\",\"\",VLOOKUP(B446,Magacin!A7:E4198,2,FALSE))","v":""}]
[null,null,{"$f":"IF(B447=\"\",\"\",VLOOKUP(B447,Magacin!A7:E4199,2,FALSE))","v":""}]
[null,null,{"$f":"IF(B448=\"\",\"\",VLOOKUP(B448,Magacin!A7:E4200,2,FALSE))","v":""}]
[null,null,{"$f":"IF(B449=\"\",\"\",VLOOKUP(B449,Magacin!A7:E4201,2,FALSE))","v":""}]
[null,null,{"$f":"IF(B450=\"\",\"\",VLOOKUP(B450,Magacin!A7:E4202,2,FALSE))","v":""}]
[null,null,{"$f":"IF(B451=\"\",\"\",VLOOKUP(B451,Magacin!A7:E4203,2,FALSE))","v":""}]
[null,null,{"$f":"IF(B452=\"\",\"\",VLOOKUP(B452,Magacin!A7:E4204,2,FALSE))","v":""}]
[null,null,{"$f":"IF(B453=\"\",\"\",VLOOKUP(B453,Magacin!A7:E4205,2,FALSE))","v":""}]
[null,null,{"$f":"IF(B454=\"\",\"\",VLOOKUP(B454,Magacin!A7:E4206,2,FALSE))","v":""}]
[null,null,{"$f":"IF(B455=\"\",\"\",VLOOKUP(B455,Magacin!A7:E4207,2,FALSE))","v":""}]
[null,null,{"$f":"IF(B456=\"\",\"\",VLOOKUP(B456,Magacin!A7:E4208,2,FALSE))","v":""}]
[null,null,{"$f":"IF(B457=\"\",\"\",VLOOKUP(B457,Magacin!A7:E4209,2,FALSE))","v":""}]
[null,null,{"$f":"IF(B458=\"\",\"\",VLOOKUP(B458,Magacin!A7:E4210,2,FALSE))","v":""}]
[null,null,{"$f":"IF(B459=\"\",\"\",VLOOKUP(B459,Magacin!A7:E4211,2,FALSE))","v":""}]
[null,null,{"$f":"IF(B460=\"\",\"\",VLOOKUP(B460,Magacin!A7:E4212,2,FALSE))","v":""}]
[null,null,{"$f":"IF(B461=\"\",\"\",VLOOKUP(B461,Magacin!A7:E4213,2,FALSE))","v":""}]
[null,null,{"$f":"IF(B462=\"\",\"\",VLOOKUP(B462,Magacin!A7:E4214,2,FALSE))","v":""}]
[null,null,{"$f":"IF(B463=\"\",\"\",VLOOKUP(B463,Magacin!A7:E4215,2,FALSE))","v":""}]
[null,null,{"$f":"IF(B464=\"\",\"\",VLOOKUP(B464,Magacin!A7:E4216,2,FALSE))","v":""}]
[null,null,{"$f":"IF(B465=\"\",\"\",VLOOKUP(B465,Magacin!A7:E4217,2,FALSE))","v":""}]
[null,null,{"$f":"IF(B466=\"\",\"\",VLOOKUP(B466,Magacin!A7:E4218,2,FALSE))","v":""}]
[null,null,{"$f":"IF(B467=\"\",\"\",VLOOKUP(B467,Magacin!A7:E4219,2,FALSE))","v":""}]
[null,null,{"$f":"IF(B468=\"\",\"\",VLOOKUP(B468,Magacin!A7:E4220,2,FALSE))","v":""}]
[null,null,{"$f":"IF(B469=\"\",\"\",VLOOKUP(B469,Magacin!A7:E4221,2,FALSE))","v":""}]
[null,null,{"$f":"IF(B470=\"\",\"\",VLOOKUP(B470,Magacin!A7:E4222,2,FALSE))","v":""}]
[null,null,{"$f":"IF(B471=\"\",\"\",VLOOKUP(B471,Magacin!A7:E4223,2,FALSE))","v":""}]
[null,null,{"$f":"IF(B472=\"\",\"\",VLOOKUP(B472,Magacin!A7:E4224,2,FALSE))","v":""}]
[null,null,{"$f":"IF(B473=\"\",\"\",VLOOKUP(B473,Magacin!A7:E4225,2,FALSE))","v":""}]
[null,null,{"$f":"IF(B474=\"\",\"\",VLOOKUP(B474,Magacin!A7:E4226,2,FALSE))","v":""}]
[null,null,{"$f":"IF(B475=\"\",\"\",VLOOKUP(B475,Magacin!A7:E4227,2,FALSE))","v":""}]
[null,null,{"$f":"IF(B476=\"\",\"\",VLOOKUP(B476,Magacin!A7:E4228,2,FALSE))","v":""}]
[null,null,{"$f":"IF(B477=\"\",\"\",VLOOKUP(B477,Magacin!A7:E4229,2,FALSE))","v":""}]
[null,null,{"$f":"IF(B478=\"\",\"\",VLOOKUP(B478,Magacin!A7:E4230,2,FALSE))","v":""}]
[null,null,{"$f":"IF(B479=\"\",\"\",VLOOKUP(B479,Magacin!A7:E4231,2,FALSE))","v":""}]
[null,null,{"$f":"IF(B480=\"\",\"\",VLOOKUP(B480,Magacin!A7:E4232,2,FALSE))","v":""}]
[null,null,{"$f":"IF(B481=\"\",\"\",VLOOKUP(B481,Magacin!A7:E4233,2,FALSE))","v":""}]
[null,null,{"$f":"IF(B482=\"\",\"\",VLOOKUP(B482,Magacin!A7:E4234,2,FALSE))","v":""}]
[null,null,{"$f":"IF(B483=\"\",\"\",VLOOKUP(B483,Magacin!A7:E4235,2,FALSE))","v":""}]
[null,null,{"$f":"IF(B484=\"\",\"\",VLOOKUP(B484,Magacin!A7:E4236,2,FALSE))","v":""}]
[null,null,{"$f":"IF(B485=\"\",\"\",VLOOKUP(B485,Magacin!A7:E4237,2,FALSE))","v":""}]
[null,null,{"$f":"IF(B486=\"\",\"\",VLOOKUP(B486,Magacin!A7:E4238,2,FALSE))","v":""}]
[null,null,{"$f":"IF(B487=\"\",\"\",VLOOKUP(B487,Magacin!A7:E4239,2,FALSE))","v":""}]
[null,null,{"$f":"IF(B488=\"\",\"\",VLOOKUP(B488,Magacin!A7:E4240,2,FALSE))","v":""}]
[null,null,{"$f":"IF(B489=\"\",\"\",VLOOKUP(B489,Magacin!A7:E4241,2,FALSE))","v":""}]
[null,null,{"$f":"IF(B490=\"\",\"\",VLOOKUP(B490,Magacin!A7:E4242,2,FALSE))","v":""}]
[null,null,{"$f":"IF(B491=\"\",\"\",VLOOKUP(B491,Magacin!A7:E4243,2,FALSE))","v":""}]
[null,null,{"$f":"IF(B492=\"\",\"\",VLOOKUP(B492,Magacin!A7:E4244,2,FALSE))","v":""}]
[null,null,{"$f":"IF(B493=\"\",\"\",VLOOKUP(B493,Magacin!A7:E4245,2,FALSE))","v":""}]
[null,null,{"$f":"IF(B494=\"\",\"\",VLOOKUP(B494,Magacin!A7:E4246,2,FALSE))","v":""}]
[null,null,{"$f":"IF(B495=\"\",\"\",VLOOKUP(B495,Magacin!A7:E4247,2,FALSE))","v":""}]
[null,null,{"$f":"IF(B496=\"\",\"\",VLOOKUP(B496,Magacin!A7:E4248,2,FALSE))","v":""}]
[null,null,{"$f":"IF(B497=\"\",\"\",VLOOKUP(B497,Magacin!A7:E4249,2,FALSE))","v":""}]
[null,null,{"$f":"IF(B498=\"\",\"\",VLOOKUP(B498,Magacin!A7:E4250,2,FALSE))","v":""}]
[null,null,{"$f":"IF(B499=\"\",\"\",VLOOKUP(B499,Magacin!A7:E4251,2,FALSE))","v":""}]
[null,null,{"$f":"IF(B500=\"\",\"\",VLOOKUP(B500,Magacin!A7:E4252,2,FALSE))","v":""}]
[null,null,{"$f":"IF(B501=\"\",\"\",VLOOKUP(B501,Magacin!A7:E4253,2,FALSE))","v":""}]
[null,null,{"$f":"IF(B502=\"\",\"\",VLOOKUP(B502,Magacin!A7:E4254,2,FALSE))","v":""}]
[null,null,{"$f":"IF(B503=\"\",\"\",VLOOKUP(B503,Magacin!A7:E4255,2,FALSE))","v":""}]
[null,null,{"$f":"IF(B504=\"\",\"\",VLOOKUP(B504,Magacin!A7:E4256,2,FALSE))","v":""}]
[null,null,{"$f":"IF(B505=\"\",\"\",VLOOKUP(B505,Magacin!A7:E4257,2,FALSE))","v":""}]
[null,null,{"$f":"IF(B506=\"\",\"\",VLOOKUP(B506,Magacin!A7:E4258,2,FALSE))","v":""}]
[null,null,{"$f":"IF(B507=\"\",\"\",VLOOKUP(B507,Magacin!A7:E4259,2,FALSE))","v":""}]
[null,null,{"$f":"IF(B508=\"\",\"\",VLOOKUP(B508,Magacin!A7:E4260,2,FALSE))","v":""}]
[null,null,{"$f":"IF(B509=\"\",\"\",VLOOKUP(B509,Magacin!A7:E4261,2,FALSE))","v":""}]
[null,null,{"$f":"IF(B510=\"\",\"\",VLOOKUP(B510,Magacin!A7:E4262,2,FALSE))","v":""}]
[null,null,{"$f":"IF(B511=\"\",\"\",VLOOKUP(B511,Magacin!A7:E4263,2,FALSE))","v":""}]
[null,null,{"$f":"IF(B512=\"\",\"\",VLOOKUP(B512,Magacin!A7:E4264,2,FALSE))","v":""}]
[null,null,{"$f":"IF(B513=\"\",\"\",VLOOKUP(B513,Magacin!A7:E4265,2,FALSE))","v":""}]
[null,null,{"$f":"IF(B514=\"\",\"\",VLOOKUP(B514,Magacin!A7:E4266,2,FALSE))","v":""}]
[null,null,{"$f":"IF(B515=\"\",\"\",VLOOKUP(B515,Magacin!A7:E4267,2,FALSE))","v":""}]
[null,null,{"$f":"IF(B516=\"\",\"\",VLOOKUP(B516,Magacin!A7:E4268,2,FALSE))","v":""}]
[null,null,{"$f":"IF(B517=\"\",\"\",VLOOKUP(B517,Magacin!A7:E4269,2,FALSE))","v":""}]
[null,null,{"$f":"IF(B518=\"\",\"\",VLOOKUP(B518,Magacin!A7:E4270,2,FALSE))","v":""}]
[null,null,{"$f":"IF(B519=\"\",\"\",VLOOKUP(B519,Magacin!A7:E4271,2,FALSE))","v":""}]
[null,null,{"$f":"IF(B520=\"\",\"\",VLOOKUP(B520,Magacin!A7:E4272,2,FALSE))","v":""}]
[null,null,{"$f":"IF(B521=\"\",\"\",VLOOKUP(B521,Magacin!A7:E4273,2,FALSE))","v":""}]
[null,null,{"$f":"IF(B522=\"\",\"\",VLOOKUP(B522,Magacin!A7:E4274,2,FALSE))","v":""}]
[null,null,{"$f":"IF(B523=\"\",\"\",VLOOKUP(B523,Magacin!A7:E4275,2,FALSE))","v":""}]
[null,null,{"$f":"IF(B524=\"\",\"\",VLOOKUP(B524,Magacin!A7:E4276,2,FALSE))","v":""}]
[null,null,{"$f":"IF(B525=\"\",\"\",VLOOKUP(B525,Magacin!A7:E4277,2,FALSE))","v":""}]
[null,null,{"$f":"IF(B526=\"\",\"\",VLOOKUP(B526,Magacin!A7:E4278,2,FALSE))","v":""}]
[null,null,{"$f":"IF(B527=\"\",\"\",VLOOKUP(B527,Magacin!A7:E4279,2,FALSE))","v":""}]
[null,null,{"$f":"IF(B528=\"\",\"\",VLOOKUP(B528,Magacin!A7:E4280,2,FALSE))","v":""}]
[null,null,{"$f":"IF(B529=\"\",\"\",VLOOKUP(B529,Magacin!A7:E4281,2,FALSE))","v":""}]
[null,null,{"$f":"IF(B530=\"\",\"\",VLOOKUP(B530,Magacin!A7:E4282,2,FALSE))","v":""}]
[null,null,{"$f":"IF(B531=\"\",\"\",VLOOKUP(B531,Magacin!A7:E4283,2,FALSE))","v":""}]
[null,null,{"$f":"IF(B532=\"\",\"\",VLOOKUP(B532,Magacin!A7:E4284,2,FALSE))","v":""}]
[null,null,{"$f":"IF(B533=\"\",\"\",VLOOKUP(B533,Magacin!A7:E4285,2,FALSE))","v":""}]
[null,null,{"$f":"IF(B534=\"\",\"\",VLOOKUP(B534,Magacin!A7:E4286,2,FALSE))","v":""}]
[null,null,{"$f":"IF(B535=\"\",\"\",VLOOKUP(B535,Magacin!A7:E4287,2,FALSE))","v":""}]
[null,null,{"$f":"IF(B536=\"\",\"\",VLOOKUP(B536,Magacin!A7:E4288,2,FALSE))","v":""}]
[null,null,{"$f":"IF(B537=\"\",\"\",VLOOKUP(B537,Magacin!A7:E4289,2,FALSE))","v":""}]
[null,null,{"$f":"IF(B538=\"\",\"\",VLOOKUP(B538,Magacin!A7:E4290,2,FALSE))","v":""}]
[null,null,{"$f":"IF(B539=\"\",\"\",VLOOKUP(B539,Magacin!A7:E4291,2,FALSE))","v":""}]
[null,null,{"$f":"IF(B540=\"\",\"\",VLOOKUP(B540,Magacin!A7:E4292,2,FALSE))","v":""}]
[null,null,{"$f":"IF(B541=\"\",\"\",VLOOKUP(B541,Magacin!A7:E4293,2,FALSE))","v":""}]
[null,null,{"$f":"IF(B542=\"\",\"\",VLOOKUP(B542,Magacin!A7:E4294,2,FALSE))","v":""}]
[null,null,{"$f":"IF(B543=\"\",\"\",VLOOKUP(B543,Magacin!A7:E4295,2,FALSE))","v":""}]
[null,null,{"$f":"IF(B544=\"\",\"\",VLOOKUP(B544,Magacin!A7:E4296,2,FALSE))","v":""}]
[null,null,{"$f":"IF(B545=\"\",\"\",VLOOKUP(B545,Magacin!A7:E4297,2,FALSE))","v":""}]
[null,null,{"$f":"IF(B546=\"\",\"\",VLOOKUP(B546,Magacin!A7:E4298,2,FALSE))","v":""}]
[null,null,{"$f":"IF(B547=\"\",\"\",VLOOKUP(B547,Magacin!A7:E4299,2,FALSE))","v":""}]
[null,null,{"$f":"IF(B548=\"\",\"\",VLOOKUP(B548,Magacin!A7:E4300,2,FALSE))","v":""}]
[null,null,{"$f":"IF(B549=\"\",\"\",VLOOKUP(B549,Magacin!A7:E4301,2,FALSE))","v":""}]
[null,null,{"$f":"IF(B550=\"\",\"\",VLOOKUP(B550,Magacin!A7:E4302,2,FALSE))","v":""}]
[null,null,{"$f":"IF(B551=\"\",\"\",VLOOKUP(B551,Magacin!A7:E4303,2,FALSE))","v":""}]
[null,null,{"$f":"IF(B552=\"\",\"\",VLOOKUP(B552,Magacin!A7:E4304,2,FALSE))","v":""}]
[null,null,{"$f":"IF(B553=\"\",\"\",VLOOKUP(B553,Magacin!A7:E4305,2,FALSE))","v":""}]
[null,null,{"$f":"IF(B554=\"\",\"\",VLOOKUP(B554,Magacin!A7:E4306,2,FALSE))","v":""}]
[null,null,{"$f":"IF(B555=\"\",\"\",VLOOKUP(B555,Magacin!A7:E4307,2,FALSE))","v":""}]
[null,null,{"$f":"IF(B556=\"\",\"\",VLOOKUP(B556,Magacin!A7:E4308,2,FALSE))","v":""}]
[null,null,{"$f":"IF(B557=\"\",\"\",VLOOKUP(B557,Magacin!A7:E4309,2,FALSE))","v":""}]
[null,null,{"$f":"IF(B558=\"\",\"\",VLOOKUP(B558,Magacin!A7:E4310,2,FALSE))","v":""}]
[null,null,{"$f":"IF(B559=\"\",\"\",VLOOKUP(B559,Magacin!A7:E4311,2,FALSE))","v":""}]
[null,null,{"$f":"IF(B560=\"\",\"\",VLOOKUP(B560,Magacin!A7:E4312,2,FALSE))","v":""}]
[null,null,{"$f":"IF(B561=\"\",\"\",VLOOKUP(B561,Magacin!A7:E4313,2,FALSE))","v":""}]
[null,null,{"$f":"IF(B562=\"\",\"\",VLOOKUP(B562,Magacin!A7:E4314,2,FALSE))","v":""}]
[null,null,{"$f":"IF(B563=\"\",\"\",VLOOKUP(B563,Magacin!A7:E4315,2,FALSE))","v":""}]
[null,null,{"$f":"IF(B564=\"\",\"\",VLOOKUP(B564,Magacin!A7:E4316,2,FALSE))","v":""}]
[null,null,{"$f":"IF(B565=\"\",\"\",VLOOKUP(B565,Magacin!A7:E4317,2,FALSE))","v":""}]
[null,null,{"$f":"IF(B566=\"\",\"\",VLOOKUP(B566,Magacin!A7:E4318,2,FALSE))","v":""}]
[null,null,{"$f":"IF(B567=\"\",\"\",VLOOKUP(B567,Magacin!A7:E4319,2,FALSE))","v":""}]
[null,null,{"$f":"IF(B568=\"\",\"\",VLOOKUP(B568,Magacin!A7:E4320,2,FALSE))","v":""}]
[null,null,{"$f":"IF(B569=\"\",\"\",VLOOKUP(B569,Magacin!A7:E4321,2,FALSE))","v":""}]
[null,null,{"$f":"IF(B570=\"\",\"\",VLOOKUP(B570,Magacin!A7:E4322,2,FALSE))","v":""}]
[null,null,{"$f":"IF(B571=\"\",\"\",VLOOKUP(B571,Magacin!A7:E4323,2,FALSE))","v":""}]
[null,null,{"$f":"IF(B572=\"\",\"\",VLOOKUP(B572,Magacin!A7:E4324,2,FALSE))","v":""}]
[null,null,{"$f":"IF(B573=\"\",\"\",VLOOKUP(B573,Magacin!A7:E4325,2,FALSE))","v":""}]
[null,null,{"$f":"IF(B574=\"\",\"\",VLOOKUP(B574,Magacin!A7:E4326,2,FALSE))","v":""}]
[null,null,{"$f":"IF(B575=\"\",\"\",VLOOKUP(B575,Magacin!A7:E4327,2,FALSE))","v":""}]
[null,null,{"$f":"IF(B576=\"\",\"\",VLOOKUP(B576,Magacin!A7:E4328,2,FALSE))","v":""}]
[null,null,{"$f":"IF(B577=\"\",\"\",VLOOKUP(B577,Magacin!A7:E4329,2,FALSE))","v":""}]
[null,null,{"$f":"IF(B578=\"\",\"\",VLOOKUP(B578,Magacin!A7:E4330,2,FALSE))","v":""}]
[null,null,{"$f":"IF(B579=\"\",\"\",VLOOKUP(B579,Magacin!A7:E4331,2,FALSE))","v":""}]
[null,null,{"$f":"IF(B580=\"\",\"\",VLOOKUP(B580,Magacin!A7:E4332,2,FALSE))","v":""}]
[null,null,{"$f":"IF(B581=\"\",\"\",VLOOKUP(B581,Magacin!A7:E4333,2,FALSE))","v":""}]
[null,null,{"$f":"IF(B582=\"\",\"\",VLOOKUP(B582,Magacin!A7:E4334,2,FALSE))","v":""}]
[null,null,{"$f":"IF(B583=\"\",\"\",VLOOKUP(B583,Magacin!A7:E4335,2,FALSE))","v":""}]
[null,null,{"$f":"IF(B584=\"\",\"\",VLOOKUP(B584,Magacin!A7:E4336,2,FALSE))","v":""}]
[null,null,{"$f":"IF(B585=\"\",\"\",VLOOKUP(B585,Magacin!A7:E4337,2,FALSE))","v":""}]
[null,null,{"$f":"IF(B586=\"\",\"\",VLOOKUP(B586,Magacin!A7:E4338,2,FALSE))","v":""}]
[null,null,{"$f":"IF(B587=\"\",\"\",VLOOKUP(B587,Magacin!A7:E4339,2,FALSE))","v":""}]
[null,null,{"$f":"IF(B588=\"\",\"\",VLOOKUP(B588,Magacin!A7:E4340,2,FALSE))","v":""}]
[null,null,{"$f":"IF(B589=\"\",\"\",VLOOKUP(B589,Magacin!A7:E4341,2,FALSE))","v":""}]
[null,null,{"$f":"IF(B590=\"\",\"\",VLOOKUP(B590,Magacin!A7:E4342,2,FALSE))","v":""}]
[null,null,{"$f":"IF(B591=\"\",\"\",VLOOKUP(B591,Magacin!A7:E4343,2,FALSE))","v":""}]
[null,null,{"$f":"IF(B592=\"\",\"\",VLOOKUP(B592,Magacin!A7:E4344,2,FALSE))","v":""}]
[null,null,{"$f":"IF(B593=\"\",\"\",VLOOKUP(B593,Magacin!A7:E4345,2,FALSE))","v":""}]
[null,null,{"$f":"IF(B594=\"\",\"\",VLOOKUP(B594,Magacin!A7:E4346,2,FALSE))","v":""}]
[null,null,{"$f":"IF(B595=\"\",\"\",VLOOKUP(B595,Magacin!A7:E4347,2,FALSE))","v":""}]
[null,null,{"$f":"IF(B596=\"\",\"\",VLOOKUP(B596,Magacin!A7:E4348,2,FALSE))","v":""}]
[null,null,{"$f":"IF(B597=\"\",\"\",VLOOKUP(B597,Magacin!A7:E4349,2,FALSE))","v":""}]
[null,null,{"$f":"IF(B598=\"\",\"\",VLOOKUP(B598,Magacin!A7:E4350,2,FALSE))","v":""}]
[null,null,{"$f":"IF(B599=\"\",\"\",VLOOKUP(B599,Magacin!A7:E4351,2,FALSE))","v":""}]
[null,null,{"$f":"IF(B600=\"\",\"\",VLOOKUP(B600,Magacin!A7:E4352,2,FALSE))","v":""}]
[null,null,{"$f":"IF(B601=\"\",\"\",VLOOKUP(B601,Magacin!A7:E4353,2,FALSE))","v":""}]
[null,null,{"$f":"IF(B602=\"\",\"\",VLOOKUP(B602,Magacin!A7:E4354,2,FALSE))","v":""}]
[null,null,{"$f":"IF(B603=\"\",\"\",VLOOKUP(B603,Magacin!A7:E4355,2,FALSE))","v":""}]
[null,null,{"$f":"IF(B604=\"\",\"\",VLOOKUP(B604,Magacin!A7:E4356,2,FALSE))","v":""}]
[null,null,{"$f":"IF(B605=\"\",\"\",VLOOKUP(B605,Magacin!A7:E4357,2,FALSE))","v":""}]
[null,null,{"$f":"IF(B606=\"\",\"\",VLOOKUP(B606,Magacin!A7:E4358,2,FALSE))","v":""}]
[null,null,{"$f":"IF(B607=\"\",\"\",VLOOKUP(B607,Magacin!A7:E4359,2,FALSE))","v":""}]
[null,null,{"$f":"IF(B608=\"\",\"\",VLOOKUP(B608,Magacin!A7:E4360,2,FALSE))","v":""}]
[null,null,{"$f":"IF(B609=\"\",\"\",VLOOKUP(B609,Magacin!A7:E4361,2,FALSE))","v":""}]
[null,null,{"$f":"IF(B610=\"\",\"\",VLOOKUP(B610,Magacin!A7:E4362,2,FALSE))","v":""}]
[null,null,{"$f":"IF(B611=\"\",\"\",VLOOKUP(B611,Magacin!A7:E4363,2,FALSE))","v":""}]
[null,null,{"$f":"IF(B612=\"\",\"\",VLOOKUP(B612,Magacin!A7:E4364,2,FALSE))","v":""}]
[null,null,{"$f":"IF(B613=\"\",\"\",VLOOKUP(B613,Magacin!A7:E4365,2,FALSE))","v":""}]
[null,null,{"$f":"IF(B614=\"\",\"\",VLOOKUP(B614,Magacin!A7:E4366,2,FALSE))","v":""}]
[null,null,{"$f":"IF(B615=\"\",\"\",VLOOKUP(B615,Magacin!A7:E4367,2,FALSE))","v":""}]
[null,null,{"$f":"IF(B616=\"\",\"\",VLOOKUP(B616,Magacin!A7:E4368,2,FALSE))","v":""}]
[null,null,{"$f":"IF(B617=\"\",\"\",VLOOKUP(B617,Magacin!A7:E4369,2,FALSE))","v":""}]
[null,null,{"$f":"IF(B618=\"\",\"\",VLOOKUP(B618,Magacin!A7:E4370,2,FALSE))","v":""}]
[null,null,{"$f":"IF(B619=\"\",\"\",VLOOKUP(B619,Magacin!A7:E4371,2,FALSE))","v":""}]
[null,null,{"$f":"IF(B620=\"\",\"\",VLOOKUP(B620,Magacin!A7:E4372,2,FALSE))","v":""}]
[null,null,{"$f":"IF(B621=\"\",\"\",VLOOKUP(B621,Magacin!A7:E4373,2,FALSE))","v":""}]
[null,null,{"$f":"IF(B622=\"\",\"\",VLOOKUP(B622,Magacin!A7:E4374,2,FALSE))","v":""}]
[null,null,{"$f":"IF(B623=\"\",\"\",VLOOKUP(B623,Magacin!A7:E4375,2,FALSE))","v":""}]
[null,null,{"$f":"IF(B624=\"\",\"\",VLOOKUP(B624,Magacin!A7:E4376,2,FALSE))","v":""}]
[null,null,{"$f":"IF(B625=\"\",\"\",VLOOKUP(B625,Magacin!A7:E4377,2,FALSE))","v":""}]
[null,null,{"$f":"IF(B626=\"\",\"\",VLOOKUP(B626,Magacin!A7:E4378,2,FALSE))","v":""}]
[null,null,{"$f":"IF(B627=\"\",\"\",VLOOKUP(B627,Magacin!A7:E4379,2,FALSE))","v":""}]
[null,null,{"$f":"IF(B628=\"\",\"\",VLOOKUP(B628,Magacin!A7:E4380,2,FALSE))","v":""}]
[null,null,{"$f":"IF(B629=\"\",\"\",VLOOKUP(B629,Magacin!A7:E4381,2,FALSE))","v":""}]
[null,null,{"$f":"IF(B630=\"\",\"\",VLOOKUP(B630,Magacin!A7:E4382,2,FALSE))","v":""}]
[null,null,{"$f":"IF(B631=\"\",\"\",VLOOKUP(B631,Magacin!A7:E4383,2,FALSE))","v":""}]
[null,null,{"$f":"IF(B632=\"\",\"\",VLOOKUP(B632,Magacin!A7:E4384,2,FALSE))","v":""}]
[null,null,{"$f":"IF(B633=\"\",\"\",VLOOKUP(B633,Magacin!A7:E4385,2,FALSE))","v":""}]
[null,null,{"$f":"IF(B634=\"\",\"\",VLOOKUP(B634,Magacin!A7:E4386,2,FALSE))","v":""}]
[null,null,{"$f":"IF(B635=\"\",\"\",VLOOKUP(B635,Magacin!A7:E4387,2,FALSE))","v":""}]
[null,null,{"$f":"IF(B636=\"\",\"\",VLOOKUP(B636,Magacin!A7:E4388,2,FALSE))","v":""}]
[null,null,{"$f":"IF(B637=\"\",\"\",VLOOKUP(B637,Magacin!A7:E4389,2,FALSE))","v":""}]
[null,null,{"$f":"IF(B638=\"\",\"\",VLOOKUP(B638,Magacin!A7:E4390,2,FALSE))","v":""}]
[null,null,{"$f":"IF(B639=\"\",\"\",VLOOKUP(B639,Magacin!A7:E4391,2,FALSE))","v":""}]
[null,null,{"$f":"IF(B640=\"\",\"\",VLOOKUP(B640,Magacin!A7:E4392,2,FALSE))","v":""}]
[null,null,{"$f":"IF(B641=\"\",\"\",VLOOKUP(B641,Magacin!A7:E4393,2,FALSE))","v":""}]
[null,null,{"$f":"IF(B642=\"\",\"\",VLOOKUP(B642,Magacin!A7:E4394,2,FALSE))","v":""}]
[null,null,{"$f":"IF(B643=\"\",\"\",VLOOKUP(B643,Magacin!A7:E4395,2,FALSE))","v":""}]
[null,null,{"$f":"IF(B644=\"\",\"\",VLOOKUP(B644,Magacin!A7:E4396,2,FALSE))","v":""}]
[null,null,{"$f":"IF(B645=\"\",\"\",VLOOKUP(B645,Magacin!A7:E4397,2,FALSE))","v":""}]
[null,null,{"$f":"IF(B646=\"\",\"\",VLOOKUP(B646,Magacin!A7:E4398,2,FALSE))","v":""}]
[null,null,{"$f":"IF(B647=\"\",\"\",VLOOKUP(B647,Magacin!A7:E4399,2,FALSE))","v":""}]
[null,null,{"$f":"IF(B648=\"\",\"\",VLOOKUP(B648,Magacin!A7:E4400,2,FALSE))","v":""}]
[null,null,{"$f":"IF(B649=\"\",\"\",VLOOKUP(B649,Magacin!A7:E4401,2,FALSE))","v":""}]
[null,null,{"$f":"IF(B650=\"\",\"\",VLOOKUP(B650,Magacin!A7:E4402,2,FALSE))","v":""}]
[null,null,{"$f":"IF(B651=\"\",\"\",VLOOKUP(B651,Magacin!A7:E4403,2,FALSE))","v":""}]
[null,null,{"$f":"IF(B652=\"\",\"\",VLOOKUP(B652,Magacin!A7:E4404,2,FALSE))","v":""}]
[null,null,{"$f":"IF(B653=\"\",\"\",VLOOKUP(B653,Magacin!A7:E4405,2,FALSE))","v":""}]
[null,null,{"$f":"IF(B654=\"\",\"\",VLOOKUP(B654,Magacin!A7:E4406,2,FALSE))","v":""}]
[null,null,{"$f":"IF(B655=\"\",\"\",VLOOKUP(B655,Magacin!A7:E4407,2,FALSE))","v":""}]
[null,null,{"$f":"IF(B656=\"\",\"\",VLOOKUP(B656,Magacin!A7:E4408,2,FALSE))","v":""}]
[null,null,{"$f":"IF(B657=\"\",\"\",VLOOKUP(B657,Magacin!A7:E4409,2,FALSE))","v":""}]
[null,null,{"$f":"IF(B658=\"\",\"\",VLOOKUP(B658,Magacin!A7:E4410,2,FALSE))","v":""}]
[null,null,{"$f":"IF(B659=\"\",\"\",VLOOKUP(B659,Magacin!A7:E4411,2,FALSE))","v":""}]
[null,null,{"$f":"IF(B660=\"\",\"\",VLOOKUP(B660,Magacin!A7:E4412,2,FALSE))","v":""}]
[null,null,{"$f":"IF(B661=\"\",\"\",VLOOKUP(B661,Magacin!A7:E4413,2,FALSE))","v":""}]
[null,null,{"$f":"IF(B662=\"\",\"\",VLOOKUP(B662,Magacin!A7:E4414,2,FALSE))","v":""}]
[null,null,{"$f":"IF(B663=\"\",\"\",VLOOKUP(B663,Magacin!A7:E4415,2,FALSE))","v":""}]
[null,null,{"$f":"IF(B664=\"\",\"\",VLOOKUP(B664,Magacin!A7:E4416,2,FALSE))","v":""}]
[null,null,{"$f":"IF(B665=\"\",\"\",VLOOKUP(B665,Magacin!A7:E4417,2,FALSE))","v":""}]
[null,null,{"$f":"IF(B666=\"\",\"\",VLOOKUP(B666,Magacin!A7:E4418,2,FALSE))","v":""}]
[null,null,{"$f":"IF(B667=\"\",\"\",VLOOKUP(B667,Magacin!A7:E4419,2,FALSE))","v":""}]
[null,null,{"$f":"IF(B668=\"\",\"\",VLOOKUP(B668,Magacin!A7:E4420,2,FALSE))","v":""}]
[null,null,{"$f":"IF(B669=\"\",\"\",VLOOKUP(B669,Magacin!A7:E4421,2,FALSE))","v":""}]
[null,null,{"$f":"IF(B670=\"\",\"\",VLOOKUP(B670,Magacin!A7:E4422,2,FALSE))","v":""}]
[null,null,{"$f":"IF(B671=\"\",\"\",VLOOKUP(B671,Magacin!A7:E4423,2,FALSE))","v":""}]
[null,null,{"$f":"IF(B672=\"\",\"\",VLOOKUP(B672,Magacin!A7:E4424,2,FALSE))","v":""}]
[null,null,{"$f":"IF(B673=\"\",\"\",VLOOKUP(B673,Magacin!A7:E4425,2,FALSE))","v":""}]
[null,null,{"$f":"IF(B674=\"\",\"\",VLOOKUP(B674,Magacin!A7:E4426,2,FALSE))","v":""}]
[null,null,{"$f":"IF(B675=\"\",\"\",VLOOKUP(B675,Magacin!A7:E4427,2,FALSE))","v":""}]
[null,null,{"$f":"IF(B676=\"\",\"\",VLOOKUP(B676,Magacin!A7:E4428,2,FALSE))","v":""}]
[null,null,{"$f":"IF(B677=\"\",\"\",VLOOKUP(B677,Magacin!A7:E4429,2,FALSE))","v":""}]
[null,null,{"$f":"IF(B678=\"\",\"\",VLOOKUP(B678,Magacin!A7:E4430,2,FALSE))","v":""}]
[null,null,{"$f":"IF(B679=\"\",\"\",VLOOKUP(B679,Magacin!A7:E4431,2,FALSE))","v":""}]
[null,null,{"$f":"IF(B680=\"\",\"\",VLOOKUP(B680,Magacin!A7:E4432,2,FALSE))","v":""}]
[null,null,{"$f":"IF(B681=\"\",\"\",VLOOKUP(B681,Magacin!A7:E4433,2,FALSE))","v":""}]
[null,null,{"$f":"IF(B682=\"\",\"\",VLOOKUP(B682,Magacin!A7:E4434,2,FALSE))","v":""}]
[null,null,{"$f":"IF(B683=\"\",\"\",VLOOKUP(B683,Magacin!A7:E4435,2,FALSE))","v":""}]
[null,null,{"$f":"IF(B684=\"\",\"\",VLOOKUP(B684,Magacin!A7:E4436,2,FALSE))","v":""}]
[null,null,{"$f":"IF(B685=\"\",\"\",VLOOKUP(B685,Magacin!A7:E4437,2,FALSE))","v":""}]
[null,null,{"$f":"IF(B686=\"\",\"\",VLOOKUP(B686,Magacin!A7:E4438,2,FALSE))","v":""}]
[null,null,{"$f":"IF(B687=\"\",\"\",VLOOKUP(B687,Magacin!A7:E4439,2,FALSE))","v":""}]
[null,null,{"$f":"IF(B688=\"\",\"\",VLOOKUP(B688,Magacin!A7:E4440,2,FALSE))","v":""}]
[null,null,{"$f":"IF(B689=\"\",\"\",VLOOKUP(B689,Magacin!A7:E4441,2,FALSE))","v":""}]
[null,null,{"$f":"IF(B690=\"\",\"\",VLOOKUP(B690,Magacin!A7:E4442,2,FALSE))","v":""}]
[null,null,{"$f":"IF(B691=\"\",\"\",VLOOKUP(B691,Magacin!A7:E4443,2,FALSE))","v":""}]
[null,null,{"$f":"IF(B692=\"\",\"\",VLOOKUP(B692,Magacin!A7:E4444,2,FALSE))","v":""}]
[null,null,{"$f":"IF(B693=\"\",\"\",VLOOKUP(B693,Magacin!A7:E4445,2,FALSE))","v":""}]
[null,null,{"$f":"IF(B694=\"\",\"\",VLOOKUP(B694,Magacin!A7:E4446,2,FALSE))","v":""}]
[null,null,{"$f":"IF(B695=\"\",\"\",VLOOKUP(B695,Magacin!A7:E4447,2,FALSE))","v":""}]
[null,null,{"$f":"IF(B696=\"\",\"\",VLOOKUP(B696,Magacin!A7:E4448,2,FALSE))","v":""}]
[null,null,{"$f":"IF(B697=\"\",\"\",VLOOKUP(B697,Magacin!A7:E4449,2,FALSE))","v":""}]
[null,null,{"$f":"IF(B698=\"\",\"\",VLOOKUP(B698,Magacin!A7:E4450,2,FALSE))","v":""}]
[null,null,{"$f":"IF(B699=\"\",\"\",VLOOKUP(B699,Magacin!A7:E4451,2,FALSE))","v":""}]
[null,null,{"$f":"IF(B700=\"\",\"\",VLOOKUP(B700,Magacin!A7:E4452,2,FALSE))","v":""}]
[null,null,{"$f":"IF(B701=\"\",\"\",VLOOKUP(B701,Magacin!A7:E4453,2,FALSE))","v":""}]
[null,null,{"$f":"IF(B702=\"\",\"\",VLOOKUP(B702,Magacin!A7:E4454,2,FALSE))","v":""}]
[null,null,{"$f":"IF(B703=\"\",\"\",VLOOKUP(B703,Magacin!A7:E4455,2,FALSE))","v":""}]
[null,null,{"$f":"IF(B704=\"\",\"\",VLOOKUP(B704,Magacin!A7:E4456,2,FALSE))","v":""}]
[null,null,{"$f":"IF(B705=\"\",\"\",VLOOKUP(B705,Magacin!A7:E4457,2,FALSE))","v":""}]
[null,null,{"$f":"IF(B706=\"\",\"\",VLOOKUP(B706,Magacin!A7:E4458,2,FALSE))","v":""}]
[null,null,{"$f":"IF(B707=\"\",\"\",VLOOKUP(B707,Magacin!A7:E4459,2,FALSE))","v":""}]
[null,null,{"$f":"IF(B708=\"\",\"\",VLOOKUP(B708,Magacin!A7:E4460,2,FALSE))","v":""}]
[null,null,{"$f":"IF(B709=\"\",\"\",VLOOKUP(B709,Magacin!A7:E4461,2,FALSE))","v":""}]
[null,null,{"$f":"IF(B710=\"\",\"\",VLOOKUP(B710,Magacin!A7:E4462,2,FALSE))","v":""}]
[null,null,{"$f":"IF(B711=\"\",\"\",VLOOKUP(B711,Magacin!A7:E4463,2,FALSE))","v":""}]
[null,null,{"$f":"IF(B712=\"\",\"\",VLOOKUP(B712,Magacin!A7:E4464,2,FALSE))","v":""}]
[null,null,{"$f":"IF(B713=\"\",\"\",VLOOKUP(B713,Magacin!A7:E4465,2,FALSE))","v":""}]
[null,null,{"$f":"IF(B714=\"\",\"\",VLOOKUP(B714,Magacin!A7:E4466,2,FALSE))","v":""}]
[null,null,{"$f":"IF(B715=\"\",\"\",VLOOKUP(B715,Magacin!A7:E4467,2,FALSE))","v":""}]
[null,null,{"$f":"IF(B716=\"\",\"\",VLOOKUP(B716,Magacin!A7:E4468,2,FALSE))","v":""}]
[null,null,{"$f":"IF(B717=\"\",\"\",VLOOKUP(B717,Magacin!A7:E4469,2,FALSE))","v":""}]
[null,null,{"$f":"IF(B718=\"\",\"\",VLOOKUP(B718,Magacin!A7:E4470,2,FALSE))","v":""}]
[null,null,{"$f":"IF(B719=\"\",\"\",VLOOKUP(B719,Magacin!A7:E4471,2,FALSE))","v":""}]
[null,null,{"$f":"IF(B720=\"\",\"\",VLOOKUP(B720,Magacin!A7:E4472,2,FALSE))","v":""}]
[null,null,{"$f":"IF(B721=\"\",\"\",VLOOKUP(B721,Magacin!A7:E4473,2,FALSE))","v":""}]
[null,null,{"$f":"IF(B722=\"\",\"\",VLOOKUP(B722,Magacin!A7:E4474,2,FALSE))","v":""}]
[null,null,{"$f":"IF(B723=\"\",\"\",VLOOKUP(B723,Magacin!A7:E4475,2,FALSE))","v":""}]
[null,null,{"$f":"IF(B724=\"\",\"\",VLOOKUP(B724,Magacin!A7:E4476,2,FALSE))","v":""}]
[null,null,{"$f":"IF(B725=\"\",\"\",VLOOKUP(B725,Magacin!A7:E4477,2,FALSE))","v":""}]
[null,null,{"$f":"IF(B726=\"\",\"\",VLOOKUP(B726,Magacin!A7:E4478,2,FALSE))","v":""}]
[null,null,{"$f":"IF(B727=\"\",\"\",VLOOKUP(B727,Magacin!A7:E4479,2,FALSE))","v":""}]
[null,null,{"$f":"IF(B728=\"\",\"\",VLOOKUP(B728,Magacin!A7:E4480,2,FALSE))","v":""}]
[null,null,{"$f":"IF(B729=\"\",\"\",VLOOKUP(B729,Magacin!A7:E4481,2,FALSE))","v":""}]
[null,null,{"$f":"IF(B730=\"\",\"\",VLOOKUP(B730,Magacin!A7:E4482,2,FALSE))","v":""}]
[null,null,{"$f":"IF(B731=\"\",\"\",VLOOKUP(B731,Magacin!A7:E4483,2,FALSE))","v":""}]
[null,null,{"$f":"IF(B732=\"\",\"\",VLOOKUP(B732,Magacin!A7:E4484,2,FALSE))","v":""}]
[null,null,{"$f":"IF(B733=\"\",\"\",VLOOKUP(B733,Magacin!A7:E4485,2,FALSE))","v":""}]
[null,null,{"$f":"IF(B734=\"\",\"\",VLOOKUP(B734,Magacin!A7:E4486,2,FALSE))","v":""}]
[null,null,{"$f":"IF(B735=\"\",\"\",VLOOKUP(B735,Magacin!A7:E4487,2,FALSE))","v":""}]
[null,null,{"$f":"IF(B736=\"\",\"\",VLOOKUP(B736,Magacin!A7:E4488,2,FALSE))","v":""}]
[null,null,{"$f":"IF(B737=\"\",\"\",VLOOKUP(B737,Magacin!A7:E4489,2,FALSE))","v":""}]
[null,null,{"$f":"IF(B738=\"\",\"\",VLOOKUP(B738,Magacin!A7:E4490,2,FALSE))","v":""}]
[null,null,{"$f":"IF(B739=\"\",\"\",VLOOKUP(B739,Magacin!A7:E4491,2,FALSE))","v":""}]
[null,null,{"$f":"IF(B740=\"\",\"\",VLOOKUP(B740,Magacin!A7:E4492,2,FALSE))","v":""}]
[null,null,{"$f":"IF(B741=\"\",\"\",VLOOKUP(B741,Magacin!A7:E4493,2,FALSE))","v":""}]
[null,null,{"$f":"IF(B742=\"\",\"\",VLOOKUP(B742,Magacin!A7:E4494,2,FALSE))","v":""}]
[null,null,{"$f":"IF(B743=\"\",\"\",VLOOKUP(B743,Magacin!A7:E4495,2,FALSE))","v":""}]
[null,null,{"$f":"IF(B744=\"\",\"\",VLOOKUP(B744,Magacin!A7:E4496,2,FALSE))","v":""}]
[null,null,{"$f":"IF(B745=\"\",\"\",VLOOKUP(B745,Magacin!A7:E4497,2,FALSE))","v":""}]
[null,null,{"$f":"IF(B746=\"\",\"\",VLOOKUP(B746,Magacin!A7:E4498,2,FALSE))","v":""}]
[null,null,{"$f":"IF(B747=\"\",\"\",VLOOKUP(B747,Magacin!A7:E4499,2,FALSE))","v":""}]
[null,null,{"$f":"IF(B748=\"\",\"\",VLOOKUP(B748,Magacin!A7:E4500,2,FALSE))","v":""}]
[null,null,{"$f":"IF(B749=\"\",\"\",VLOOKUP(B749,Magacin!A7:E4501,2,FALSE))","v":""}]
[null,null,{"$f":"IF(B750=\"\",\"\",VLOOKUP(B750,Magacin!A7:E4502,2,FALSE))","v":""}]
[null,null,{"$f":"IF(B751=\"\",\"\",VLOOKUP(B751,Magacin!A7:E4503,2,FALSE))","v":""}]
[null,null,{"$f":"IF(B752=\"\",\"\",VLOOKUP(B752,Magacin!A7:E4504,2,FALSE))","v":""}]
[null,null,{"$f":"IF(B753=\"\",\"\",VLOOKUP(B753,Magacin!A7:E4505,2,FALSE))","v":""}]
[null,null,{"$f":"IF(B754=\"\",\"\",VLOOKUP(B754,Magacin!A7:E4506,2,FALSE))","v":""}]
[null,null,{"$f":"IF(B755=\"\",\"\",VLOOKUP(B755,Magacin!A7:E4507,2,FALSE))","v":""}]
[null,null,{"$f":"IF(B756=\"\",\"\",VLOOKUP(B756,Magacin!A7:E4508,2,FALSE))","v":""}]
[null,null,{"$f":"IF(B757=\"\",\"\",VLOOKUP(B757,Magacin!A7:E4509,2,FALSE))","v":""}]
[null,null,{"$f":"IF(B758=\"\",\"\",VLOOKUP(B758,Magacin!A7:E4510,2,FALSE))","v":""}]
[null,null,{"$f":"IF(B759=\"\",\"\",VLOOKUP(B759,Magacin!A7:E4511,2,FALSE))","v":""}]
[null,null,{"$f":"IF(B760=\"\",\"\",VLOOKUP(B760,Magacin!A7:E4512,2,FALSE))","v":""}]
[null,null,{"$f":"IF(B761=\"\",\"\",VLOOKUP(B761,Magacin!A7:E4513,2,FALSE))","v":""}]
[null,null,{"$f":"IF(B762=\"\",\"\",VLOOKUP(B762,Magacin!A7:E4514,2,FALSE))","v":""}]
[null,null,{"$f":"IF(B763=\"\",\"\",VLOOKUP(B763,Magacin!A7:E4515,2,FALSE))","v":""}]
[null,null,{"$f":"IF(B764=\"\",\"\",VLOOKUP(B764,Magacin!A7:E4516,2,FALSE))","v":""}]
[null,null,{"$f":"IF(B765=\"\",\"\",VLOOKUP(B765,Magacin!A7:E4517,2,FALSE))","v":""}]
[null,null,{"$f":"IF(B766=\"\",\"\",VLOOKUP(B766,Magacin!A7:E4518,2,FALSE))","v":""}]
[null,null,{"$f":"IF(B767=\"\",\"\",VLOOKUP(B767,Magacin!A7:E4519,2,FALSE))","v":""}]
[null,null,{"$f":"IF(B768=\"\",\"\",VLOOKUP(B768,Magacin!A7:E4520,2,FALSE))","v":""}]
[null,null,{"$f":"IF(B769=\"\",\"\",VLOOKUP(B769,Magacin!A7:E4521,2,FALSE))","v":""}]
[null,null,{"$f":"IF(B770=\"\",\"\",VLOOKUP(B770,Magacin!A7:E4522,2,FALSE))","v":""}]
[null,null,{"$f":"IF(B771=\"\",\"\",VLOOKUP(B771,Magacin!A7:E4523,2,FALSE))","v":""}]
[null,null,{"$f":"IF(B772=\"\",\"\",VLOOKUP(B772,Magacin!A7:E4524,2,FALSE))","v":""}]
[null,null,{"$f":"IF(B773=\"\",\"\",VLOOKUP(B773,Magacin!A7:E4525,2,FALSE))","v":""}]
[null,null,{"$f":"IF(B774=\"\",\"\",VLOOKUP(B774,Magacin!A7:E4526,2,FALSE))","v":""}]
[null,null,{"$f":"IF(B775=\"\",\"\",VLOOKUP(B775,Magacin!A7:E4527,2,FALSE))","v":""}]
[null,null,{"$f":"IF(B776=\"\",\"\",VLOOKUP(B776,Magacin!A7:E4528,2,FALSE))","v":""}]
[null,null,{"$f":"IF(B777=\"\",\"\",VLOOKUP(B777,Magacin!A7:E4529,2,FALSE))","v":""}]
[null,null,{"$f":"IF(B778=\"\",\"\",VLOOKUP(B778,Magacin!A7:E4530,2,FALSE))","v":""}]
[null,null,{"$f":"IF(B779=\"\",\"\",VLOOKUP(B779,Magacin!A7:E4531,2,FALSE))","v":""}]
[null,null,{"$f":"IF(B780=\"\",\"\",VLOOKUP(B780,Magacin!A7:E4532,2,FALSE))","v":""}]
[null,null,{"$f":"IF(B781=\"\",\"\",VLOOKUP(B781,Magacin!A7:E4533,2,FALSE))","v":""}]
[null,null,{"$f":"IF(B782=\"\",\"\",VLOOKUP(B782,Magacin!A7:E4534,2,FALSE))","v":""}]
[null,null,{"$f":"IF(B783=\"\",\"\",VLOOKUP(B783,Magacin!A7:E4535,2,FALSE))","v":""}]
[null,null,{"$f":"IF(B784=\"\",\"\",VLOOKUP(B784,Magacin!A7:E4536,2,FALSE))","v":""}]
[null,null,{"$f":"IF(B785=\"\",\"\",VLOOKUP(B785,Magacin!A7:E4537,2,FALSE))","v":""}]
[null,null,{"$f":"IF(B786=\"\",\"\",VLOOKUP(B786,Magacin!A7:E4538,2,FALSE))","v":""}]
[null,null,{"$f":"IF(B787=\"\",\"\",VLOOKUP(B787,Magacin!A7:E4539,2,FALSE))","v":""}]
[null,null,{"$f":"IF(B788=\"\",\"\",VLOOKUP(B788,Magacin!A7:E4540,2,FALSE))","v":""}]
[null,null,{"$f":"IF(B789=\"\",\"\",VLOOKUP(B789,Magacin!A7:E4541,2,FALSE))","v":""}]
[null,null,{"$f":"IF(B790=\"\",\"\",VLOOKUP(B790,Magacin!A7:E4542,2,FALSE))","v":""}]
[null,null,{"$f":"IF(B791=\"\",\"\",VLOOKUP(B791,Magacin!A7:E4543,2,FALSE))","v":""}]
[null,null,{"$f":"IF(B792=\"\",\"\",VLOOKUP(B792,Magacin!A7:E4544,2,FALSE))","v":""}]
[null,null,{"$f":"IF(B793=\"\",\"\",VLOOKUP(B793,Magacin!A7:E4545,2,FALSE))","v":""}]
[null,null,{"$f":"IF(B794=\"\",\"\",VLOOKUP(B794,Magacin!A7:E4546,2,FALSE))","v":""}]
[null,null,{"$f":"IF(B795=\"\",\"\",VLOOKUP(B795,Magacin!A7:E4547,2,FALSE))","v":""}]
[null,null,{"$f":"IF(B796=\"\",\"\",VLOOKUP(B796,Magacin!A7:E4548,2,FALSE))","v":""}]
[null,null,{"$f":"IF(B797=\"\",\"\",VLOOKUP(B797,Magacin!A7:E4549,2,FALSE))","v":""}]
[null,null,{"$f":"IF(B798=\"\",\"\",VLOOKUP(B798,Magacin!A7:E4550,2,FALSE))","v":""}]
[null,null,{"$f":"IF(B799=\"\",\"\",VLOOKUP(B799,Magacin!A7:E4551,2,FALSE))","v":""}]
[null,null,{"$f":"IF(B800=\"\",\"\",VLOOKUP(B800,Magacin!A7:E4552,2,FALSE))","v":""}]
[null,null,{"$f":"IF(B801=\"\",\"\",VLOOKUP(B801,Magacin!A7:E4553,2,FALSE))","v":""}]
[null,null,{"$f":"IF(B802=\"\",\"\",VLOOKUP(B802,Magacin!A7:E4554,2,FALSE))","v":""}]
[null,null,{"$f":"IF(B803=\"\",\"\",VLOOKUP(B803,Magacin!A7:E4555,2,FALSE))","v":""}]
[null,null,{"$f":"IF(B804=\"\",\"\",VLOOKUP(B804,Magacin!A7:E4556,2,FALSE))","v":""}]
[null,null,{"$f":"IF(B805=\"\",\"\",VLOOKUP(B805,Magacin!A7:E4557,2,FALSE))","v":""}]
[null,null,{"$f":"IF(B806=\"\",\"\",VLOOKUP(B806,Magacin!A7:E4558,2,FALSE))","v":""}]
[null,null,{"$f":"IF(B807=\"\",\"\",VLOOKUP(B807,Magacin!A7:E4559,2,FALSE))","v":""}]
[null,null,{"$f":"IF(B808=\"\",\"\",VLOOKUP(B808,Magacin!A7:E4560,2,FALSE))","v":""}]
[null,null,{"$f":"IF(B809=\"\",\"\",VLOOKUP(B809,Magacin!A7:E4561,2,FALSE))","v":""}]
[null,null,{"$f":"IF(B810=\"\",\"\",VLOOKUP(B810,Magacin!A7:E4562,2,FALSE))","v":""}]
[null,null,{"$f":"IF(B811=\"\",\"\",VLOOKUP(B811,Magacin!A7:E4563,2,FALSE))","v":""}]
[null,null,{"$f":"IF(B812=\"\",\"\",VLOOKUP(B812,Magacin!A7:E4564,2,FALSE))","v":""}]
[null,null,{"$f":"IF(B813=\"\",\"\",VLOOKUP(B813,Magacin!A7:E4565,2,FALSE))","v":""}]
[null,null,{"$f":"IF(B814=\"\",\"\",VLOOKUP(B814,Magacin!A7:E4566,2,FALSE))","v":""}]
[null,null,{"$f":"IF(B815=\"\",\"\",VLOOKUP(B815,Magacin!A7:E4567,2,FALSE))","v":""}]
[null,null,{"$f":"IF(B816=\"\",\"\",VLOOKUP(B816,Magacin!A7:E4568,2,FALSE))","v":""}]
[null,null,{"$f":"IF(B817=\"\",\"\",VLOOKUP(B817,Magacin!A7:E4569,2,FALSE))","v":""}]
[null,null,{"$f":"IF(B818=\"\",\"\",VLOOKUP(B818,Magacin!A7:E4570,2,FALSE))","v":""}]
[null,null,{"$f":"IF(B819=\"\",\"\",VLOOKUP(B819,Magacin!A7:E4571,2,FALSE))","v":""}]
[null,null,{"$f":"IF(B820=\"\",\"\",VLOOKUP(B820,Magacin!A7:E4572,2,FALSE))","v":""}]
[null,null,{"$f":"IF(B821=\"\",\"\",VLOOKUP(B821,Magacin!A7:E4573,2,FALSE))","v":""}]
[null,null,{"$f":"IF(B822=\"\",\"\",VLOOKUP(B822,Magacin!A7:E4574,2,FALSE))","v":""}]
[null,null,{"$f":"IF(B823=\"\",\"\",VLOOKUP(B823,Magacin!A7:E4575,2,FALSE))","v":""}]
[null,null,{"$f":"IF(B824=\"\",\"\",VLOOKUP(B824,Magacin!A7:E4576,2,FALSE))","v":""}]
[null,null,{"$f":"IF(B825=\"\",\"\",VLOOKUP(B825,Magacin!A7:E4577,2,FALSE))","v":""}]
[null,null,{"$f":"IF(B826=\"\",\"\",VLOOKUP(B826,Magacin!A7:E4578,2,FALSE))","v":""}]
[null,null,{"$f":"IF(B827=\"\",\"\",VLOOKUP(B827,Magacin!A7:E4579,2,FALSE))","v":""}]
[null,null,{"$f":"IF(B828=\"\",\"\",VLOOKUP(B828,Magacin!A7:E4580,2,FALSE))","v":""}]
[null,null,{"$f":"IF(B829=\"\",\"\",VLOOKUP(B829,Magacin!A7:E4581,2,FALSE))","v":""}]
[null,null,{"$f":"IF(B830=\"\",\"\",VLOOKUP(B830,Magacin!A7:E4582,2,FALSE))","v":""}]
[null,null,{"$f":"IF(B831=\"\",\"\",VLOOKUP(B831,Magacin!A7:E4583,2,FALSE))","v":""}]
[null,null,{"$f":"IF(B832=\"\",\"\",VLOOKUP(B832,Magacin!A7:E4584,2,FALSE))","v":""}]
[null,null,{"$f":"IF(B833=\"\",\"\",VLOOKUP(B833,Magacin!A7:E4585,2,FALSE))","v":""}]
[null,null,{"$f":"IF(B834=\"\",\"\",VLOOKUP(B834,Magacin!A7:E4586,2,FALSE))","v":""}]
[null,null,{"$f":"IF(B835=\"\",\"\",VLOOKUP(B835,Magacin!A7:E4587,2,FALSE))","v":""}]
[null,null,{"$f":"IF(B836=\"\",\"\",VLOOKUP(B836,Magacin!A7:E4588,2,FALSE))","v":""}]
[null,null,{"$f":"IF(B837=\"\",\"\",VLOOKUP(B837,Magacin!A7:E4589,2,FALSE))","v":""}]
[null,null,{"$f":"IF(B838=\"\",\"\",VLOOKUP(B838,Magacin!A7:E4590,2,FALSE))","v":""}]
[null,null,{"$f":"IF(B839=\"\",\"\",VLOOKUP(B839,Magacin!A7:E4591,2,FALSE))","v":""}]
[null,null,{"$f":"IF(B840=\"\",\"\",VLOOKUP(B840,Magacin!A7:E4592,2,FALSE))","v":""}]
[null,null,{"$f":"IF(B841=\"\",\"\",VLOOKUP(B841,Magacin!A7:E4593,2,FALSE))","v":""}]
[null,null,{"$f":"IF(B842=\"\",\"\",VLOOKUP(B842,Magacin!A7:E4594,2,FALSE))","v":""}]
[null,null,{"$f":"IF(B843=\"\",\"\",VLOOKUP(B843,Magacin!A7:E4595,2,FALSE))","v":""}]
[null,null,{"$f":"IF(B844=\"\",\"\",VLOOKUP(B844,Magacin!A7:E4596,2,FALSE))","v":""}]
[null,null,{"$f":"IF(B845=\"\",\"\",VLOOKUP(B845,Magacin!A7:E4597,2,FALSE))","v":""}]
[null,null,{"$f":"IF(B846=\"\",\"\",VLOOKUP(B846,Magacin!A7:E4598,2,FALSE))","v":""}]
[null,null,{"$f":"IF(B847=\"\",\"\",VLOOKUP(B847,Magacin!A7:E4599,2,FALSE))","v":""}]
[null,null,{"$f":"IF(B848=\"\",\"\",VLOOKUP(B848,Magacin!A7:E4600,2,FALSE))","v":""}]
[null,null,{"$f":"IF(B849=\"\",\"\",VLOOKUP(B849,Magacin!A7:E4601,2,FALSE))","v":""}]
[null,null,{"$f":"IF(B850=\"\",\"\",VLOOKUP(B850,Magacin!A7:E4602,2,FALSE))","v":""}]
[null,null,{"$f":"IF(B851=\"\",\"\",VLOOKUP(B851,Magacin!A7:E4603,2,FALSE))","v":""}]
[null,null,{"$f":"IF(B852=\"\",\"\",VLOOKUP(B852,Magacin!A7:E4604,2,FALSE))","v":""}]
[null,null,{"$f":"IF(B853=\"\",\"\",VLOOKUP(B853,Magacin!A7:E4605,2,FALSE))","v":""}]
[null,null,{"$f":"IF(B854=\"\",\"\",VLOOKUP(B854,Magacin!A7:E4606,2,FALSE))","v":""}]
[null,null,{"$f":"IF(B855=\"\",\"\",VLOOKUP(B855,Magacin!A7:E4607,2,FALSE))","v":""}]
[null,null,{"$f":"IF(B856=\"\",\"\",VLOOKUP(B856,Magacin!A7:E4608,2,FALSE))","v":""}]
[null,null,{"$f":"IF(B857=\"\",\"\",VLOOKUP(B857,Magacin!A7:E4609,2,FALSE))","v":""}]
[null,null,{"$f":"IF(B858=\"\",\"\",VLOOKUP(B858,Magacin!A7:E4610,2,FALSE))","v":""}]
[null,null,{"$f":"IF(B859=\"\",\"\",VLOOKUP(B859,Magacin!A7:E4611,2,FALSE))","v":""}]
[null,null,{"$f":"IF(B860=\"\",\"\",VLOOKUP(B860,Magacin!A7:E4612,2,FALSE))","v":""}]
[null,null,{"$f":"IF(B861=\"\",\"\",VLOOKUP(B861,Magacin!A7:E4613,2,FALSE))","v":""}]
[null,null,{"$f":"IF(B862=\"\",\"\",VLOOKUP(B862,Magacin!A7:E4614,2,FALSE))","v":""}]
[null,null,{"$f":"IF(B863=\"\",\"\",VLOOKUP(B863,Magacin!A7:E4615,2,FALSE))","v":""}]
[null,null,{"$f":"IF(B864=\"\",\"\",VLOOKUP(B864,Magacin!A7:E4616,2,FALSE))","v":""}]
[null,null,{"$f":"IF(B865=\"\",\"\",VLOOKUP(B865,Magacin!A7:E4617,2,FALSE))","v":""}]
[null,null,{"$f":"IF(B866=\"\",\"\",VLOOKUP(B866,Magacin!A7:E4618,2,FALSE))","v":""}]
[null,null,{"$f":"IF(B867=\"\",\"\",VLOOKUP(B867,Magacin!A7:E4619,2,FALSE))","v":""}]
[null,null,{"$f":"IF(B868=\"\",\"\",VLOOKUP(B868,Magacin!A7:E4620,2,FALSE))","v":""}]
[null,null,{"$f":"IF(B869=\"\",\"\",VLOOKUP(B869,Magacin!A7:E4621,2,FALSE))","v":""}]
[null,null,{"$f":"IF(B870=\"\",\"\",VLOOKUP(B870,Magacin!A7:E4622,2,FALSE))","v":""}]
[null,null,{"$f":"IF(B871=\"\",\"\",VLOOKUP(B871,Magacin!A7:E4623,2,FALSE))","v":""}]
[null,null,{"$f":"IF(B872=\"\",\"\",VLOOKUP(B872,Magacin!A7:E4624,2,FALSE))","v":""}]
[null,null,{"$f":"IF(B873=\"\",\"\",VLOOKUP(B873,Magacin!A7:E4625,2,FALSE))","v":""}]
[null,null,{"$f":"IF(B874=\"\",\"\",VLOOKUP(B874,Magacin!A7:E4626,2,FALSE))","v":""}]
[null,null,{"$f":"IF(B875=\"\",\"\",VLOOKUP(B875,Magacin!A7:E4627,2,FALSE))","v":""}]
[null,null,{"$f":"IF(B876=\"\",\"\",VLOOKUP(B876,Magacin!A7:E4628,2,FALSE))","v":""}]
[null,null,{"$f":"IF(B877=\"\",\"\",VLOOKUP(B877,Magacin!A7:E4629,2,FALSE))","v":""}]
[null,null,{"$f":"IF(B878=\"\",\"\",VLOOKUP(B878,Magacin!A7:E4630,2,FALSE))","v":""}]
[null,null,{"$f":"IF(B879=\"\",\"\",VLOOKUP(B879,Magacin!A7:E4631,2,FALSE))","v":""}]
[null,null,{"$f":"IF(B880=\"\",\"\",VLOOKUP(B880,Magacin!A7:E4632,2,FALSE))","v":""}]
[null,null,{"$f":"IF(B881=\"\",\"\",VLOOKUP(B881,Magacin!A7:E4633,2,FALSE))","v":""}]
[null,null,{"$f":"IF(B882=\"\",\"\",VLOOKUP(B882,Magacin!A7:E4634,2,FALSE))","v":""}]
[null,null,{"$f":"IF(B883=\"\",\"\",VLOOKUP(B883,Magacin!A7:E4635,2,FALSE))","v":""}]
[null,null,{"$f":"IF(B884=\"\",\"\",VLOOKUP(B884,Magacin!A7:E4636,2,FALSE))","v":""}]
[null,null,{"$f":"IF(B885=\"\",\"\",VLOOKUP(B885,Magacin!A7:E4637,2,FALSE))","v":""}]
[null,null,{"$f":"IF(B886=\"\",\"\",VLOOKUP(B886,Magacin!A7:E4638,2,FALSE))","v":""}]
[null,null,{"$f":"IF(B887=\"\",\"\",VLOOKUP(B887,Magacin!A7:E4639,2,FALSE))","v":""}]
[null,null,{"$f":"IF(B888=\"\",\"\",VLOOKUP(B888,Magacin!A7:E4640,2,FALSE))","v":""}]
[null,null,{"$f":"IF(B889=\"\",\"\",VLOOKUP(B889,Magacin!A7:E4641,2,FALSE))","v":""}]
[null,null,{"$f":"IF(B890=\"\",\"\",VLOOKUP(B890,Magacin!A7:E4642,2,FALSE))","v":""}]
[null,null,{"$f":"IF(B891=\"\",\"\",VLOOKUP(B891,Magacin!A7:E4643,2,FALSE))","v":""}]
[null,null,{"$f":"IF(B892=\"\",\"\",VLOOKUP(B892,Magacin!A7:E4644,2,FALSE))","v":""}]
[null,null,{"$f":"IF(B893=\"\",\"\",VLOOKUP(B893,Magacin!A7:E4645,2,FALSE))","v":""}]
[null,null,{"$f":"IF(B894=\"\",\"\",VLOOKUP(B894,Magacin!A7:E4646,2,FALSE))","v":""}]
[null,null,{"$f":"IF(B895=\"\",\"\",VLOOKUP(B895,Magacin!A7:E4647,2,FALSE))","v":""}]
[null,null,{"$f":"IF(B896=\"\",\"\",VLOOKUP(B896,Magacin!A7:E4648,2,FALSE))","v":""}]
[null,null,{"$f":"IF(B897=\"\",\"\",VLOOKUP(B897,Magacin!A7:E4649,2,FALSE))","v":""}]
[null,null,{"$f":"IF(B898=\"\",\"\",VLOOKUP(B898,Magacin!A7:E4650,2,FALSE))","v":""}]
[null,null,{"$f":"IF(B899=\"\",\"\",VLOOKUP(B899,Magacin!A7:E4651,2,FALSE))","v":""}]
[null,null,{"$f":"IF(B900=\"\",\"\",VLOOKUP(B900,Magacin!A7:E4652,2,FALSE))","v":""}]
[null,null,{"$f":"IF(B901=\"\",\"\",VLOOKUP(B901,Magacin!A7:E4653,2,FALSE))","v":""}]
[null,null,{"$f":"IF(B902=\"\",\"\",VLOOKUP(B902,Magacin!A7:E4654,2,FALSE))","v":""}]
[null,null,{"$f":"IF(B903=\"\",\"\",VLOOKUP(B903,Magacin!A7:E4655,2,FALSE))","v":""}]
[null,null,{"$f":"IF(B904=\"\",\"\",VLOOKUP(B904,Magacin!A7:E4656,2,FALSE))","v":""}]
[null,null,{"$f":"IF(B905=\"\",\"\",VLOOKUP(B905,Magacin!A7:E4657,2,FALSE))","v":""}]
[null,null,{"$f":"IF(B906=\"\",\"\",VLOOKUP(B906,Magacin!A7:E4658,2,FALSE))","v":""}]
[null,null,{"$f":"IF(B907=\"\",\"\",VLOOKUP(B907,Magacin!A7:E4659,2,FALSE))","v":""}]
[null,null,{"$f":"IF(B908=\"\",\"\",VLOOKUP(B908,Magacin!A7:E4660,2,FALSE))","v":""}]
[null,null,{"$f":"IF(B909=\"\",\"\",VLOOKUP(B909,Magacin!A7:E4661,2,FALSE))","v":""}]
[null,null,{"$f":"IF(B910=\"\",\"\",VLOOKUP(B910,Magacin!A7:E4662,2,FALSE))","v":""}]
[null,null,{"$f":"IF(B911=\"\",\"\",VLOOKUP(B911,Magacin!A7:E4663,2,FALSE))","v":""}]
[null,null,{"$f":"IF(B912=\"\",\"\",VLOOKUP(B912,Magacin!A7:E4664,2,FALSE))","v":""}]
[null,null,{"$f":"IF(B913=\"\",\"\",VLOOKUP(B913,Magacin!A7:E4665,2,FALSE))","v":""}]
[null,null,{"$f":"IF(B914=\"\",\"\",VLOOKUP(B914,Magacin!A7:E4666,2,FALSE))","v":""}]
[null,null,{"$f":"IF(B915=\"\",\"\",VLOOKUP(B915,Magacin!A7:E4667,2,FALSE))","v":""}]
[null,null,{"$f":"IF(B916=\"\",\"\",VLOOKUP(B916,Magacin!A7:E4668,2,FALSE))","v":""}]
[null,null,{"$f":"IF(B917=\"\",\"\",VLOOKUP(B917,Magacin!A7:E4669,2,FALSE))","v":""}]
[null,null,{"$f":"IF(B918=\"\",\"\",VLOOKUP(B918,Magacin!A7:E4670,2,FALSE))","v":""}]
[null,null,{"$f":"IF(B919=\"\",\"\",VLOOKUP(B919,Magacin!A7:E4671,2,FALSE))","v":""}]
[null,null,{"$f":"IF(B920=\"\",\"\",VLOOKUP(B920,Magacin!A7:E4672,2,FALSE))","v":""}]
[null,null,{"$f":"IF(B921=\"\",\"\",VLOOKUP(B921,Magacin!A7:E4673,2,FALSE))","v":""}]
[null,null,{"$f":"IF(B922=\"\",\"\",VLOOKUP(B922,Magacin!A7:E4674,2,FALSE))","v":""}]
[null,null,{"$f":"IF(B923=\"\",\"\",VLOOKUP(B923,Magacin!A7:E4675,2,FALSE))","v":""}]
[null,null,{"$f":"IF(B924=\"\",\"\",VLOOKUP(B924,Magacin!A7:E4676,2,FALSE))","v":""}]
[null,null,{"$f":"IF(B925=\"\",\"\",VLOOKUP(B925,Magacin!A7:E4677,2,FALSE))","v":""}]
[null,null,{"$f":"IF(B926=\"\",\"\",VLOOKUP(B926,Magacin!A7:E4678,2,FALSE))","v":""}]
[null,null,{"$f":"IF(B927=\"\",\"\",VLOOKUP(B927,Magacin!A7:E4679,2,FALSE))","v":""}]
[null,null,{"$f":"IF(B928=\"\",\"\",VLOOKUP(B928,Magacin!A7:E4680,2,FALSE))","v":""}]
[null,null,{"$f":"IF(B929=\"\",\"\",VLOOKUP(B929,Magacin!A7:E4681,2,FALSE))","v":""}]
[null,null,{"$f":"IF(B930=\"\",\"\",VLOOKUP(B930,Magacin!A7:E4682,2,FALSE))","v":""}]
[null,null,{"$f":"IF(B931=\"\",\"\",VLOOKUP(B931,Magacin!A7:E4683,2,FALSE))","v":""}]
[null,null,{"$f":"IF(B932=\"\",\"\",VLOOKUP(B932,Magacin!A7:E4684,2,FALSE))","v":""}]
[null,null,{"$f":"IF(B933=\"\",\"\",VLOOKUP(B933,Magacin!A7:E4685,2,FALSE))","v":""}]
[null,null,{"$f":"IF(B934=\"\",\"\",VLOOKUP(B934,Magacin!A7:E4686,2,FALSE))","v":""}]
[null,null,{"$f":"IF(B935=\"\",\"\",VLOOKUP(B935,Magacin!A7:E4687,2,FALSE))","v":""}]
[null,null,{"$f":"IF(B936=\"\",\"\",VLOOKUP(B936,Magacin!A7:E4688,2,FALSE))","v":""}]
[null,null,{"$f":"IF(B937=\"\",\"\",VLOOKUP(B937,Magacin!A7:E4689,2,FALSE))","v":""}]
[null,null,{"$f":"IF(B938=\"\",\"\",VLOOKUP(B938,Magacin!A7:E4690,2,FALSE))","v":""}]
[null,null,{"$f":"IF(B939=\"\",\"\",VLOOKUP(B939,Magacin!A7:E4691,2,FALSE))","v":""}]
[null,null,{"$f":"IF(B940=\"\",\"\",VLOOKUP(B940,Magacin!A7:E4692,2,FALSE))","v":""}]
[null,null,{"$f":"IF(B941=\"\",\"\",VLOOKUP(B941,Magacin!A7:E4693,2,FALSE))","v":""}]
[null,null,{"$f":"IF(B942=\"\",\"\",VLOOKUP(B942,Magacin!A7:E4694,2,FALSE))","v":""}]
[null,null,{"$f":"IF(B943=\"\",\"\",VLOOKUP(B943,Magacin!A7:E4695,2,FALSE))","v":""}]
[null,null,{"$f":"IF(B944=\"\",\"\",VLOOKUP(B944,Magacin!A7:E4696,2,FALSE))","v":""}]
[null,null,{"$f":"IF(B945=\"\",\"\",VLOOKUP(B945,Magacin!A7:E4697,2,FALSE))","v":""}]
[null,null,{"$f":"IF(B946=\"\",\"\",VLOOKUP(B946,Magacin!A7:E4698,2,FALSE))","v":""}]
[null,null,{"$f":"IF(B947=\"\",\"\",VLOOKUP(B947,Magacin!A7:E4699,2,FALSE))","v":""}]
[null,null,{"$f":"IF(B948=\"\",\"\",VLOOKUP(B948,Magacin!A7:E4700,2,FALSE))","v":""}]
[null,null,{"$f":"IF(B949=\"\",\"\",VLOOKUP(B949,Magacin!A7:E4701,2,FALSE))","v":""}]
[null,null,{"$f":"IF(B950=\"\",\"\",VLOOKUP(B950,Magacin!A7:E4702,2,FALSE))","v":""}]
[null,null,{"$f":"IF(B951=\"\",\"\",VLOOKUP(B951,Magacin!A7:E4703,2,FALSE))","v":""}]
[null,null,{"$f":"IF(B952=\"\",\"\",VLOOKUP(B952,Magacin!A7:E4704,2,FALSE))","v":""}]
[null,null,{"$f":"IF(B953=\"\",\"\",VLOOKUP(B953,Magacin!A7:E4705,2,FALSE))","v":""}]
[null,null,{"$f":"IF(B954=\"\",\"\",VLOOKUP(B954,Magacin!A7:E4706,2,FALSE))","v":""}]
[null,null,{"$f":"IF(B955=\"\",\"\",VLOOKUP(B955,Magacin!A7:E4707,2,FALSE))","v":""}]
[null,null,{"$f":"IF(B956=\"\",\"\",VLOOKUP(B956,Magacin!A7:E4708,2,FALSE))","v":""}]
[null,null,{"$f":"IF(B957=\"\",\"\",VLOOKUP(B957,Magacin!A7:E4709,2,FALSE))","v":""}]
[null,null,{"$f":"IF(B958=\"\",\"\",VLOOKUP(B958,Magacin!A7:E4710,2,FALSE))","v":""}]
[null,null,{"$f":"IF(B959=\"\",\"\",VLOOKUP(B959,Magacin!A7:E4711,2,FALSE))","v":""}]
[null,null,{"$f":"IF(B960=\"\",\"\",VLOOKUP(B960,Magacin!A7:E4712,2,FALSE))","v":""}]
[null,null,{"$f":"IF(B961=\"\",\"\",VLOOKUP(B961,Magacin!A7:E4713,2,FALSE))","v":""}]
[null,null,{"$f":"IF(B962=\"\",\"\",VLOOKUP(B962,Magacin!A7:E4714,2,FALSE))","v":""}]
[null,null,{"$f":"IF(B963=\"\",\"\",VLOOKUP(B963,Magacin!A7:E4715,2,FALSE))","v":""}]
[null,null,{"$f":"IF(B964=\"\",\"\",VLOOKUP(B964,Magacin!A7:E4716,2,FALSE))","v":""}]
[null,null,{"$f":"IF(B965=\"\",\"\",VLOOKUP(B965,Magacin!A7:E4717,2,FALSE))","v":""}]
[null,null,{"$f":"IF(B966=\"\",\"\",VLOOKUP(B966,Magacin!A7:E4718,2,FALSE))","v":""}]
[null,null,{"$f":"IF(B967=\"\",\"\",VLOOKUP(B967,Magacin!A7:E4719,2,FALSE))","v":""}]
[null,null,{"$f":"IF(B968=\"\",\"\",VLOOKUP(B968,Magacin!A7:E4720,2,FALSE))","v":""}]
[null,null,{"$f":"IF(B969=\"\",\"\",VLOOKUP(B969,Magacin!A7:E4721,2,FALSE))","v":""}]
[null,null,{"$f":"IF(B970=\"\",\"\",VLOOKUP(B970,Magacin!A7:E4722,2,FALSE))","v":""}]
[null,null,{"$f":"IF(B971=\"\",\"\",VLOOKUP(B971,Magacin!A7:E4723,2,FALSE))","v":""}]
[null,null,{"$f":"IF(B972=\"\",\"\",VLOOKUP(B972,Magacin!A7:E4724,2,FALSE))","v":""}]
[null,null,{"$f":"IF(B973=\"\",\"\",VLOOKUP(B973,Magacin!A7:E4725,2,FALSE))","v":""}]
[null,null,{"$f":"IF(B974=\"\",\"\",VLOOKUP(B974,Magacin!A7:E4726,2,FALSE))","v":""}]
[null,null,{"$f":"IF(B975=\"\",\"\",VLOOKUP(B975,Magacin!A7:E4727,2,FALSE))","v":""}]
[null,null,{"$f":"IF(B976=\"\",\"\",VLOOKUP(B976,Magacin!A7:E4728,2,FALSE))","v":""}]
[null,null,{"$f":"IF(B977=\"\",\"\",VLOOKUP(B977,Magacin!A7:E4729,2,FALSE))","v":""}]
[null,null,{"$f":"IF(B978=\"\",\"\",VLOOKUP(B978,Magacin!A7:E4730,2,FALSE))","v":""}]
[null,null,{"$f":"IF(B979=\"\",\"\",VLOOKUP(B979,Magacin!A7:E4731,2,FALSE))","v":""}]
[null,null,{"$f":"IF(B980=\"\",\"\",VLOOKUP(B980,Magacin!A7:E4732,2,FALSE))","v":""}]
[null,null,{"$f":"IF(B981=\"\",\"\",VLOOKUP(B981,Magacin!A7:E4733,2,FALSE))","v":""}]
[null,null,{"$f":"IF(B982=\"\",\"\",VLOOKUP(B982,Magacin!A7:E4734,2,FALSE))","v":""}]
[null,null,{"$f":"IF(B983=\"\",\"\",VLOOKUP(B983,Magacin!A7:E4735,2,FALSE))","v":""}]
[null,null,{"$f":"IF(B984=\"\",\"\",VLOOKUP(B984,Magacin!A7:E4736,2,FALSE))","v":""}]
[null,null,{"$f":"IF(B985=\"\",\"\",VLOOKUP(B985,Magacin!A7:E4737,2,FALSE))","v":""}]
[null,null,{"$f":"IF(B986=\"\",\"\",VLOOKUP(B986,Magacin!A7:E4738,2,FALSE))","v":""}]
[null,null,{"$f":"IF(B987=\"\",\"\",VLOOKUP(B987,Magacin!A7:E4739,2,FALSE))","v":""}]
[null,null,{"$f":"IF(B988=\"\",\"\",VLOOKUP(B988,Magacin!A7:E4740,2,FALSE))","v":""}]
[null,null,{"$f":"IF(B989=\"\",\"\",VLOOKUP(B989,Magacin!A7:E4741,2,FALSE))","v":""}]
[null,null,{"$f":"IF(B990=\"\",\"\",VLOOKUP(B990,Magacin!A7:E4742,2,FALSE))","v":""}]
[null,null,{"$f":"IF(B991=\"\",\"\",VLOOKUP(B991,Magacin!A7:E4743,2,FALSE))","v":""}]
[null,null,{"$f":"IF(B992=\"\",\"\",VLOOKUP(B992,Magacin!A7:E4744,2,FALSE))","v":""}]
[null,null,{"$f":"IF(B993=\"\",\"\",VLOOKUP(B993,Magacin!A7:E4745,2,FALSE))","v":""}]
[null,null,{"$f":"IF(B994=\"\",\"\",VLOOKUP(B994,Magacin!A7:E4746,2,FALSE))","v":""}]
[null,null,{"$f":"IF(B995=\"\",\"\",VLOOKUP(B995,Magacin!A7:E4747,2,FALSE))","v":""}]
[null,null,{"$f":"IF(B996=\"\",\"\",VLOOKUP(B996,Magacin!A7:E4748,2,FALSE))","v":""}]
[null,null,{"$f":"IF(B997=\"\",\"\",VLOOKUP(B997,Magacin!A7:E4749,2,FALSE))","v":""}]
[null,null,{"$f":"IF(B998=\"\",\"\",VLOOKUP(B998,Magacin!A7:E4750,2,FALSE))","v":""}]
[null,null,{"$f":"IF(B999=\"\",\"\",VLOOKUP(B999,Magacin!A7:E4751,2,FALSE))","v":""}]
[null,null,{"$f":"IF(B1000=\"\",\"\",VLOOKUP(B1000,Magacin!A7:E4752,2,FALSE))","v":""}]
[null,null,{"$f":"IF(B1001=\"\",\"\",VLOOKUP(B1001,Magacin!A7:E4753,2,FALSE))","v":""}]
[null,null,{"$f":"IF(B1002=\"\",\"\",VLOOKUP(B1002,Magacin!A7:E4754,2,FALSE))","v":""}]
[null,null,{"$f":"IF(B1003=\"\",\"\",VLOOKUP(B1003,Magacin!A7:E4755,2,FALSE))","v":""}]
[null,null,{"$f":"IF(B1004=\"\",\"\",VLOOKUP(B1004,Magacin!A7:E4756,2,FALSE))","v":""}]
[null,null,{"$f":"IF(B1005=\"\",\"\",VLOOKUP(B1005,Magacin!A7:E4757,2,FALSE))","v":""}]
[null,null,{"$f":"IF(B1006=\"\",\"\",VLOOKUP(B1006,Magacin!A7:E4758,2,FALSE))","v":""}]
[null,null,{"$f":"IF(B1007=\"\",\"\",VLOOKUP(B1007,Magacin!A7:E4759,2,FALSE))","v":""}]
[null,null,{"$f":"IF(B1008=\"\",\"\",VLOOKUP(B1008,Magacin!A7:E4760,2,FALSE))","v":""}]
[null,null,{"$f":"IF(B1009=\"\",\"\",VLOOKUP(B1009,Magacin!A7:E4761,2,FALSE))","v":""}]
[null,null,{"$f":"IF(B1010=\"\",\"\",VLOOKUP(B1010,Magacin!A7:E4762,2,FALSE))","v":""}]
[null,null,{"$f":"IF(B1011=\"\",\"\",VLOOKUP(B1011,Magacin!A7:E4763,2,FALSE))","v":""}]
[null,null,{"$f":"IF(B1012=\"\",\"\",VLOOKUP(B1012,Magacin!A7:E4764,2,FALSE))","v":""}]
[null,null,{"$f":"IF(B1013=\"\",\"\",VLOOKUP(B1013,Magacin!A7:E4765,2,FALSE))","v":""}]
[null,null,{"$f":"IF(B1014=\"\",\"\",VLOOKUP(B1014,Magacin!A7:E4766,2,FALSE))","v":""}]
[null,null,{"$f":"IF(B1015=\"\",\"\",VLOOKUP(B1015,Magacin!A7:E4767,2,FALSE))","v":""}]
[null,null,{"$f":"IF(B1016=\"\",\"\",VLOOKUP(B1016,Magacin!A7:E4768,2,FALSE))","v":""}]
[null,null,{"$f":"IF(B1017=\"\",\"\",VLOOKUP(B1017,Magacin!A7:E4769,2,FALSE))","v":""}]
[null,null,{"$f":"IF(B1018=\"\",\"\",VLOOKUP(B1018,Magacin!A7:E4770,2,FALSE))","v":""}]
[null,null,{"$f":"IF(B1019=\"\",\"\",VLOOKUP(B1019,Magacin!A7:E4771,2,FALSE))","v":""}]
[null,null,{"$f":"IF(B1020=\"\",\"\",VLOOKUP(B1020,Magacin!A7:E4772,2,FALSE))","v":""}]
[null,null,{"$f":"IF(B1021=\"\",\"\",VLOOKUP(B1021,Magacin!A7:E4773,2,FALSE))","v":""}]
[null,null,{"$f":"IF(B1022=\"\",\"\",VLOOKUP(B1022,Magacin!A7:E4774,2,FALSE))","v":""}]
[null,null,{"$f":"IF(B1023=\"\",\"\",VLOOKUP(B1023,Magacin!A7:E4775,2,FALSE))","v":""}]
[null,null,{"$f":"IF(B1024=\"\",\"\",VLOOKUP(B1024,Magacin!A7:E4776,2,FALSE))","v":""}]
[null,null,{"$f":"IF(B1025=\"\",\"\",VLOOKUP(B1025,Magacin!A7:E4777,2,FALSE))","v":""}]
[null,null,{"$f":"IF(B1026=\"\",\"\",VLOOKUP(B1026,Magacin!A7:E4778,2,FALSE))","v":""}]
[null,null,{"$f":"IF(B1027=\"\",\"\",VLOOKUP(B1027,Magacin!A7:E4779,2,FALSE))","v":""}]
[null,null,{"$f":"IF(B1028=\"\",\"\",VLOOKUP(B1028,Magacin!A7:E4780,2,FALSE))","v":""}]
[null,null,{"$f":"IF(B1029=\"\",\"\",VLOOKUP(B1029,Magacin!A7:E4781,2,FALSE))","v":""}]
[null,null,{"$f":"IF(B1030=\"\",\"\",VLOOKUP(B1030,Magacin!A7:E4782,2,FALSE))","v":""}]
[null,null,{"$f":"IF(B1031=\"\",\"\",VLOOKUP(B1031,Magacin!A7:E4783,2,FALSE))","v":""}]
[null,null,{"$f":"IF(B1032=\"\",\"\",VLOOKUP(B1032,Magacin!A7:E4784,2,FALSE))","v":""}]
[null,null,{"$f":"IF(B1033=\"\",\"\",VLOOKUP(B1033,Magacin!A7:E4785,2,FALSE))","v":""}]
[null,null,{"$f":"IF(B1034=\"\",\"\",VLOOKUP(B1034,Magacin!A7:E4786,2,FALSE))","v":""}]
[null,null,{"$f":"IF(B1035=\"\",\"\",VLOOKUP(B1035,Magacin!A7:E4787,2,FALSE))","v":""}]
[null,null,{"$f":"IF(B1036=\"\",\"\",VLOOKUP(B1036,Magacin!A7:E4788,2,FALSE))","v":""}]
[null,null,{"$f":"IF(B1037=\"\",\"\",VLOOKUP(B1037,Magacin!A7:E4789,2,FALSE))","v":""}]
[null,null,{"$f":"IF(B1038=\"\",\"\",VLOOKUP(B1038,Magacin!A7:E4790,2,FALSE))","v":""}]
[null,null,{"$f":"IF(B1039=\"\",\"\",VLOOKUP(B1039,Magacin!A7:E4791,2,FALSE))","v":""}]
[null,null,{"$f":"IF(B1040=\"\",\"\",VLOOKUP(B1040,Magacin!A7:E4792,2,FALSE))","v":""}]
[null,null,{"$f":"IF(B1041=\"\",\"\",VLOOKUP(B1041,Magacin!A7:E4793,2,FALSE))","v":""}]
[null,null,{"$f":"IF(B1042=\"\",\"\",VLOOKUP(B1042,Magacin!A7:E4794,2,FALSE))","v":""}]
[null,null,{"$f":"IF(B1043=\"\",\"\",VLOOKUP(B1043,Magacin!A7:E4795,2,FALSE))","v":""}]
[null,null,{"$f":"IF(B1044=\"\",\"\",VLOOKUP(B1044,Magacin!A7:E4796,2,FALSE))","v":""}]
[null,null,{"$f":"IF(B1045=\"\",\"\",VLOOKUP(B1045,Magacin!A7:E4797,2,FALSE))","v":""}]
[null,null,{"$f":"IF(B1046=\"\",\"\",VLOOKUP(B1046,Magacin!A7:E4798,2,FALSE))","v":""}]
[null,null,{"$f":"IF(B1047=\"\",\"\",VLOOKUP(B1047,Magacin!A7:E4799,2,FALSE))","v":""}]
[null,null,{"$f":"IF(B1048=\"\",\"\",VLOOKUP(B1048,Magacin!A7:E4800,2,FALSE))","v":""}]
[null,null,{"$f":"IF(B1049=\"\",\"\",VLOOKUP(B1049,Magacin!A7:E4801,2,FALSE))","v":""}]
[null,null,{"$f":"IF(B1050=\"\",\"\",VLOOKUP(B1050,Magacin!A7:E4802,2,FALSE))","v":""}]
[null,null,{"$f":"IF(B1051=\"\",\"\",VLOOKUP(B1051,Magacin!A7:E4803,2,FALSE))","v":""}]
[null,null,{"$f":"IF(B1052=\"\",\"\",VLOOKUP(B1052,Magacin!A7:E4804,2,FALSE))","v":""}]
[null,null,{"$f":"IF(B1053=\"\",\"\",VLOOKUP(B1053,Magacin!A7:E4805,2,FALSE))","v":""}]
[null,null,{"$f":"IF(B1054=\"\",\"\",VLOOKUP(B1054,Magacin!A7:E4806,2,FALSE))","v":""}]
[null,null,{"$f":"IF(B1055=\"\",\"\",VLOOKUP(B1055,Magacin!A7:E4807,2,FALSE))","v":""}]
[null,null,{"$f":"IF(B1056=\"\",\"\",VLOOKUP(B1056,Magacin!A7:E4808,2,FALSE))","v":""}]
[null,null,{"$f":"IF(B1057=\"\",\"\",VLOOKUP(B1057,Magacin!A7:E4809,2,FALSE))","v":""}]
[null,null,{"$f":"IF(B1058=\"\",\"\",VLOOKUP(B1058,Magacin!A7:E4810,2,FALSE))","v":""}]
[null,null,{"$f":"IF(B1059=\"\",\"\",VLOOKUP(B1059,Magacin!A7:E4811,2,FALSE))","v":""}]
[null,null,{"$f":"IF(B1060=\"\",\"\",VLOOKUP(B1060,Magacin!A7:E4812,2,FALSE))","v":""}]
[null,null,{"$f":"IF(B1061=\"\",\"\",VLOOKUP(B1061,Magacin!A7:E4813,2,FALSE))","v":""}]
[null,null,{"$f":"IF(B1062=\"\",\"\",VLOOKUP(B1062,Magacin!A7:E4814,2,FALSE))","v":""}]
[null,null,{"$f":"IF(B1063=\"\",\"\",VLOOKUP(B1063,Magacin!A7:E4815,2,FALSE))","v":""}]
[null,null,{"$f":"IF(B1064=\"\",\"\",VLOOKUP(B1064,Magacin!A7:E4816,2,FALSE))","v":""}]
[null,null,{"$f":"IF(B1065=\"\",\"\",VLOOKUP(B1065,Magacin!A7:E4817,2,FALSE))","v":""}]
[null,null,{"$f":"IF(B1066=\"\",\"\",VLOOKUP(B1066,Magacin!A7:E4818,2,FALSE))","v":""}]
[null,null,{"$f":"IF(B1067=\"\",\"\",VLOOKUP(B1067,Magacin!A7:E4819,2,FALSE))","v":""}]
[null,null,{"$f":"IF(B1068=\"\",\"\",VLOOKUP(B1068,Magacin!A7:E4820,2,FALSE))","v":""}]
[null,null,{"$f":"IF(B1069=\"\",\"\",VLOOKUP(B1069,Magacin!A7:E4821,2,FALSE))","v":""}]
[null,null,{"$f":"IF(B1070=\"\",\"\",VLOOKUP(B1070,Magacin!A7:E4822,2,FALSE))","v":""}]
[null,null,{"$f":"IF(B1071=\"\",\"\",VLOOKUP(B1071,Magacin!A7:E4823,2,FALSE))","v":""}]
[null,null,{"$f":"IF(B1072=\"\",\"\",VLOOKUP(B1072,Magacin!A7:E4824,2,FALSE))","v":""}]
[null,null,{"$f":"IF(B1073=\"\",\"\",VLOOKUP(B1073,Magacin!A7:E4825,2,FALSE))","v":""}]
[null,null,{"$f":"IF(B1074=\"\",\"\",VLOOKUP(B1074,Magacin!A7:E4826,2,FALSE))","v":""}]
[null,null,{"$f":"IF(B1075=\"\",\"\",VLOOKUP(B1075,Magacin!A7:E4827,2,FALSE))","v":""}]
[null,null,{"$f":"IF(B1076=\"\",\"\",VLOOKUP(B1076,Magacin!A7:E4828,2,FALSE))","v":""}]
[null,null,{"$f":"IF(B1077=\"\",\"\",VLOOKUP(B1077,Magacin!A7:E4829,2,FALSE))","v":""}]
[null,null,{"$f":"IF(B1078=\"\",\"\",VLOOKUP(B1078,Magacin!A7:E4830,2,FALSE))","v":""}]
[null,null,{"$f":"IF(B1079=\"\",\"\",VLOOKUP(B1079,Magacin!A7:E4831,2,FALSE))","v":""}]
[null,null,{"$f":"IF(B1080=\"\",\"\",VLOOKUP(B1080,Magacin!A7:E4832,2,FALSE))","v":""}]
[null,null,{"$f":"IF(B1081=\"\",\"\",VLOOKUP(B1081,Magacin!A7:E4833,2,FALSE))","v":""}]
[null,null,{"$f":"IF(B1082=\"\",\"\",VLOOKUP(B1082,Magacin!A7:E4834,2,FALSE))","v":""}]
[null,null,{"$f":"IF(B1083=\"\",\"\",VLOOKUP(B1083,Magacin!A7:E4835,2,FALSE))","v":""}]
[null,null,{"$f":"IF(B1084=\"\",\"\",VLOOKUP(B1084,Magacin!A7:E4836,2,FALSE))","v":""}]
[null,null,{"$f":"IF(B1085=\"\",\"\",VLOOKUP(B1085,Magacin!A7:E4837,2,FALSE))","v":""}]
[null,null,{"$f":"IF(B1086=\"\",\"\",VLOOKUP(B1086,Magacin!A7:E4838,2,FALSE))","v":""}]
[null,null,{"$f":"IF(B1087=\"\",\"\",VLOOKUP(B1087,Magacin!A7:E4839,2,FALSE))","v":""}]
[null,null,{"$f":"IF(B1088=\"\",\"\",VLOOKUP(B1088,Magacin!A7:E4840,2,FALSE))","v":""}]
[null,null,{"$f":"IF(B1089=\"\",\"\",VLOOKUP(B1089,Magacin!A7:E4841,2,FALSE))","v":""}]
[null,null,{"$f":"IF(B1090=\"\",\"\",VLOOKUP(B1090,Magacin!A7:E4842,2,FALSE))","v":""}]
[null,null,{"$f":"IF(B1091=\"\",\"\",VLOOKUP(B1091,Magacin!A7:E4843,2,FALSE))","v":""}]
[null,null,{"$f":"IF(B1092=\"\",\"\",VLOOKUP(B1092,Magacin!A7:E4844,2,FALSE))","v":""}]
[null,null,{"$f":"IF(B1093=\"\",\"\",VLOOKUP(B1093,Magacin!A7:E4845,2,FALSE))","v":""}]
[null,null,{"$f":"IF(B1094=\"\",\"\",VLOOKUP(B1094,Magacin!A7:E4846,2,FALSE))","v":""}]
[null,null,{"$f":"IF(B1095=\"\",\"\",VLOOKUP(B1095,Magacin!A7:E4847,2,FALSE))","v":""}]
[null,null,{"$f":"IF(B1096=\"\",\"\",VLOOKUP(B1096,Magacin!A7:E4848,2,FALSE))","v":""}]
[null,null,{"$f":"IF(B1097=\"\",\"\",VLOOKUP(B1097,Magacin!A7:E4849,2,FALSE))","v":""}]
[null,null,{"$f":"IF(B1098=\"\",\"\",VLOOKUP(B1098,Magacin!A7:E4850,2,FALSE))","v":""}]
[null,null,{"$f":"IF(B1099=\"\",\"\",VLOOKUP(B1099,Magacin!A7:E4851,2,FALSE))","v":""}]
[null,null,{"$f":"IF(B1100=\"\",\"\",VLOOKUP(B1100,Magacin!A7:E4852,2,FALSE))","v":""}]
[null,null,{"$f":"IF(B1101=\"\",\"\",VLOOKUP(B1101,Magacin!A7:E4853,2,FALSE))","v":""}]
[null,null,{"$f":"IF(B1102=\"\",\"\",VLOOKUP(B1102,Magacin!A7:E4854,2,FALSE))","v":""}]
[null,null,{"$f":"IF(B1103=\"\",\"\",VLOOKUP(B1103,Magacin!A7:E4855,2,FALSE))","v":""}]
[null,null,{"$f":"IF(B1104=\"\",\"\",VLOOKUP(B1104,Magacin!A7:E4856,2,FALSE))","v":""}]
[null,null,{"$f":"IF(B1105=\"\",\"\",VLOOKUP(B1105,Magacin!A7:E4857,2,FALSE))","v":""}]
[null,null,{"$f":"IF(B1106=\"\",\"\",VLOOKUP(B1106,Magacin!A7:E4858,2,FALSE))","v":""}]
[null,null,{"$f":"IF(B1107=\"\",\"\",VLOOKUP(B1107,Magacin!A7:E4859,2,FALSE))","v":""}]
[null,null,{"$f":"IF(B1108=\"\",\"\",VLOOKUP(B1108,Magacin!A7:E4860,2,FALSE))","v":""}]
[null,null,{"$f":"IF(B1109=\"\",\"\",VLOOKUP(B1109,Magacin!A7:E4861,2,FALSE))","v":""}]
[null,null,{"$f":"IF(B1110=\"\",\"\",VLOOKUP(B1110,Magacin!A7:E4862,2,FALSE))","v":""}]
[null,null,{"$f":"IF(B1111=\"\",\"\",VLOOKUP(B1111,Magacin!A7:E4863,2,FALSE))","v":""}]
[null,null,{"$f":"IF(B1112=\"\",\"\",VLOOKUP(B1112,Magacin!A7:E4864,2,FALSE))","v":""}]
[null,null,{"$f":"IF(B1113=\"\",\"\",VLOOKUP(B1113,Magacin!A7:E4865,2,FALSE))","v":""}]
[null,null,{"$f":"IF(B1114=\"\",\"\",VLOOKUP(B1114,Magacin!A7:E4866,2,FALSE))","v":""}]
[null,null,{"$f":"IF(B1115=\"\",\"\",VLOOKUP(B1115,Magacin!A7:E4867,2,FALSE))","v":""}]
[null,null,{"$f":"IF(B1116=\"\",\"\",VLOOKUP(B1116,Magacin!A7:E4868,2,FALSE))","v":""}]
[null,null,{"$f":"IF(B1117=\"\",\"\",VLOOKUP(B1117,Magacin!A7:E4869,2,FALSE))","v":""}]
[null,null,{"$f":"IF(B1118=\"\",\"\",VLOOKUP(B1118,Magacin!A7:E4870,2,FALSE))","v":""}]
[null,null,{"$f":"IF(B1119=\"\",\"\",VLOOKUP(B1119,Magacin!A7:E4871,2,FALSE))","v":""}]
[null,null,{"$f":"IF(B1120=\"\",\"\",VLOOKUP(B1120,Magacin!A7:E4872,2,FALSE))","v":""}]
[null,null,{"$f":"IF(B1121=\"\",\"\",VLOOKUP(B1121,Magacin!A7:E4873,2,FALSE))","v":""}]
[null,null,{"$f":"IF(B1122=\"\",\"\",VLOOKUP(B1122,Magacin!A7:E4874,2,FALSE))","v":""}]
[null,null,{"$f":"IF(B1123=\"\",\"\",VLOOKUP(B1123,Magacin!A7:E4875,2,FALSE))","v":""}]
[null,null,{"$f":"IF(B1124=\"\",\"\",VLOOKUP(B1124,Magacin!A7:E4876,2,FALSE))","v":""}]
[null,null,{"$f":"IF(B1125=\"\",\"\",VLOOKUP(B1125,Magacin!A7:E4877,2,FALSE))","v":""}]
[null,null,{"$f":"IF(B1126=\"\",\"\",VLOOKUP(B1126,Magacin!A7:E4878,2,FALSE))","v":""}]
[null,null,{"$f":"IF(B1127=\"\",\"\",VLOOKUP(B1127,Magacin!A7:E4879,2,FALSE))","v":""}]
[null,null,{"$f":"IF(B1128=\"\",\"\",VLOOKUP(B1128,Magacin!A7:E4880,2,FALSE))","v":""}]
[null,null,{"$f":"IF(B1129=\"\",\"\",VLOOKUP(B1129,Magacin!A7:E4881,2,FALSE))","v":""}]
[null,null,{"$f":"IF(B1130=\"\",\"\",VLOOKUP(B1130,Magacin!A7:E4882,2,FALSE))","v":""}]
[null,null,{"$f":"IF(B1131=\"\",\"\",VLOOKUP(B1131,Magacin!A7:E4883,2,FALSE))","v":""}]
[null,null,{"$f":"IF(B1132=\"\",\"\",VLOOKUP(B1132,Magacin!A7:E4884,2,FALSE))","v":""}]
[null,null,{"$f":"IF(B1133=\"\",\"\",VLOOKUP(B1133,Magacin!A7:E4885,2,FALSE))","v":""}]
[null,null,{"$f":"IF(B1134=\"\",\"\",VLOOKUP(B1134,Magacin!A7:E4886,2,FALSE))","v":""}]
[null,null,{"$f":"IF(B1135=\"\",\"\",VLOOKUP(B1135,Magacin!A7:E4887,2,FALSE))","v":""}]
[null,null,{"$f":"IF(B1136=\"\",\"\",VLOOKUP(B1136,Magacin!A7:E4888,2,FALSE))","v":""}]
[null,null,{"$f":"IF(B1137=\"\",\"\",VLOOKUP(B1137,Magacin!A7:E4889,2,FALSE))","v":""}]
[null,null,{"$f":"IF(B1138=\"\",\"\",VLOOKUP(B1138,Magacin!A7:E4890,2,FALSE))","v":""}]
[null,null,{"$f":"IF(B1139=\"\",\"\",VLOOKUP(B1139,Magacin!A7:E4891,2,FALSE))","v":""}]
[null,null,{"$f":"IF(B1140=\"\",\"\",VLOOKUP(B1140,Magacin!A7:E4892,2,FALSE))","v":""}]
[null,null,{"$f":"IF(B1141=\"\",\"\",VLOOKUP(B1141,Magacin!A7:E4893,2,FALSE))","v":""}]
[null,null,{"$f":"IF(B1142=\"\",\"\",VLOOKUP(B1142,Magacin!A7:E4894,2,FALSE))","v":""}]
[null,null,{"$f":"IF(B1143=\"\",\"\",VLOOKUP(B1143,Magacin!A7:E4895,2,FALSE))","v":""}]
[null,null,{"$f":"IF(B1144=\"\",\"\",VLOOKUP(B1144,Magacin!A7:E4896,2,FALSE))","v":""}]
[null,null,{"$f":"IF(B1145=\"\",\"\",VLOOKUP(B1145,Magacin!A7:E4897,2,FALSE))","v":""}]
[null,null,{"$f":"IF(B1146=\"\",\"\",VLOOKUP(B1146,Magacin!A7:E4898,2,FALSE))","v":""}]
[null,null,{"$f":"IF(B1147=\"\",\"\",VLOOKUP(B1147,Magacin!A7:E4899,2,FALSE))","v":""}]
[null,null,{"$f":"IF(B1148=\"\",\"\",VLOOKUP(B1148,Magacin!A7:E4900,2,FALSE))","v":""}]
[null,null,{"$f":"IF(B1149=\"\",\"\",VLOOKUP(B1149,Magacin!A7:E4901,2,FALSE))","v":""}]
[null,null,{"$f":"IF(B1150=\"\",\"\",VLOOKUP(B1150,Magacin!A7:E4902,2,FALSE))","v":""}]
[null,null,{"$f":"IF(B1151=\"\",\"\",VLOOKUP(B1151,Magacin!A7:E4903,2,FALSE))","v":""}]
[null,null,{"$f":"IF(B1152=\"\",\"\",VLOOKUP(B1152,Magacin!A7:E4904,2,FALSE))","v":""}]
[null,null,{"$f":"IF(B1153=\"\",\"\",VLOOKUP(B1153,Magacin!A7:E4905,2,FALSE))","v":""}]
[null,null,{"$f":"IF(B1154=\"\",\"\",VLOOKUP(B1154,Magacin!A7:E4906,2,FALSE))","v":""}]
[null,null,{"$f":"IF(B1155=\"\",\"\",VLOOKUP(B1155,Magacin!A7:E4907,2,FALSE))","v":""}]
[null,null,{"$f":"IF(B1156=\"\",\"\",VLOOKUP(B1156,Magacin!A7:E4908,2,FALSE))","v":""}]
[null,null,{"$f":"IF(B1157=\"\",\"\",VLOOKUP(B1157,Magacin!A7:E4909,2,FALSE))","v":""}]
[null,null,{"$f":"IF(B1158=\"\",\"\",VLOOKUP(B1158,Magacin!A7:E4910,2,FALSE))","v":""}]
[null,null,{"$f":"IF(B1159=\"\",\"\",VLOOKUP(B1159,Magacin!A7:E4911,2,FALSE))","v":""}]
[null,null,{"$f":"IF(B1160=\"\",\"\",VLOOKUP(B1160,Magacin!A7:E4912,2,FALSE))","v":""}]
[null,null,{"$f":"IF(B1161=\"\",\"\",VLOOKUP(B1161,Magacin!A7:E4913,2,FALSE))","v":""}]
[null,null,{"$f":"IF(B1162=\"\",\"\",VLOOKUP(B1162,Magacin!A7:E4914,2,FALSE))","v":""}]
[null,null,{"$f":"IF(B1163=\"\",\"\",VLOOKUP(B1163,Magacin!A7:E4915,2,FALSE))","v":""}]
[null,null,{"$f":"IF(B1164=\"\",\"\",VLOOKUP(B1164,Magacin!A7:E4916,2,FALSE))","v":""}]
[null,null,{"$f":"IF(B1165=\"\",\"\",VLOOKUP(B1165,Magacin!A7:E4917,2,FALSE))","v":""}]
[null,null,{"$f":"IF(B1166=\"\",\"\",VLOOKUP(B1166,Magacin!A7:E4918,2,FALSE))","v":""}]
[null,null,{"$f":"IF(B1167=\"\",\"\",VLOOKUP(B1167,Magacin!A7:E4919,2,FALSE))","v":""}]
[null,null,{"$f":"IF(B1168=\"\",\"\",VLOOKUP(B1168,Magacin!A7:E4920,2,FALSE))","v":""}]
[null,null,{"$f":"IF(B1169=\"\",\"\",VLOOKUP(B1169,Magacin!A7:E4921,2,FALSE))","v":""}]
[null,null,{"$f":"IF(B1170=\"\",\"\",VLOOKUP(B1170,Magacin!A7:E4922,2,FALSE))","v":""}]
[null,null,{"$f":"IF(B1171=\"\",\"\",VLOOKUP(B1171,Magacin!A7:E4923,2,FALSE))","v":""}]
[null,null,{"$f":"IF(B1172=\"\",\"\",VLOOKUP(B1172,Magacin!A7:E4924,2,FALSE))","v":""}]
[null,null,{"$f":"IF(B1173=\"\",\"\",VLOOKUP(B1173,Magacin!A7:E4925,2,FALSE))","v":""}]
[null,null,{"$f":"IF(B1174=\"\",\"\",VLOOKUP(B1174,Magacin!A7:E4926,2,FALSE))","v":""}]
[null,null,{"$f":"IF(B1175=\"\",\"\",VLOOKUP(B1175,Magacin!A7:E4927,2,FALSE))","v":""}]
[null,null,{"$f":"IF(B1176=\"\",\"\",VLOOKUP(B1176,Magacin!A7:E4928,2,FALSE))","v":""}]
[null,null,{"$f":"IF(B1177=\"\",\"\",VLOOKUP(B1177,Magacin!A7:E4929,2,FALSE))","v":""}]
[null,null,{"$f":"IF(B1178=\"\",\"\",VLOOKUP(B1178,Magacin!A7:E4930,2,FALSE))","v":""}]
[null,null,{"$f":"IF(B1179=\"\",\"\",VLOOKUP(B1179,Magacin!A7:E4931,2,FALSE))","v":""}]
[null,null,{"$f":"IF(B1180=\"\",\"\",VLOOKUP(B1180,Magacin!A7:E4932,2,FALSE))","v":""}]
[null,null,{"$f":"IF(B1181=\"\",\"\",VLOOKUP(B1181,Magacin!A7:E4933,2,FALSE))","v":""}]
[null,null,{"$f":"IF(B1182=\"\",\"\",VLOOKUP(B1182,Magacin!A7:E4934,2,FALSE))","v":""}]
[null,null,{"$f":"IF(B1183=\"\",\"\",VLOOKUP(B1183,Magacin!A7:E4935,2,FALSE))","v":""}]
[null,null,{"$f":"IF(B1184=\"\",\"\",VLOOKUP(B1184,Magacin!A7:E4936,2,FALSE))","v":""}]
[null,null,{"$f":"IF(B1185=\"\",\"\",VLOOKUP(B1185,Magacin!A7:E4937,2,FALSE))","v":""}]
[null,null,{"$f":"IF(B1186=\"\",\"\",VLOOKUP(B1186,Magacin!A7:E4938,2,FALSE))","v":""}]
[null,null,{"$f":"IF(B1187=\"\",\"\",VLOOKUP(B1187,Magacin!A7:E4939,2,FALSE))","v":""}]
[null,null,{"$f":"IF(B1188=\"\",\"\",VLOOKUP(B1188,Magacin!A7:E4940,2,FALSE))","v":""}]
[null,null,{"$f":"IF(B1189=\"\",\"\",VLOOKUP(B1189,Magacin!A7:E4941,2,FALSE))","v":""}]
[null,null,{"$f":"IF(B1190=\"\",\"\",VLOOKUP(B1190,Magacin!A7:E4942,2,FALSE))","v":""}]
[null,null,{"$f":"IF(B1191=\"\",\"\",VLOOKUP(B1191,Magacin!A7:E4943,2,FALSE))","v":""}]
[null,null,{"$f":"IF(B1192=\"\",\"\",VLOOKUP(B1192,Magacin!A7:E4944,2,FALSE))","v":""}]
[null,null,{"$f":"IF(B1193=\"\",\"\",VLOOKUP(B1193,Magacin!A7:E4945,2,FALSE))","v":""}]
[null,null,{"$f":"IF(B1194=\"\",\"\",VLOOKUP(B1194,Magacin!A7:E4946,2,FALSE))","v":""}]
[null,null,{"$f":"IF(B1195=\"\",\"\",VLOOKUP(B1195,Magacin!A7:E4947,2,FALSE))","v":""}]
[null,null,{"$f":"IF(B1196=\"\",\"\",VLOOKUP(B1196,Magacin!A7:E4948,2,FALSE))","v":""}]
[null,null,{"$f":"IF(B1197=\"\",\"\",VLOOKUP(B1197,Magacin!A7:E4949,2,FALSE))","v":""}]
[null,null,{"$f":"IF(B1198=\"\",\"\",VLOOKUP(B1198,Magacin!A7:E4950,2,FALSE))","v":""}]
[null,null,{"$f":"IF(B1199=\"\",\"\",VLOOKUP(B1199,Magacin!A7:E4951,2,FALSE))","v":""}]
[null,null,{"$f":"IF(B1200=\"\",\"\",VLOOKUP(B1200,Magacin!A7:E4952,2,FALSE))","v":""}]
[null,null,{"$f":"IF(B1201=\"\",\"\",VLOOKUP(B1201,Magacin!A7:E4953,2,FALSE))","v":""}]
[null,null,{"$f":"IF(B1202=\"\",\"\",VLOOKUP(B1202,Magacin!A7:E4954,2,FALSE))","v":""}]
[null,null,{"$f":"IF(B1203=\"\",\"\",VLOOKUP(B1203,Magacin!A7:E4955,2,FALSE))","v":""}]
[null,null,{"$f":"IF(B1204=\"\",\"\",VLOOKUP(B1204,Magacin!A7:E4956,2,FALSE))","v":""}]
[null,null,{"$f":"IF(B1205=\"\",\"\",VLOOKUP(B1205,Magacin!A7:E4957,2,FALSE))","v":""}]
[null,null,{"$f":"IF(B1206=\"\",\"\",VLOOKUP(B1206,Magacin!A7:E4958,2,FALSE))","v":""}]
[null,null,{"$f":"IF(B1207=\"\",\"\",VLOOKUP(B1207,Magacin!A7:E4959,2,FALSE))","v":""}]
[null,null,{"$f":"IF(B1208=\"\",\"\",VLOOKUP(B1208,Magacin!A7:E4960,2,FALSE))","v":""}]
[null,null,{"$f":"IF(B1209=\"\",\"\",VLOOKUP(B1209,Magacin!A7:E4961,2,FALSE))","v":""}]
[null,null,{"$f":"IF(B1210=\"\",\"\",VLOOKUP(B1210,Magacin!A7:E4962,2,FALSE))","v":""}]
[null,null,{"$f":"IF(B1211=\"\",\"\",VLOOKUP(B1211,Magacin!A7:E4963,2,FALSE))","v":""}]
[null,null,{"$f":"IF(B1212=\"\",\"\",VLOOKUP(B1212,Magacin!A7:E4964,2,FALSE))","v":""}]
[null,null,{"$f":"IF(B1213=\"\",\"\",VLOOKUP(B1213,Magacin!A7:E4965,2,FALSE))","v":""}]
[null,null,{"$f":"IF(B1214=\"\",\"\",VLOOKUP(B1214,Magacin!A7:E4966,2,FALSE))","v":""}]
[null,null,{"$f":"IF(B1215=\"\",\"\",VLOOKUP(B1215,Magacin!A7:E4967,2,FALSE))","v":""}]
[null,null,{"$f":"IF(B1216=\"\",\"\",VLOOKUP(B1216,Magacin!A7:E4968,2,FALSE))","v":""}]
[null,null,{"$f":"IF(B1217=\"\",\"\",VLOOKUP(B1217,Magacin!A7:E4969,2,FALSE))","v":""}]
[null,null,{"$f":"IF(B1218=\"\",\"\",VLOOKUP(B1218,Magacin!A7:E4970,2,FALSE))","v":""}]
[null,null,{"$f":"IF(B1219=\"\",\"\",VLOOKUP(B1219,Magacin!A7:E4971,2,FALSE))","v":""}]
[null,null,{"$f":"IF(B1220=\"\",\"\",VLOOKUP(B1220,Magacin!A7:E4972,2,FALSE))","v":""}]
[null,null,{"$f":"IF(B1221=\"\",\"\",VLOOKUP(B1221,Magacin!A7:E4973,2,FALSE))","v":""}]
[null,null,{"$f":"IF(B1222=\"\",\"\",VLOOKUP(B1222,Magacin!A7:E4974,2,FALSE))","v":""}]
[null,null,{"$f":"IF(B1223=\"\",\"\",VLOOKUP(B1223,Magacin!A7:E4975,2,FALSE))","v":""}]
[null,null,{"$f":"IF(B1224=\"\",\"\",VLOOKUP(B1224,Magacin!A7:E4976,2,FALSE))","v":""}]
[null,null,{"$f":"IF(B1225=\"\",\"\",VLOOKUP(B1225,Magacin!A7:E4977,2,FALSE))","v":""}]
[null,null,{"$f":"IF(B1226=\"\",\"\",VLOOKUP(B1226,Magacin!A7:E4978,2,FALSE))","v":""}]
[null,null,{"$f":"IF(B1227=\"\",\"\",VLOOKUP(B1227,Magacin!A7:E4979,2,FALSE))","v":""}]
[null,null,{"$f":"IF(B1228=\"\",\"\",VLOOKUP(B1228,Magacin!A7:E4980,2,FALSE))","v":""}]
[null,null,{"$f":"IF(B1229=\"\",\"\",VLOOKUP(B1229,Magacin!A7:E4981,2,FALSE))","v":""}]
[null,null,{"$f":"IF(B1230=\"\",\"\",VLOOKUP(B1230,Magacin!A7:E4982,2,FALSE))","v":""}]
[null,null,{"$f":"IF(B1231=\"\",\"\",VLOOKUP(B1231,Magacin!A7:E4983,2,FALSE))","v":""}]
[null,null,{"$f":"IF(B1232=\"\",\"\",VLOOKUP(B1232,Magacin!A7:E4984,2,FALSE))","v":""}]
[null,null,{"$f":"IF(B1233=\"\",\"\",VLOOKUP(B1233,Magacin!A7:E4985,2,FALSE))","v":""}]
[null,null,{"$f":"IF(B1234=\"\",\"\",VLOOKUP(B1234,Magacin!A7:E4986,2,FALSE))","v":""}]
[null,null,{"$f":"IF(B1235=\"\",\"\",VLOOKUP(B1235,Magacin!A7:E4987,2,FALSE))","v":""}]
[null,null,{"$f":"IF(B1236=\"\",\"\",VLOOKUP(B1236,Magacin!A7:E4988,2,FALSE))","v":""}]
[null,null,{"$f":"IF(B1237=\"\",\"\",VLOOKUP(B1237,Magacin!A7:E4989,2,FALSE))","v":""}]
[null,null,{"$f":"IF(B1238=\"\",\"\",VLOOKUP(B1238,Magacin!A7:E4990,2,FALSE))","v":""}]
[null,null,{"$f":"IF(B1239=\"\",\"\",VLOOKUP(B1239,Magacin!A7:E4991,2,FALSE))","v":""}]
[null,null,{"$f":"IF(B1240=\"\",\"\",VLOOKUP(B1240,Magacin!A7:E4992,2,FALSE))","v":""}]
[null,null,{"$f":"IF(B1241=\"\",\"\",VLOOKUP(B1241,Magacin!A7:E4993,2,FALSE))","v":""}]
[null,null,{"$f":"IF(B1242=\"\",\"\",VLOOKUP(B1242,Magacin!A7:E4994,2,FALSE))","v":""}]
[null,null,{"$f":"IF(B1243=\"\",\"\",VLOOKUP(B1243,Magacin!A7:E4995,2,FALSE))","v":""}]
[null,null,{"$f":"IF(B1244=\"\",\"\",VLOOKUP(B1244,Magacin!A7:E4996,2,FALSE))","v":""}]
[null,null,{"$f":"IF(B1245=\"\",\"\",VLOOKUP(B1245,Magacin!A7:E4997,2,FALSE))","v":""}]
[null,null,{"$f":"IF(B1246=\"\",\"\",VLOOKUP(B1246,Magacin!A7:E4998,2,FALSE))","v":""}]
[null,null,{"$f":"IF(B1247=\"\",\"\",VLOOKUP(B1247,Magacin!A7:E4999,2,FALSE))","v":""}]
[null,null,{"$f":"IF(B1248=\"\",\"\",VLOOKUP(B1248,Magacin!A7:E5000,2,FALSE))","v":""}]
[null,null,{"$f":"IF(B1249=\"\",\"\",VLOOKUP(B1249,Magacin!A7:E5001,2,FALSE))","v":""}]
[null,null,{"$f":"IF(B1250=\"\",\"\",VLOOKUP(B1250,Magacin!A7:E5002,2,FALSE))","v":""}]
[null,null,{"$f":"IF(B1251=\"\",\"\",VLOOKUP(B1251,Magacin!A7:E5003,2,FALSE))","v":""}]
[null,null,{"$f":"IF(B1252=\"\",\"\",VLOOKUP(B1252,Magacin!A7:E5004,2,FALSE))","v":""}]
[null,null,{"$f":"IF(B1253=\"\",\"\",VLOOKUP(B1253,Magacin!A8:E5005,2,FALSE))","v":""}]
[null,null,{"$f":"IF(B1254=\"\",\"\",VLOOKUP(B1254,Magacin!A9:E5006,2,FALSE))","v":""}]
[null,null,{"$f":"IF(B1255=\"\",\"\",VLOOKUP(B1255,Magacin!A10:E5007,2,FALSE))","v":""}]
[null,null,{"$f":"IF(B1256=\"\",\"\",VLOOKUP(B1256,Magacin!A11:E5008,2,FALSE))","v":""}]
[null,null,{"$f":"IF(B1257=\"\",\"\",VLOOKUP(B1257,Magacin!A12:E5009,2,FALSE))","v":""}]
[null,null,{"$f":"IF(B1258=\"\",\"\",VLOOKUP(B1258,Magacin!A13:E5010,2,FALSE))","v":""}]
[null,null,{"$f":"IF(B1259=\"\",\"\",VLOOKUP(B1259,Magacin!A14:E5011,2,FALSE))","v":""}]
[null,null,{"$f":"IF(B1260=\"\",\"\",VLOOKUP(B1260,Magacin!A15:E5012,2,FALSE))","v":""}]
[null,null,{"$f":"IF(B1261=\"\",\"\",VLOOKUP(B1261,Magacin!A16:E5013,2,FALSE))","v":""}]
[null,null,{"$f":"IF(B1262=\"\",\"\",VLOOKUP(B1262,Magacin!A17:E5014,2,FALSE))","v":""}]
[null,null,{"$f":"IF(B1263=\"\",\"\",VLOOKUP(B1263,Magacin!A18:E5015,2,FALSE))","v":""}]
[null,null,{"$f":"IF(B1264=\"\",\"\",VLOOKUP(B1264,Magacin!A19:E5016,2,FALSE))","v":""}]
[null,null,{"$f":"IF(B1265=\"\",\"\",VLOOKUP(B1265,Magacin!A20:E5017,2,FALSE))","v":""}]
[null,null,{"$f":"IF(B1266=\"\",\"\",VLOOKUP(B1266,Magacin!A21:E5018,2,FALSE))","v":""}]
[null,null,{"$f":"IF(B1267=\"\",\"\",VLOOKUP(B1267,Magacin!A22:E5019,2,FALSE))","v":""}]
[null,null,{"$f":"IF(B1268=\"\",\"\",VLOOKUP(B1268,Magacin!A23:E5020,2,FALSE))","v":""}]
[null,null,{"$f":"IF(B1269=\"\",\"\",VLOOKUP(B1269,Magacin!A24:E5021,2,FALSE))","v":""}]
[null,null,{"$f":"IF(B1270=\"\",\"\",VLOOKUP(B1270,Magacin!A25:E5022,2,FALSE))","v":""}]
[null,null,{"$f":"IF(B1271=\"\",\"\",VLOOKUP(B1271,Magacin!A26:E5023,2,FALSE))","v":""}]
[null,null,{"$f":"IF(B1272=\"\",\"\",VLOOKUP(B1272,Magacin!A27:E5024,2,FALSE))","v":""}]
[null,null,{"$f":"IF(B1273=\"\",\"\",VLOOKUP(B1273,Magacin!A28:E5025,2,FALSE))","v":""}]
[null,null,{"$f":"IF(B1274=\"\",\"\",VLOOKUP(B1274,Magacin!A29:E5026,2,FALSE))","v":""}]
[null,null,{"$f":"IF(B1275=\"\",\"\",VLOOKUP(B1275,Magacin!A30:E5027,2,FALSE))","v":""}]
[null,null,{"$f":"IF(B1276=\"\",\"\",VLOOKUP(B1276,Magacin!A31:E5028,2,FALSE))","v":""}]
[null,null,{"$f":"IF(B1277=\"\",\"\",VLOOKUP(B1277,Magacin!A32:E5029,2,FALSE))","v":""}]
[null,null,{"$f":"IF(B1278=\"\",\"\",VLOOKUP(B1278,Magacin!A33:E5030,2,FALSE))","v":""}]
[null,null,{"$f":"IF(B1279=\"\",\"\",VLOOKUP(B1279,Magacin!A34:E5031,2,FALSE))","v":""}]
[null,null,{"$f":"IF(B1280=\"\",\"\",VLOOKUP(B1280,Magacin!A35:E5032,2,FALSE))","v":""}]
[null,null,{"$f":"IF(B1281=\"\",\"\",VLOOKUP(B1281,Magacin!A36:E5033,2,FALSE))","v":""}]
[null,null,{"$f":"IF(B1282=\"\",\"\",VLOOKUP(B1282,Magacin!A37:E5034,2,FALSE))","v":""}]
[null,null,{"$f":"IF(B1283=\"\",\"\",VLOOKUP(B1283,Magacin!A38:E5035,2,FALSE))","v":""}]
[null,null,{"$f":"IF(B1284=\"\",\"\",VLOOKUP(B1284,Magacin!A39:E5036,2,FALSE))","v":""}]
[null,null,{"$f":"IF(B1285=\"\",\"\",VLOOKUP(B1285,Magacin!A40:E5037,2,FALSE))","v":""}]
[null,null,{"$f":"IF(B1286=\"\",\"\",VLOOKUP(B1286,Magacin!A41:E5038,2,FALSE))","v":""}]
[null,null,{"$f":"IF(B1287=\"\",\"\",VLOOKUP(B1287,Magacin!A42:E5039,2,FALSE))","v":""}]
[null,null,{"$f":"IF(B1288=\"\",\"\",VLOOKUP(B1288,Magacin!A43:E5040,2,FALSE))","v":""}]
[null,null,{"$f":"IF(B1289=\"\",\"\",VLOOKUP(B1289,Magacin!A44:E5041,2,FALSE))","v":""}]
[null,null,{"$f":"IF(B1290=\"\",\"\",VLOOKUP(B1290,Magacin!A45:E5042,2,FALSE))","v":""}]
[null,null,{"$f":"IF(B1291=\"\",\"\",VLOOKUP(B1291,Magacin!A46:E5043,2,FALSE))","v":""}]
[null,null,{"$f":"IF(B1292=\"\",\"\",VLOOKUP(B1292,Magacin!A47:E5044,2,FALSE))","v":""}]
[null,null,{"$f":"IF(B1293=\"\",\"\",VLOOKUP(B1293,Magacin!A48:E5045,2,FALSE))","v":""}]
[null,null,{"$f":"IF(B1294=\"\",\"\",VLOOKUP(B1294,Magacin!A49:E5046,2,FALSE))","v":""}]
[null,null,{"$f":"IF(B1295=\"\",\"\",VLOOKUP(B1295,Magacin!A50:E5047,2,FALSE))","v":""}]
[null,null,{"$f":"IF(B1296=\"\",\"\",VLOOKUP(B1296,Magacin!A51:E5048,2,FALSE))","v":""}]
[null,null,{"$f":"IF(B1297=\"\",\"\",VLOOKUP(B1297,Magacin!A52:E5049,2,FALSE))","v":""}]
[null,null,{"$f":"IF(B1298=\"\",\"\",VLOOKUP(B1298,Magacin!A53:E5050,2,FALSE))","v":""}]
[null,null,{"$f":"IF(B1299=\"\",\"\",VLOOKUP(B1299,Magacin!A54:E5051,2,FALSE))","v":""}]
[null,null,{"$f":"IF(B1300=\"\",\"\",VLOOKUP(B1300,Magacin!A55:E5052,2,FALSE))","v":""}]
[null,null,{"$f":"IF(B1301=\"\",\"\",VLOOKUP(B1301,Magacin!A56:E5053,2,FALSE))","v":""}]
[null,null,{"$f":"IF(B1302=\"\",\"\",VLOOKUP(B1302,Magacin!A57:E5054,2,FALSE))","v":""}]
[null,null,{"$f":"IF(B1303=\"\",\"\",VLOOKUP(B1303,Magacin!A58:E5055,2,FALSE))","v":""}]
[null,null,{"$f":"IF(B1304=\"\",\"\",VLOOKUP(B1304,Magacin!A59:E5056,2,FALSE))","v":""}]
[null,null,{"$f":"IF(B1305=\"\",\"\",VLOOKUP(B1305,Magacin!A60:E5057,2,FALSE))","v":""}]
[null,null,{"$f":"IF(B1306=\"\",\"\",VLOOKUP(B1306,Magacin!A61:E5058,2,FALSE))","v":""}]
[null,null,{"$f":"IF(B1307=\"\",\"\",VLOOKUP(B1307,Magacin!A62:E5059,2,FALSE))","v":""}]
[null,null,{"$f":"IF(B1308=\"\",\"\",VLOOKUP(B1308,Magacin!A63:E5060,2,FALSE))","v":""}]
[null,null,{"$f":"IF(B1309=\"\",\"\",VLOOKUP(B1309,Magacin!A64:E5061,2,FALSE))","v":""}]
[null,null,{"$f":"IF(B1310=\"\",\"\",VLOOKUP(B1310,Magacin!A65:E5062,2,FALSE))","v":""}]
[null,null,{"$f":"IF(B1311=\"\",\"\",VLOOKUP(B1311,Magacin!A66:E5063,2,FALSE))","v":""}]
[null,null,{"$f":"IF(B1312=\"\",\"\",VLOOKUP(B1312,Magacin!A67:E5064,2,FALSE))","v":""}]
[null,null,{"$f":"IF(B1313=\"\",\"\",VLOOKUP(B1313,Magacin!A68:E5065,2,FALSE))","v":""}]
[null,null,{"$f":"IF(B1314=\"\",\"\",VLOOKUP(B1314,Magacin!A69:E5066,2,FALSE))","v":""}]
[null,null,{"$f":"IF(B1315=\"\",\"\",VLOOKUP(B1315,Magacin!A70:E5067,2,FALSE))","v":""}]
[null,null,{"$f":"IF(B1316=\"\",\"\",VLOOKUP(B1316,Magacin!A71:E5068,2,FALSE))","v":""}]
[null,null,{"$f":"IF(B1317=\"\",\"\",VLOOKUP(B1317,Magacin!A72:E5069,2,FALSE))","v":""}]
[null,null,{"$f":"IF(B1318=\"\",\"\",VLOOKUP(B1318,Magacin!A73:E5070,2,FALSE))","v":""}]
[null,null,{"$f":"IF(B1319=\"\",\"\",VLOOKUP(B1319,Magacin!A74:E5071,2,FALSE))","v":""}]
[null,null,{"$f":"IF(B1320=\"\",\"\",VLOOKUP(B1320,Magacin!A75:E5072,2,FALSE))","v":""}]
[null,null,{"$f":"IF(B1321=\"\",\"\",VLOOKUP(B1321,Magacin!A76:E5073,2,FALSE))","v":""}]
[null,null,{"$f":"IF(B1322=\"\",\"\",VLOOKUP(B1322,Magacin!A77:E5074,2,FALSE))","v":""}]
[null,null,{"$f":"IF(B1323=\"\",\"\",VLOOKUP(B1323,Magacin!A78:E5075,2,FALSE))","v":""}]
[null,null,{"$f":"IF(B1324=\"\",\"\",VLOOKUP(B1324,Magacin!A79:E5076,2,FALSE))","v":""}]
[null,null,{"$f":"IF(B1325=\"\",\"\",VLOOKUP(B1325,Magacin!A80:E5077,2,FALSE))","v":""}]
[null,null,{"$f":"IF(B1326=\"\",\"\",VLOOKUP(B1326,Magacin!A81:E5078,2,FALSE))","v":""}]
[null,null,{"$f":"IF(B1327=\"\",\"\",VLOOKUP(B1327,Magacin!A82:E5079,2,FALSE))","v":""}]
[null,null,{"$f":"IF(B1328=\"\",\"\",VLOOKUP(B1328,Magacin!A83:E5080,2,FALSE))","v":""}]
[null,null,{"$f":"IF(B1329=\"\",\"\",VLOOKUP(B1329,Magacin!A84:E5081,2,FALSE))","v":""}]
[null,null,{"$f":"IF(B1330=\"\",\"\",VLOOKUP(B1330,Magacin!A85:E5082,2,FALSE))","v":""}]
[null,null,{"$f":"IF(B1331=\"\",\"\",VLOOKUP(B1331,Magacin!A86:E5083,2,FALSE))","v":""}]
[null,null,{"$f":"IF(B1332=\"\",\"\",VLOOKUP(B1332,Magacin!A87:E5084,2,FALSE))","v":""}]
[null,null,{"$f":"IF(B1333=\"\",\"\",VLOOKUP(B1333,Magacin!A88:E5085,2,FALSE))","v":""}]
[null,null,{"$f":"IF(B1334=\"\",\"\",VLOOKUP(B1334,Magacin!A89:E5086,2,FALSE))","v":""}]
[null,null,{"$f":"IF(B1335=\"\",\"\",VLOOKUP(B1335,Magacin!A90:E5087,2,FALSE))","v":""}]
[null,null,{"$f":"IF(B1336=\"\",\"\",VLOOKUP(B1336,Magacin!A91:E5088,2,FALSE))","v":""}]
[null,null,{"$f":"IF(B1337=\"\",\"\",VLOOKUP(B1337,Magacin!A92:E5089,2,FALSE))","v":""}]
[null,null,{"$f":"IF(B1338=\"\",\"\",VLOOKUP(B1338,Magacin!A93:E5090,2,FALSE))","v":""}]
[null,null,{"$f":"IF(B1339=\"\",\"\",VLOOKUP(B1339,Magacin!A94:E5091,2,FALSE))","v":""}]
[null,null,{"$f":"IF(B1340=\"\",\"\",VLOOKUP(B1340,Magacin!A95:E5092,2,FALSE))","v":""}]
[null,null,{"$f":"IF(B1341=\"\",\"\",VLOOKUP(B1341,Magacin!A96:E5093,2,FALSE))","v":""}]
[null,null,{"$f":"IF(B1342=\"\",\"\",VLOOKUP(B1342,Magacin!A97:E5094,2,FALSE))","v":""}]
[null,null,{"$f":"IF(B1343=\"\",\"\",VLOOKUP(B1343,Magacin!A98:E5095,2,FALSE))","v":""}]
[null,null,{"$f":"IF(B1344=\"\",\"\",VLOOKUP(B1344,Magacin!A99:E5096,2,FALSE))","v":""}]
[null,null,{"$f":"IF(B1345=\"\",\"\",VLOOKUP(B1345,Magacin!A100:E5097,2,FALSE))","v":""}]
[null,null,{"$f":"IF(B1346=\"\",\"\",VLOOKUP(B1346,Magacin!A101:E5098,2,FALSE))","v":""}]
[null,null,{"$f":"IF(B1347=\"\",\"\",VLOOKUP(B1347,Magacin!A102:E5099,2,FALSE))","v":""}]
[null,null,{"$f":"IF(B1348=\"\",\"\",VLOOKUP(B1348,Magacin!A103:E5100,2,FALSE))","v":""}]
[null,null,{"$f":"IF(B1349=\"\",\"\",VLOOKUP(B1349,Magacin!A104:E5101,2,FALSE))","v":""}]
[null,null,{"$f":"IF(B1350=\"\",\"\",VLOOKUP(B1350,Magacin!A105:E5102,2,FALSE))","v":""}]
[null,null,{"$f":"IF(B1351=\"\",\"\",VLOOKUP(B1351,Magacin!A106:E5103,2,FALSE))","v":""}]
[null,null,{"$f":"IF(B1352=\"\",\"\",VLOOKUP(B1352,Magacin!A107:E5104,2,FALSE))","v":""}]
[null,null,{"$f":"IF(B1353=\"\",\"\",VLOOKUP(B1353,Magacin!A108:E5105,2,FALSE))","v":""}]
[null,null,{"$f":"IF(B1354=\"\",\"\",VLOOKUP(B1354,Magacin!A109:E5106,2,FALSE))","v":""}]
[null,null,{"$f":"IF(B1355=\"\",\"\",VLOOKUP(B1355,Magacin!A110:E5107,2,FALSE))","v":""}]
[null,null,{"$f":"IF(B1356=\"\",\"\",VLOOKUP(B1356,Magacin!A111:E5108,2,FALSE))","v":""}]
[null,null,{"$f":"IF(B1357=\"\",\"\",VLOOKUP(B1357,Magacin!A112:E5109,2,FALSE))","v":""}]
[null,null,{"$f":"IF(B1358=\"\",\"\",VLOOKUP(B1358,Magacin!A113:E5110,2,FALSE))","v":""}]
[null,null,{"$f":"IF(B1359=\"\",\"\",VLOOKUP(B1359,Magacin!A114:E5111,2,FALSE))","v":""}]
[null,null,{"$f":"IF(B1360=\"\",\"\",VLOOKUP(B1360,Magacin!A115:E5112,2,FALSE))","v":""}]
[null,null,{"$f":"IF(B1361=\"\",\"\",VLOOKUP(B1361,Magacin!A116:E5113,2,FALSE))","v":""}]
[null,null,{"$f":"IF(B1362=\"\",\"\",VLOOKUP(B1362,Magacin!A117:E5114,2,FALSE))","v":""}]
[null,null,{"$f":"IF(B1363=\"\",\"\",VLOOKUP(B1363,Magacin!A118:E5115,2,FALSE))","v":""}]
[null,null,{"$f":"IF(B1364=\"\",\"\",VLOOKUP(B1364,Magacin!A119:E5116,2,FALSE))","v":""}]
[null,null,{"$f":"IF(B1365=\"\",\"\",VLOOKUP(B1365,Magacin!A120:E5117,2,FALSE))","v":""}]
[null,null,{"$f":"IF(B1366=\"\",\"\",VLOOKUP(B1366,Magacin!A121:E5118,2,FALSE))","v":""}]
[null,null,{"$f":"IF(B1367=\"\",\"\",VLOOKUP(B1367,Magacin!A122:E5119,2,FALSE))","v":""}]
[null,null,{"$f":"IF(B1368=\"\",\"\",VLOOKUP(B1368,Magacin!A123:E5120,2,FALSE))","v":""}]
[null,null,{"$f":"IF(B1369=\"\",\"\",VLOOKUP(B1369,Magacin!A124:E5121,2,FALSE))","v":""}]
[null,null,{"$f":"IF(B1370=\"\",\"\",VLOOKUP(B1370,Magacin!A125:E5122,2,FALSE))","v":""}]
[null,null,{"$f":"IF(B1371=\"\",\"\",VLOOKUP(B1371,Magacin!A126:E5123,2,FALSE))","v":""}]
[null,null,{"$f":"IF(B1372=\"\",\"\",VLOOKUP(B1372,Magacin!A127:E5124,2,FALSE))","v":""}]
[null,null,{"$f":"IF(B1373=\"\",\"\",VLOOKUP(B1373,Magacin!A128:E5125,2,FALSE))","v":""}]
[null,null,{"$f":"IF(B1374=\"\",\"\",VLOOKUP(B1374,Magacin!A129:E5126,2,FALSE))","v":""}]
[null,null,{"$f":"IF(B1375=\"\",\"\",VLOOKUP(B1375,Magacin!A130:E5127,2,FALSE))","v":""}]
[null,null,{"$f":"IF(B1376=\"\",\"\",VLOOKUP(B1376,Magacin!A131:E5128,2,FALSE))","v":""}]
[null,null,{"$f":"IF(B1377=\"\",\"\",VLOOKUP(B1377,Magacin!A132:E5129,2,FALSE))","v":""}]
[null,null,{"$f":"IF(B1378=\"\",\"\",VLOOKUP(B1378,Magacin!A133:E5130,2,FALSE))","v":""}]
[null,null,{"$f":"IF(B1379=\"\",\"\",VLOOKUP(B1379,Magacin!A134:E5131,2,FALSE))","v":""}]
[null,null,{"$f":"IF(B1380=\"\",\"\",VLOOKUP(B1380,Magacin!A135:E5132,2,FALSE))","v":""}]
[null,null,{"$f":"IF(B1381=\"\",\"\",VLOOKUP(B1381,Magacin!A136:E5133,2,FALSE))","v":""}]
[null,null,{"$f":"IF(B1382=\"\",\"\",VLOOKUP(B1382,Magacin!A137:E5134,2,FALSE))","v":""}]
[null,null,{"$f":"IF(B1383=\"\",\"\",VLOOKUP(B1383,Magacin!A138:E5135,2,FALSE))","v":""}]
[null,null,{"$f":"IF(B1384=\"\",\"\",VLOOKUP(B1384,Magacin!A139:E5136,2,FALSE))","v":""}]
[null,null,{"$f":"IF(B1385=\"\",\"\",VLOOKUP(B1385,Magacin!A140:E5137,2,FALSE))","v":""}]
[null,null,{"$f":"IF(B1386=\"\",\"\",VLOOKUP(B1386,Magacin!A141:E5138,2,FALSE))","v":""}]
[null,null,{"$f":"IF(B1387=\"\",\"\",VLOOKUP(B1387,Magacin!A142:E5139,2,FALSE))","v":""}]
[null,null,{"$f":"IF(B1388=\"\",\"\",VLOOKUP(B1388,Magacin!A143:E5140,2,FALSE))","v":""}]
[null,null,{"$f":"IF(B1389=\"\",\"\",VLOOKUP(B1389,Magacin!A144:E5141,2,FALSE))","v":""}]
[null,null,{"$f":"IF(B1390=\"\",\"\",VLOOKUP(B1390,Magacin!A145:E5142,2,FALSE))","v":""}]
[null,null,{"$f":"IF(B1391=\"\",\"\",VLOOKUP(B1391,Magacin!A146:E5143,2,FALSE))","v":""}]
[null,null,{"$f":"IF(B1392=\"\",\"\",VLOOKUP(B1392,Magacin!A147:E5144,2,FALSE))","v":""}]
[null,null,{"$f":"IF(B1393=\"\",\"\",VLOOKUP(B1393,Magacin!A148:E5145,2,FALSE))","v":""}]
[null,null,{"$f":"IF(B1394=\"\",\"\",VLOOKUP(B1394,Magacin!A149:E5146,2,FALSE))","v":""}]
[null,null,{"$f":"IF(B1395=\"\",\"\",VLOOKUP(B1395,Magacin!A150:E5147,2,FALSE))","v":""}]
[null,null,{"$f":"IF(B1396=\"\",\"\",VLOOKUP(B1396,Magacin!A151:E5148,2,FALSE))","v":""}]
[null,null,{"$f":"IF(B1397=\"\",\"\",VLOOKUP(B1397,Magacin!A152:E5149,2,FALSE))","v":""}]
[null,null,{"$f":"IF(B1398=\"\",\"\",VLOOKUP(B1398,Magacin!A153:E5150,2,FALSE))","v":""}]
[null,null,{"$f":"IF(B1399=\"\",\"\",VLOOKUP(B1399,Magacin!A154:E5151,2,FALSE))","v":""}]
[null,null,{"$f":"IF(B1400=\"\",\"\",VLOOKUP(B1400,Magacin!A155:E5152,2,FALSE))","v":""}]
[null,null,{"$f":"IF(B1401=\"\",\"\",VLOOKUP(B1401,Magacin!A156:E5153,2,FALSE))","v":""}]
[null,null,{"$f":"IF(B1402=\"\",\"\",VLOOKUP(B1402,Magacin!A157:E5154,2,FALSE))","v":""}]
[null,null,{"$f":"IF(B1403=\"\",\"\",VLOOKUP(B1403,Magacin!A158:E5155,2,FALSE))","v":""}]
[null,null,{"$f":"IF(B1404=\"\",\"\",VLOOKUP(B1404,Magacin!A159:E5156,2,FALSE))","v":""}]
[null,null,{"$f":"IF(B1405=\"\",\"\",VLOOKUP(B1405,Magacin!A160:E5157,2,FALSE))","v":""}]
[null,null,{"$f":"IF(B1406=\"\",\"\",VLOOKUP(B1406,Magacin!A161:E5158,2,FALSE))","v":""}]
[null,null,{"$f":"IF(B1407=\"\",\"\",VLOOKUP(B1407,Magacin!A162:E5159,2,FALSE))","v":""}]
[null,null,{"$f":"IF(B1408=\"\",\"\",VLOOKUP(B1408,Magacin!A163:E5160,2,FALSE))","v":""}]
[null,null,{"$f":"IF(B1409=\"\",\"\",VLOOKUP(B1409,Magacin!A164:E5161,2,FALSE))","v":""}]
[null,null,{"$f":"IF(B1410=\"\",\"\",VLOOKUP(B1410,Magacin!A165:E5162,2,FALSE))","v":""}]
[null,null,{"$f":"IF(B1411=\"\",\"\",VLOOKUP(B1411,Magacin!A166:E5163,2,FALSE))","v":""}]
[null,null,{"$f":"IF(B1412=\"\",\"\",VLOOKUP(B1412,Magacin!A167:E5164,2,FALSE))","v":""}]
[null,null,{"$f":"IF(B1413=\"\",\"\",VLOOKUP(B1413,Magacin!A168:E5165,2,FALSE))","v":""}]
[null,null,{"$f":"IF(B1414=\"\",\"\",VLOOKUP(B1414,Magacin!A169:E5166,2,FALSE))","v":""}]
[null,null,{"$f":"IF(B1415=\"\",\"\",VLOOKUP(B1415,Magacin!A170:E5167,2,FALSE))","v":""}]
[null,null,{"$f":"IF(B1416=\"\",\"\",VLOOKUP(B1416,Magacin!A171:E5168,2,FALSE))","v":""}]
[null,null,{"$f":"IF(B1417=\"\",\"\",VLOOKUP(B1417,Magacin!A172:E5169,2,FALSE))","v":""}]
[null,null,{"$f":"IF(B1418=\"\",\"\",VLOOKUP(B1418,Magacin!A173:E5170,2,FALSE))","v":""}]
[null,null,{"$f":"IF(B1419=\"\",\"\",VLOOKUP(B1419,Magacin!A174:E5171,2,FALSE))","v":""}]
[null,null,{"$f":"IF(B1420=\"\",\"\",VLOOKUP(B1420,Magacin!A175:E5172,2,FALSE))","v":""}]
[null,null,{"$f":"IF(B1421=\"\",\"\",VLOOKUP(B1421,Magacin!A176:E5173,2,FALSE))","v":""}]
[null,null,{"$f":"IF(B1422=\"\",\"\",VLOOKUP(B1422,Magacin!A177:E5174,2,FALSE))","v":""}]
[null,null,{"$f":"IF(B1423=\"\",\"\",VLOOKUP(B1423,Magacin!A178:E5175,2,FALSE))","v":""}]
[null,null,{"$f":"IF(B1424=\"\",\"\",VLOOKUP(B1424,Magacin!A179:E5176,2,FALSE))","v":""}]
[null,null,{"$f":"IF(B1425=\"\",\"\",VLOOKUP(B1425,Magacin!A180:E5177,2,FALSE))","v":""}]
[null,null,{"$f":"IF(B1426=\"\",\"\",VLOOKUP(B1426,Magacin!A181:E5178,2,FALSE))","v":""}]
[null,null,{"$f":"IF(B1427=\"\",\"\",VLOOKUP(B1427,Magacin!A182:E5179,2,FALSE))","v":""}]
[null,null,{"$f":"IF(B1428=\"\",\"\",VLOOKUP(B1428,Magacin!A183:E5180,2,FALSE))","v":""}]
[null,null,{"$f":"IF(B1429=\"\",\"\",VLOOKUP(B1429,Magacin!A184:E5181,2,FALSE))","v":""}]
[null,null,{"$f":"IF(B1430=\"\",\"\",VLOOKUP(B1430,Magacin!A185:E5182,2,FALSE))","v":""}]
[null,null,{"$f":"IF(B1431=\"\",\"\",VLOOKUP(B1431,Magacin!A186:E5183,2,FALSE))","v":""}]
[null,null,{"$f":"IF(B1432=\"\",\"\",VLOOKUP(B1432,Magacin!A187:E5184,2,FALSE))","v":""}]
[null,null,{"$f":"IF(B1433=\"\",\"\",VLOOKUP(B1433,Magacin!A188:E5185,2,FALSE))","v":""}]
[null,null,{"$f":"IF(B1434=\"\",\"\",VLOOKUP(B1434,Magacin!A189:E5186,2,FALSE))","v":""}]
[null,null,{"$f":"IF(B1435=\"\",\"\",VLOOKUP(B1435,Magacin!A190:E5187,2,FALSE))","v":""}]
[null,null,{"$f":"IF(B1436=\"\",\"\",VLOOKUP(B1436,Magacin!A191:E5188,2,FALSE))","v":""}]
[null,null,{"$f":"IF(B1437=\"\",\"\",VLOOKUP(B1437,Magacin!A192:E5189,2,FALSE))","v":""}]
[null,null,{"$f":"IF(B1438=\"\",\"\",VLOOKUP(B1438,Magacin!A193:E5190,2,FALSE))","v":""}]
[null,null,{"$f":"IF(B1439=\"\",\"\",VLOOKUP(B1439,Magacin!A194:E5191,2,FALSE))","v":""}]
[null,null,{"$f":"IF(B1440=\"\",\"\",VLOOKUP(B1440,Magacin!A195:E5192,2,FALSE))","v":""}]
[null,null,{"$f":"IF(B1441=\"\",\"\",VLOOKUP(B1441,Magacin!A196:E5193,2,FALSE))","v":""}]
[null,null,{"$f":"IF(B1442=\"\",\"\",VLOOKUP(B1442,Magacin!A197:E5194,2,FALSE))","v":""}]
[null,null,{"$f":"IF(B1443=\"\",\"\",VLOOKUP(B1443,Magacin!A198:E5195,2,FALSE))","v":""}]
[null,null,{"$f":"IF(B1444=\"\",\"\",VLOOKUP(B1444,Magacin!A199:E5196,2,FALSE))","v":""}]
[null,null,{"$f":"IF(B1445=\"\",\"\",VLOOKUP(B1445,Magacin!A200:E5197,2,FALSE))","v":""}]
[null,null,{"$f":"IF(B1446=\"\",\"\",VLOOKUP(B1446,Magacin!A201:E5198,2,FALSE))","v":""}]
[null,null,{"$f":"IF(B1447=\"\",\"\",VLOOKUP(B1447,Magacin!A202:E5199,2,FALSE))","v":""}]
[null,null,{"$f":"IF(B1448=\"\",\"\",VLOOKUP(B1448,Magacin!A203:E5200,2,FALSE))","v":""}]
[null,null,{"$f":"IF(B1449=\"\",\"\",VLOOKUP(B1449,Magacin!A204:E5201,2,FALSE))","v":""}]
[null,null,{"$f":"IF(B1450=\"\",\"\",VLOOKUP(B1450,Magacin!A205:E5202,2,FALSE))","v":""}]
[null,null,{"$f":"IF(B1451=\"\",\"\",VLOOKUP(B1451,Magacin!A206:E5203,2,FALSE))","v":""}]
[null,null,{"$f":"IF(B1452=\"\",\"\",VLOOKUP(B1452,Magacin!A207:E5204,2,FALSE))","v":""}]
[null,null,{"$f":"IF(B1453=\"\",\"\",VLOOKUP(B1453,Magacin!A208:E5205,2,FALSE))","v":""}]
[null,null,{"$f":"IF(B1454=\"\",\"\",VLOOKUP(B1454,Magacin!A209:E5206,2,FALSE))","v":""}]
[null,null,{"$f":"IF(B1455=\"\",\"\",VLOOKUP(B1455,Magacin!A210:E5207,2,FALSE))","v":""}]
[null,null,{"$f":"IF(B1456=\"\",\"\",VLOOKUP(B1456,Magacin!A211:E5208,2,FALSE))","v":""}]
[null,null,{"$f":"IF(B1457=\"\",\"\",VLOOKUP(B1457,Magacin!A212:E5209,2,FALSE))","v":""}]
[null,null,{"$f":"IF(B1458=\"\",\"\",VLOOKUP(B1458,Magacin!A213:E5210,2,FALSE))","v":""}]
[null,null,{"$f":"IF(B1459=\"\",\"\",VLOOKUP(B1459,Magacin!A214:E5211,2,FALSE))","v":""}]
[null,null,{"$f":"IF(B1460=\"\",\"\",VLOOKUP(B1460,Magacin!A215:E5212,2,FALSE))","v":""}]
[null,null,{"$f":"IF(B1461=\"\",\"\",VLOOKUP(B1461,Magacin!A216:E5213,2,FALSE))","v":""}]
[null,null,{"$f":"IF(B1462=\"\",\"\",VLOOKUP(B1462,Magacin!A217:E5214,2,FALSE))","v":""}]
[null,null,{"$f":"IF(B1463=\"\",\"\",VLOOKUP(B1463,Magacin!A218:E5215,2,FALSE))","v":""}]
[null,null,{"$f":"IF(B1464=\"\",\"\",VLOOKUP(B1464,Magacin!A219:E5216,2,FALSE))","v":""}]
[null,null,{"$f":"IF(B1465=\"\",\"\",VLOOKUP(B1465,Magacin!A220:E5217,2,FALSE))","v":""}]
[null,null,{"$f":"IF(B1466=\"\",\"\",VLOOKUP(B1466,Magacin!A221:E5218,2,FALSE))","v":""}]
[null,null,{"$f":"IF(B1467=\"\",\"\",VLOOKUP(B1467,Magacin!A222:E5219,2,FALSE))","v":""}]
[null,null,{"$f":"IF(B1468=\"\",\"\",VLOOKUP(B1468,Magacin!A223:E5220,2,FALSE))","v":""}]
[null,null,{"$f":"IF(B1469=\"\",\"\",VLOOKUP(B1469,Magacin!A224:E5221,2,FALSE))","v":""}]
[null,null,{"$f":"IF(B1470=\"\",\"\",VLOOKUP(B1470,Magacin!A225:E5222,2,FALSE))","v":""}]
[null,null,{"$f":"IF(B1471=\"\",\"\",VLOOKUP(B1471,Magacin!A226:E5223,2,FALSE))","v":""}]
[null,null,{"$f":"IF(B1472=\"\",\"\",VLOOKUP(B1472,Magacin!A227:E5224,2,FALSE))","v":""}]
[null,null,{"$f":"IF(B1473=\"\",\"\",VLOOKUP(B1473,Magacin!A228:E5225,2,FALSE))","v":""}]
[null,null,{"$f":"IF(B1474=\"\",\"\",VLOOKUP(B1474,Magacin!A229:E5226,2,FALSE))","v":""}]
[null,null,{"$f":"IF(B1475=\"\",\"\",VLOOKUP(B1475,Magacin!A230:E5227,2,FALSE))","v":""}]
[null,null,{"$f":"IF(B1476=\"\",\"\",VLOOKUP(B1476,Magacin!A231:E5228,2,FALSE))","v":""}]
[null,null,{"$f":"IF(B1477=\"\",\"\",VLOOKUP(B1477,Magacin!A232:E5229,2,FALSE))","v":""}]
[null,null,{"$f":"IF(B1478=\"\",\"\",VLOOKUP(B1478,Magacin!A233:E5230,2,FALSE))","v":""}]
[null,null,{"$f":"IF(B1479=\"\",\"\",VLOOKUP(B1479,Magacin!A234:E5231,2,FALSE))","v":""}]
[null,null,{"$f":"IF(B1480=\"\",\"\",VLOOKUP(B1480,Magacin!A235:E5232,2,FALSE))","v":""}]
[null,null,{"$f":"IF(B1481=\"\",\"\",VLOOKUP(B1481,Magacin!A236:E5233,2,FALSE))","v":""}]
[null,null,{"$f":"IF(B1482=\"\",\"\",VLOOKUP(B1482,Magacin!A237:E5234,2,FALSE))","v":""}]
[null,null,{"$f":"IF(B1483=\"\",\"\",VLOOKUP(B1483,Magacin!A238:E5235,2,FALSE))","v":""}]
[null,null,{"$f":"IF(B1484=\"\",\"\",VLOOKUP(B1484,Magacin!A239:E5236,2,FALSE))","v":""}]
[null,null,{"$f":"IF(B1485=\"\",\"\",VLOOKUP(B1485,Magacin!A240:E5237,2,FALSE))","v":""}]
[null,null,{"$f":"IF(B1486=\"\",\"\",VLOOKUP(B1486,Magacin!A241:E5238,2,FALSE))","v":""}]
[null,null,{"$f":"IF(B1487=\"\",\"\",VLOOKUP(B1487,Magacin!A242:E5239,2,FALSE))","v":""}]
[null,null,{"$f":"IF(B1488=\"\",\"\",VLOOKUP(B1488,Magacin!A243:E5240,2,FALSE))","v":""}]
[null,null,{"$f":"IF(B1489=\"\",\"\",VLOOKUP(B1489,Magacin!A244:E5241,2,FALSE))","v":""}]
[null,null,{"$f":"IF(B1490=\"\",\"\",VLOOKUP(B1490,Magacin!A245:E5242,2,FALSE))","v":""}]
[null,null,{"$f":"IF(B1491=\"\",\"\",VLOOKUP(B1491,Magacin!A246:E5243,2,FALSE))","v":""}]
[null,null,{"$f":"IF(B1492=\"\",\"\",VLOOKUP(B1492,Magacin!A247:E5244,2,FALSE))","v":""}]
[null,null,{"$f":"IF(B1493=\"\",\"\",VLOOKUP(B1493,Magacin!A248:E5245,2,FALSE))","v":""}]
[null,null,{"$f":"IF(B1494=\"\",\"\",VLOOKUP(B1494,Magacin!A249:E5246,2,FALSE))","v":""}]
[null,null,{"$f":"IF(B1495=\"\",\"\",VLOOKUP(B1495,Magacin!A250:E5247,2,FALSE))","v":""}]
[null,null,{"$f":"IF(B1496=\"\",\"\",VLOOKUP(B1496,Magacin!A251:E5248,2,FALSE))","v":""}]
[null,null,{"$f":"IF(B1497=\"\",\"\",VLOOKUP(B1497,Magacin!A252:E5249,2,FALSE))","v":""}]
[null,null,{"$f":"IF(B1498=\"\",\"\",VLOOKUP(B1498,Magacin!A253:E5250,2,FALSE))","v":""}]
[null,null,{"$f":"IF(B1499=\"\",\"\",VLOOKUP(B1499,Magacin!A254:E5251,2,FALSE))","v":""}]
[null,null,{"$f":"IF(B1500=\"\",\"\",VLOOKUP(B1500,Magacin!A255:E5252,2,FALSE))","v":""}]
[null,null,{"$f":"IF(B1501=\"\",\"\",VLOOKUP(B1501,Magacin!A256:E5253,2,FALSE))","v":""}]
[null,null,{"$f":"IF(B1502=\"\",\"\",VLOOKUP(B1502,Magacin!A257:E5254,2,FALSE))","v":""}]
[null,null,{"$f":"IF(B1503=\"\",\"\",VLOOKUP(B1503,Magacin!A258:E5255,2,FALSE))","v":""}]
[null,null,{"$f":"IF(B1504=\"\",\"\",VLOOKUP(B1504,Magacin!A259:E5256,2,FALSE))","v":""}]
[null,null,{"$f":"IF(B1505=\"\",\"\",VLOOKUP(B1505,Magacin!A260:E5257,2,FALSE))","v":""}]
[null,null,{"$f":"IF(B1506=\"\",\"\",VLOOKUP(B1506,Magacin!A261:E5258,2,FALSE))","v":""}]
[null,null,{"$f":"IF(B1507=\"\",\"\",VLOOKUP(B1507,Magacin!A262:E5259,2,FALSE))","v":""}]
[null,null,{"$f":"IF(B1508=\"\",\"\",VLOOKUP(B1508,Magacin!A263:E5260,2,FALSE))","v":""}]
[null,null,{"$f":"IF(B1509=\"\",\"\",VLOOKUP(B1509,Magacin!A264:E5261,2,FALSE))","v":""}]
[null,null,{"$f":"IF(B1510=\"\",\"\",VLOOKUP(B1510,Magacin!A265:E5262,2,FALSE))","v":""}]
[null,null,{"$f":"IF(B1511=\"\",\"\",VLOOKUP(B1511,Magacin!A266:E5263,2,FALSE))","v":""}]
[null,null,{"$f":"IF(B1512=\"\",\"\",VLOOKUP(B1512,Magacin!A267:E5264,2,FALSE))","v":""}]
[null,null,{"$f":"IF(B1513=\"\",\"\",VLOOKUP(B1513,Magacin!A268:E5265,2,FALSE))","v":""}]
[null,null,{"$f":"IF(B1514=\"\",\"\",VLOOKUP(B1514,Magacin!A269:E5266,2,FALSE))","v":""}]
[null,null,{"$f":"IF(B1515=\"\",\"\",VLOOKUP(B1515,Magacin!A270:E5267,2,FALSE))","v":""}]
[null,null,{"$f":"IF(B1516=\"\",\"\",VLOOKUP(B1516,Magacin!A271:E5268,2,FALSE))","v":""}]
[null,null,{"$f":"IF(B1517=\"\",\"\",VLOOKUP(B1517,Magacin!A272:E5269,2,FALSE))","v":""}]
[null,null,{"$f":"IF(B1518=\"\",\"\",VLOOKUP(B1518,Magacin!A273:E5270,2,FALSE))","v":""}]
[null,null,{"$f":"IF(B1519=\"\",\"\",VLOOKUP(B1519,Magacin!A274:E5271,2,FALSE))","v":""}]
[null,null,{"$f":"IF(B1520=\"\",\"\",VLOOKUP(B1520,Magacin!A275:E5272,2,FALSE))","v":""}]
[null,null,{"$f":"IF(B1521=\"\",\"\",VLOOKUP(B1521,Magacin!A276:E5273,2,FALSE))","v":""}]
[null,null,{"$f":"IF(B1522=\"\",\"\",VLOOKUP(B1522,Magacin!A277:E5274,2,FALSE))","v":""}]
[null,null,{"$f":"IF(B1523=\"\",\"\",VLOOKUP(B1523,Magacin!A278:E5275,2,FALSE))","v":""}]
[null,null,{"$f":"IF(B1524=\"\",\"\",VLOOKUP(B1524,Magacin!A279:E5276,2,FALSE))","v":""}]
[null,null,{"$f":"IF(B1525=\"\",\"\",VLOOKUP(B1525,Magacin!A280:E5277,2,FALSE))","v":""}]
[null,null,{"$f":"IF(B1526=\"\",\"\",VLOOKUP(B1526,Magacin!A281:E5278,2,FALSE))","v":""}]
[null,null,{"$f":"IF(B1527=\"\",\"\",VLOOKUP(B1527,Magacin!A282:E5279,2,FALSE))","v":""}]
[null,null,{"$f":"IF(B1528=\"\",\"\",VLOOKUP(B1528,Magacin!A283:E5280,2,FALSE))","v":""}]
[null,null,{"$f":"IF(B1529=\"\",\"\",VLOOKUP(B1529,Magacin!A284:E5281,2,FALSE))","v":""}]
[null,null,{"$f":"IF(B1530=\"\",\"\",VLOOKUP(B1530,Magacin!A285:E5282,2,FALSE))","v":""}]
[null,null,{"$f":"IF(B1531=\"\",\"\",VLOOKUP(B1531,Magacin!A286:E5283,2,FALSE))","v":""}]
[null,null,{"$f":"IF(B1532=\"\",\"\",VLOOKUP(B1532,Magacin!A287:E5284,2,FALSE))","v":""}]
[null,null,{"$f":"IF(B1533=\"\",\"\",VLOOKUP(B1533,Magacin!A288:E5285,2,FALSE))","v":""}]
[null,null,{"$f":"IF(B1534=\"\",\"\",VLOOKUP(B1534,Magacin!A289:E5286,2,FALSE))","v":""}]
[null,null,{"$f":"IF(B1535=\"\",\"\",VLOOKUP(B1535,Magacin!A290:E5287,2,FALSE))","v":""}]
[null,null,{"$f":"IF(B1536=\"\",\"\",VLOOKUP(B1536,Magacin!A291:E5288,2,FALSE))","v":""}]
[null,null,{"$f":"IF(B1537=\"\",\"\",VLOOKUP(B1537,Magacin!A292:E5289,2,FALSE))","v":""}]
[null,null,{"$f":"IF(B1538=\"\",\"\",VLOOKUP(B1538,Magacin!A293:E5290,2,FALSE))","v":""}]
[null,null,{"$f":"IF(B1539=\"\",\"\",VLOOKUP(B1539,Magacin!A294:E5291,2,FALSE))","v":""}]
[null,null,{"$f":"IF(B1540=\"\",\"\",VLOOKUP(B1540,Magacin!A295:E5292,2,FALSE))","v":""}]
[null,null,{"$f":"IF(B1541=\"\",\"\",VLOOKUP(B1541,Magacin!A296:E5293,2,FALSE))","v":""}]
[null,null,{"$f":"IF(B1542=\"\",\"\",VLOOKUP(B1542,Magacin!A297:E5294,2,FALSE))","v":""}]
[null,null,{"$f":"IF(B1543=\"\",\"\",VLOOKUP(B1543,Magacin!A298:E5295,2,FALSE))","v":""}]
[null,null,{"$f":"IF(B1544=\"\",\"\",VLOOKUP(B1544,Magacin!A299:E5296,2,FALSE))","v":""}]
[null,null,{"$f":"IF(B1545=\"\",\"\",VLOOKUP(B1545,Magacin!A300:E5297,2,FALSE))","v":""}]
[null,null,{"$f":"IF(B1546=\"\",\"\",VLOOKUP(B1546,Magacin!A301:E5298,2,FALSE))","v":""}]
[null,null,{"$f":"IF(B1547=\"\",\"\",VLOOKUP(B1547,Magacin!A302:E5299,2,FALSE))","v":""}]
[null,null,{"$f":"IF(B1548=\"\",\"\",VLOOKUP(B1548,Magacin!A303:E5300,2,FALSE))","v":""}]
[null,null,{"$f":"IF(B1549=\"\",\"\",VLOOKUP(B1549,Magacin!A304:E5301,2,FALSE))","v":""}]
[null,null,{"$f":"IF(B1550=\"\",\"\",VLOOKUP(B1550,Magacin!A305:E5302,2,FALSE))","v":""}]
[null,null,{"$f":"IF(B1551=\"\",\"\",VLOOKUP(B1551,Magacin!A306:E5303,2,FALSE))","v":""}]
[null,null,{"$f":"IF(B1552=\"\",\"\",VLOOKUP(B1552,Magacin!A307:E5304,2,FALSE))","v":""}]
[null,null,{"$f":"IF(B1553=\"\",\"\",VLOOKUP(B1553,Magacin!A308:E5305,2,FALSE))","v":""}]
[null,null,{"$f":"IF(B1554=\"\",\"\",VLOOKUP(B1554,Magacin!A309:E5306,2,FALSE))","v":""}]
[null,null,{"$f":"IF(B1555=\"\",\"\",VLOOKUP(B1555,Magacin!A310:E5307,2,FALSE))","v":""}]
[null,null,{"$f":"IF(B1556=\"\",\"\",VLOOKUP(B1556,Magacin!A311:E5308,2,FALSE))","v":""}]
[null,null,{"$f":"IF(B1557=\"\",\"\",VLOOKUP(B1557,Magacin!A312:E5309,2,FALSE))","v":""}]
[null,null,{"$f":"IF(B1558=\"\",\"\",VLOOKUP(B1558,Magacin!A313:E5310,2,FALSE))","v":""}]
[null,null,{"$f":"IF(B1559=\"\",\"\",VLOOKUP(B1559,Magacin!A314:E5311,2,FALSE))","v":""}]
[null,null,{"$f":"IF(B1560=\"\",\"\",VLOOKUP(B1560,Magacin!A315:E5312,2,FALSE))","v":""}]
[null,null,{"$f":"IF(B1561=\"\",\"\",VLOOKUP(B1561,Magacin!A316:E5313,2,FALSE))","v":""}]
[null,null,{"$f":"IF(B1562=\"\",\"\",VLOOKUP(B1562,Magacin!A317:E5314,2,FALSE))","v":""}]
[null,null,{"$f":"IF(B1563=\"\",\"\",VLOOKUP(B1563,Magacin!A318:E5315,2,FALSE))","v":""}]
[null,null,{"$f":"IF(B1564=\"\",\"\",VLOOKUP(B1564,Magacin!A319:E5316,2,FALSE))","v":""}]
[null,null,{"$f":"IF(B1565=\"\",\"\",VLOOKUP(B1565,Magacin!A320:E5317,2,FALSE))","v":""}]
[null,null,{"$f":"IF(B1566=\"\",\"\",VLOOKUP(B1566,Magacin!A321:E5318,2,FALSE))","v":""}]
[null,null,{"$f":"IF(B1567=\"\",\"\",VLOOKUP(B1567,Magacin!A322:E5319,2,FALSE))","v":""}]
[null,null,{"$f":"IF(B1568=\"\",\"\",VLOOKUP(B1568,Magacin!A323:E5320,2,FALSE))","v":""}]
[null,null,{"$f":"IF(B1569=\"\",\"\",VLOOKUP(B1569,Magacin!A324:E5321,2,FALSE))","v":""}]
[null,null,{"$f":"IF(B1570=\"\",\"\",VLOOKUP(B1570,Magacin!A325:E5322,2,FALSE))","v":""}]
[null,null,{"$f":"IF(B1571=\"\",\"\",VLOOKUP(B1571,Magacin!A326:E5323,2,FALSE))","v":""}]
[null,null,{"$f":"IF(B1572=\"\",\"\",VLOOKUP(B1572,Magacin!A327:E5324,2,FALSE))","v":""}]
[null,null,{"$f":"IF(B1573=\"\",\"\",VLOOKUP(B1573,Magacin!A328:E5325,2,FALSE))","v":""}]
[null,null,{"$f":"IF(B1574=\"\",\"\",VLOOKUP(B1574,Magacin!A329:E5326,2,FALSE))","v":""}]
[null,null,{"$f":"IF(B1575=\"\",\"\",VLOOKUP(B1575,Magacin!A330:E5327,2,FALSE))","v":""}]
[null,null,{"$f":"IF(B1576=\"\",\"\",VLOOKUP(B1576,Magacin!A331:E5328,2,FALSE))","v":""}]
[null,null,{"$f":"IF(B1577=\"\",\"\",VLOOKUP(B1577,Magacin!A332:E5329,2,FALSE))","v":""}]
[null,null,{"$f":"IF(B1578=\"\",\"\",VLOOKUP(B1578,Magacin!A333:E5330,2,FALSE))","v":""}]
[null,null,{"$f":"IF(B1579=\"\",\"\",VLOOKUP(B1579,Magacin!A334:E5331,2,FALSE))","v":""}]
[null,null,{"$f":"IF(B1580=\"\",\"\",VLOOKUP(B1580,Magacin!A335:E5332,2,FALSE))","v":""}]
[null,null,{"$f":"IF(B1581=\"\",\"\",VLOOKUP(B1581,Magacin!A336:E5333,2,FALSE))","v":""}]
[null,null,{"$f":"IF(B1582=\"\",\"\",VLOOKUP(B1582,Magacin!A337:E5334,2,FALSE))","v":""}]
[null,null,{"$f":"IF(B1583=\"\",\"\",VLOOKUP(B1583,Magacin!A338:E5335,2,FALSE))","v":""}]
[null,null,{"$f":"IF(B1584=\"\",\"\",VLOOKUP(B1584,Magacin!A339:E5336,2,FALSE))","v":""}]
[null,null,{"$f":"IF(B1585=\"\",\"\",VLOOKUP(B1585,Magacin!A340:E5337,2,FALSE))","v":""}]
[null,null,{"$f":"IF(B1586=\"\",\"\",VLOOKUP(B1586,Magacin!A341:E5338,2,FALSE))","v":""}]
[null,null,{"$f":"IF(B1587=\"\",\"\",VLOOKUP(B1587,Magacin!A342:E5339,2,FALSE))","v":""}]
[null,null,{"$f":"IF(B1588=\"\",\"\",VLOOKUP(B1588,Magacin!A343:E5340,2,FALSE))","v":""}]
[null,null,{"$f":"IF(B1589=\"\",\"\",VLOOKUP(B1589,Magacin!A344:E5341,2,FALSE))","v":""}]
[null,null,{"$f":"IF(B1590=\"\",\"\",VLOOKUP(B1590,Magacin!A345:E5342,2,FALSE))","v":""}]
[null,null,{"$f":"IF(B1591=\"\",\"\",VLOOKUP(B1591,Magacin!A346:E5343,2,FALSE))","v":""}]
[null,null,{"$f":"IF(B1592=\"\",\"\",VLOOKUP(B1592,Magacin!A347:E5344,2,FALSE))","v":""}]
[null,null,{"$f":"IF(B1593=\"\",\"\",VLOOKUP(B1593,Magacin!A348:E5345,2,FALSE))","v":""}]
[null,null,{"$f":"IF(B1594=\"\",\"\",VLOOKUP(B1594,Magacin!A349:E5346,2,FALSE))","v":""}]
[null,null,{"$f":"IF(B1595=\"\",\"\",VLOOKUP(B1595,Magacin!A350:E5347,2,FALSE))","v":""}]
[null,null,{"$f":"IF(B1596=\"\",\"\",VLOOKUP(B1596,Magacin!A351:E5348,2,FALSE))","v":""}]
[null,null,{"$f":"IF(B1597=\"\",\"\",VLOOKUP(B1597,Magacin!A352:E5349,2,FALSE))","v":""}]
[null,null,{"$f":"IF(B1598=\"\",\"\",VLOOKUP(B1598,Magacin!A353:E5350,2,FALSE))","v":""}]
[null,null,{"$f":"IF(B1599=\"\",\"\",VLOOKUP(B1599,Magacin!A354:E5351,2,FALSE))","v":""}]
[null,null,{"$f":"IF(B1600=\"\",\"\",VLOOKUP(B1600,Magacin!A355:E5352,2,FALSE))","v":""}]
[null,null,{"$f":"IF(B1601=\"\",\"\",VLOOKUP(B1601,Magacin!A356:E5353,2,FALSE))","v":""}]
[null,null,{"$f":"IF(B1602=\"\",\"\",VLOOKUP(B1602,Magacin!A357:E5354,2,FALSE))","v":""}]
[null,null,{"$f":"IF(B1603=\"\",\"\",VLOOKUP(B1603,Magacin!A358:E5355,2,FALSE))","v":""}]
[null,null,{"$f":"IF(B1604=\"\",\"\",VLOOKUP(B1604,Magacin!A359:E5356,2,FALSE))","v":""}]
[null,null,{"$f":"IF(B1605=\"\",\"\",VLOOKUP(B1605,Magacin!A360:E5357,2,FALSE))","v":""}]
[null,null,{"$f":"IF(B1606=\"\",\"\",VLOOKUP(B1606,Magacin!A361:E5358,2,FALSE))","v":""}]
[null,null,{"$f":"IF(B1607=\"\",\"\",VLOOKUP(B1607,Magacin!A362:E5359,2,FALSE))","v":""}]
[null,null,{"$f":"IF(B1608=\"\",\"\",VLOOKUP(B1608,Magacin!A363:E5360,2,FALSE))","v":""}]
[null,null,{"$f":"IF(B1609=\"\",\"\",VLOOKUP(B1609,Magacin!A364:E5361,2,FALSE))","v":""}]
[null,null,{"$f":"IF(B1610=\"\",\"\",VLOOKUP(B1610,Magacin!A365:E5362,2,FALSE))","v":""}]
[null,null,{"$f":"IF(B1611=\"\",\"\",VLOOKUP(B1611,Magacin!A366:E5363,2,FALSE))","v":""}]
[null,null,{"$f":"IF(B1612=\"\",\"\",VLOOKUP(B1612,Magacin!A367:E5364,2,FALSE))","v":""}]
[null,null,{"$f":"IF(B1613=\"\",\"\",VLOOKUP(B1613,Magacin!A368:E5365,2,FALSE))","v":""}]
[null,null,{"$f":"IF(B1614=\"\",\"\",VLOOKUP(B1614,Magacin!A369:E5366,2,FALSE))","v":""}]
[null,null,{"$f":"IF(B1615=\"\",\"\",VLOOKUP(B1615,Magacin!A370:E5367,2,FALSE))","v":""}]
[null,null,{"$f":"IF(B1616=\"\",\"\",VLOOKUP(B1616,Magacin!A371:E5368,2,FALSE))","v":""}]
[null,null,{"$f":"IF(B1617=\"\",\"\",VLOOKUP(B1617,Magacin!A372:E5369,2,FALSE))","v":""}]
[null,null,{"$f":"IF(B1618=\"\",\"\",VLOOKUP(B1618,Magacin!A373:E5370,2,FALSE))","v":""}]
[null,null,{"$f":"IF(B1619=\"\",\"\",VLOOKUP(B1619,Magacin!A374:E5371,2,FALSE))","v":""}]
[null,null,{"$f":"IF(B1620=\"\",\"\",VLOOKUP(B1620,Magacin!A375:E5372,2,FALSE))","v":""}]
[null,null,{"$f":"IF(B1621=\"\",\"\",VLOOKUP(B1621,Magacin!A376:E5373,2,FALSE))","v":""}]
[null,null,{"$f":"IF(B1622=\"\",\"\",VLOOKUP(B1622,Magacin!A377:E5374,2,FALSE))","v":""}]
[null,null,{"$f":"IF(B1623=\"\",\"\",VLOOKUP(B1623,Magacin!A378:E5375,2,FALSE))","v":""}]
[null,null,{"$f":"IF(B1624=\"\",\"\",VLOOKUP(B1624,Magacin!A379:E5376,2,FALSE))","v":""}]
[null,null,{"$f":"IF(B1625=\"\",\"\",VLOOKUP(B1625,Magacin!A380:E5377,2,FALSE))","v":""}]
[null,null,{"$f":"IF(B1626=\"\",\"\",VLOOKUP(B1626,Magacin!A381:E5378,2,FALSE))","v":""}]
[null,null,{"$f":"IF(B1627=\"\",\"\",VLOOKUP(B1627,Magacin!A382:E5379,2,FALSE))","v":""}]
[null,null,{"$f":"IF(B1628=\"\",\"\",VLOOKUP(B1628,Magacin!A383:E5380,2,FALSE))","v":""}]
[null,null,{"$f":"IF(B1629=\"\",\"\",VLOOKUP(B1629,Magacin!A384:E5381,2,FALSE))","v":""}]
[null,null,{"$f":"IF(B1630=\"\",\"\",VLOOKUP(B1630,Magacin!A385:E5382,2,FALSE))","v":""}]
[null,null,{"$f":"IF(B1631=\"\",\"\",VLOOKUP(B1631,Magacin!A386:E5383,2,FALSE))","v":""}]
[null,null,{"$f":"IF(B1632=\"\",\"\",VLOOKUP(B1632,Magacin!A387:E5384,2,FALSE))","v":""}]
[null,null,{"$f":"IF(B1633=\"\",\"\",VLOOKUP(B1633,Magacin!A388:E5385,2,FALSE))","v":""}]
[null,null,{"$f":"IF(B1634=\"\",\"\",VLOOKUP(B1634,Magacin!A389:E5386,2,FALSE))","v":""}]
[null,null,{"$f":"IF(B1635=\"\",\"\",VLOOKUP(B1635,Magacin!A390:E5387,2,FALSE))","v":""}]
[null,null,{"$f":"IF(B1636=\"\",\"\",VLOOKUP(B1636,Magacin!A391:E5388,2,FALSE))","v":""}]
[null,null,{"$f":"IF(B1637=\"\",\"\",VLOOKUP(B1637,Magacin!A392:E5389,2,FALSE))","v":""}]
[null,null,{"$f":"IF(B1638=\"\",\"\",VLOOKUP(B1638,Magacin!A393:E5390,2,FALSE))","v":""}]
[null,null,{"$f":"IF(B1639=\"\",\"\",VLOOKUP(B1639,Magacin!A394:E5391,2,FALSE))","v":""}]
[null,null,{"$f":"IF(B1640=\"\",\"\",VLOOKUP(B1640,Magacin!A395:E5392,2,FALSE))","v":""}]
[null,null,{"$f":"IF(B1641=\"\",\"\",VLOOKUP(B1641,Magacin!A396:E5393,2,FALSE))","v":""}]
[null,null,{"$f":"IF(B1642=\"\",\"\",VLOOKUP(B1642,Magacin!A397:E5394,2,FALSE))","v":""}]
[null,null,{"$f":"IF(B1643=\"\",\"\",VLOOKUP(B1643,Magacin!A398:E5395,2,FALSE))","v":""}]
[null,null,{"$f":"IF(B1644=\"\",\"\",VLOOKUP(B1644,Magacin!A399:E5396,2,FALSE))","v":""}]
[null,null,{"$f":"IF(B1645=\"\",\"\",VLOOKUP(B1645,Magacin!A400:E5397,2,FALSE))","v":""}]
[null,null,{"$f":"IF(B1646=\"\",\"\",VLOOKUP(B1646,Magacin!A401:E5398,2,FALSE))","v":""}]
[null,null,{"$f":"IF(B1647=\"\",\"\",VLOOKUP(B1647,Magacin!A402:E5399,2,FALSE))","v":""}]
[null,null,{"$f":"IF(B1648=\"\",\"\",VLOOKUP(B1648,Magacin!A403:E5400,2,FALSE))","v":""}]
[null,null,{"$f":"IF(B1649=\"\",\"\",VLOOKUP(B1649,Magacin!A404:E5401,2,FALSE))","v":""}]
[null,null,{"$f":"IF(B1650=\"\",\"\",VLOOKUP(B1650,Magacin!A405:E5402,2,FALSE))","v":""}]
[null,null,{"$f":"IF(B1651=\"\",\"\",VLOOKUP(B1651,Magacin!A406:E5403,2,FALSE))","v":""}]
[null,null,{"$f":"IF(B1652=\"\",\"\",VLOOKUP(B1652,Magacin!A407:E5404,2,FALSE))","v":""}]
[null,null,{"$f":"IF(B1653=\"\",\"\",VLOOKUP(B1653,Magacin!A408:E5405,2,FALSE))","v":""}]
[null,null,{"$f":"IF(B1654=\"\",\"\",VLOOKUP(B1654,Magacin!A409:E5406,2,FALSE))","v":""}]
[null,null,{"$f":"IF(B1655=\"\",\"\",VLOOKUP(B1655,Magacin!A410:E5407,2,FALSE))","v":""}]
[null,null,{"$f":"IF(B1656=\"\",\"\",VLOOKUP(B1656,Magacin!A411:E5408,2,FALSE))","v":""}]
[null,null,{"$f":"IF(B1657=\"\",\"\",VLOOKUP(B1657,Magacin!A412:E5409,2,FALSE))","v":""}]
[null,null,{"$f":"IF(B1658=\"\",\"\",VLOOKUP(B1658,Magacin!A413:E5410,2,FALSE))","v":""}]
[null,null,{"$f":"IF(B1659=\"\",\"\",VLOOKUP(B1659,Magacin!A414:E5411,2,FALSE))","v":""}]
[null,null,{"$f":"IF(B1660=\"\",\"\",VLOOKUP(B1660,Magacin!A415:E5412,2,FALSE))","v":""}]
[null,null,{"$f":"IF(B1661=\"\",\"\",VLOOKUP(B1661,Magacin!A416:E5413,2,FALSE))","v":""}]
[null,null,{"$f":"IF(B1662=\"\",\"\",VLOOKUP(B1662,Magacin!A417:E5414,2,FALSE))","v":""}]
[null,null,{"$f":"IF(B1663=\"\",\"\",VLOOKUP(B1663,Magacin!A418:E5415,2,FALSE))","v":""}]
[null,null,{"$f":"IF(B1664=\"\",\"\",VLOOKUP(B1664,Magacin!A419:E5416,2,FALSE))","v":""}]
[null,null,{"$f":"IF(B1665=\"\",\"\",VLOOKUP(B1665,Magacin!A420:E5417,2,FALSE))","v":""}]
[null,null,{"$f":"IF(B1666=\"\",\"\",VLOOKUP(B1666,Magacin!A421:E5418,2,FALSE))","v":""}]
[null,null,{"$f":"IF(B1667=\"\",\"\",VLOOKUP(B1667,Magacin!A422:E5419,2,FALSE))","v":""}]
[null,null,{"$f":"IF(B1668=\"\",\"\",VLOOKUP(B1668,Magacin!A423:E5420,2,FALSE))","v":""}]
[null,null,{"$f":"IF(B1669=\"\",\"\",VLOOKUP(B1669,Magacin!A424:E5421,2,FALSE))","v":""}]
[null,null,{"$f":"IF(B1670=\"\",\"\",VLOOKUP(B1670,Magacin!A425:E5422,2,FALSE))","v":""}]
[null,null,{"$f":"IF(B1671=\"\",\"\",VLOOKUP(B1671,Magacin!A426:E5423,2,FALSE))","v":""}]
[null,null,{"$f":"IF(B1672=\"\",\"\",VLOOKUP(B1672,Magacin!A427:E5424,2,FALSE))","v":""}]
[null,null,{"$f":"IF(B1673=\"\",\"\",VLOOKUP(B1673,Magacin!A428:E5425,2,FALSE))","v":""}]
[null,null,{"$f":"IF(B1674=\"\",\"\",VLOOKUP(B1674,Magacin!A429:E5426,2,FALSE))","v":""}]
[null,null,{"$f":"IF(B1675=\"\",\"\",VLOOKUP(B1675,Magacin!A430:E5427,2,FALSE))","v":""}]
[null,null,{"$f":"IF(B1676=\"\",\"\",VLOOKUP(B1676,Magacin!A431:E5428,2,FALSE))","v":""}]
[null,null,{"$f":"IF(B1677=\"\",\"\",VLOOKUP(B1677,Magacin!A432:E5429,2,FALSE))","v":""}]
[null,null,{"$f":"IF(B1678=\"\",\"\",VLOOKUP(B1678,Magacin!A433:E5430,2,FALSE))","v":""}]
[null,null,{"$f":"IF(B1679=\"\",\"\",VLOOKUP(B1679,Magacin!A434:E5431,2,FALSE))","v":""}]
[null,null,{"$f":"IF(B1680=\"\",\"\",VLOOKUP(B1680,Magacin!A435:E5432,2,FALSE))","v":""}]
[null,null,{"$f":"IF(B1681=\"\",\"\",VLOOKUP(B1681,Magacin!A436:E5433,2,FALSE))","v":""}]
[null,null,{"$f":"IF(B1682=\"\",\"\",VLOOKUP(B1682,Magacin!A437:E5434,2,FALSE))","v":""}]
[null,null,{"$f":"IF(B1683=\"\",\"\",VLOOKUP(B1683,Magacin!A438:E5435,2,FALSE))","v":""}]
[null,null,{"$f":"IF(B1684=\"\",\"\",VLOOKUP(B1684,Magacin!A439:E5436,2,FALSE))","v":""}]
[null,null,{"$f":"IF(B1685=\"\",\"\",VLOOKUP(B1685,Magacin!A440:E5437,2,FALSE))","v":""}]
[null,null,{"$f":"IF(B1686=\"\",\"\",VLOOKUP(B1686,Magacin!A441:E5438,2,FALSE))","v":""}]
[null,null,{"$f":"IF(B1687=\"\",\"\",VLOOKUP(B1687,Magacin!A442:E5439,2,FALSE))","v":""}]
[null,null,{"$f":"IF(B1688=\"\",\"\",VLOOKUP(B1688,Magacin!A443:E5440,2,FALSE))","v":""}]
[null,null,{"$f":"IF(B1689=\"\",\"\",VLOOKUP(B1689,Magacin!A444:E5441,2,FALSE))","v":""}]
[null,null,{"$f":"IF(B1690=\"\",\"\",VLOOKUP(B1690,Magacin!A445:E5442,2,FALSE))","v":""}]
[null,null,{"$f":"IF(B1691=\"\",\"\",VLOOKUP(B1691,Magacin!A446:E5443,2,FALSE))","v":""}]
[null,null,{"$f":"IF(B1692=\"\",\"\",VLOOKUP(B1692,Magacin!A447:E5444,2,FALSE))","v":""}]
[null,null,{"$f":"IF(B1693=\"\",\"\",VLOOKUP(B1693,Magacin!A448:E5445,2,FALSE))","v":""}]
[null,null,{"$f":"IF(B1694=\"\",\"\",VLOOKUP(B1694,Magacin!A449:E5446,2,FALSE))","v":""}]
[null,null,{"$f":"IF(B1695=\"\",\"\",VLOOKUP(B1695,Magacin!A450:E5447,2,FALSE))","v":""}]
[null,null,{"$f":"IF(B1696=\"\",\"\",VLOOKUP(B1696,Magacin!A451:E5448,2,FALSE))","v":""}]
[null,null,{"$f":"IF(B1697=\"\",\"\",VLOOKUP(B1697,Magacin!A452:E5449,2,FALSE))","v":""}]
[null,null,{"$f":"IF(B1698=\"\",\"\",VLOOKUP(B1698,Magacin!A453:E5450,2,FALSE))","v":""}]
[null,null,{"$f":"IF(B1699=\"\",\"\",VLOOKUP(B1699,Magacin!A454:E5451,2,FALSE))","v":""}]
[null,null,{"$f":"IF(B1700=\"\",\"\",VLOOKUP(B1700,Magacin!A455:E5452,2,FALSE))","v":""}]
[null,null,{"$f":"IF(B1701=\"\",\"\",VLOOKUP(B1701,Magacin!A456:E5453,2,FALSE))","v":""}]
[null,null,{"$f":"IF(B1702=\"\",\"\",VLOOKUP(B1702,Magacin!A457:E5454,2,FALSE))","v":""}]
[null,null,{"$f":"IF(B1703=\"\",\"\",VLOOKUP(B1703,Magacin!A458:E5455,2,FALSE))","v":""}]
[null,null,{"$f":"IF(B1704=\"\",\"\",VLOOKUP(B1704,Magacin!A459:E5456,2,FALSE))","v":""}]
[null,null,{"$f":"IF(B1705=\"\",\"\",VLOOKUP(B1705,Magacin!A460:E5457,2,FALSE))","v":""}]
[null,null,{"$f":"IF(B1706=\"\",\"\",VLOOKUP(B1706,Magacin!A461:E5458,2,FALSE))","v":""}]
[null,null,{"$f":"IF(B1707=\"\",\"\",VLOOKUP(B1707,Magacin!A462:E5459,2,FALSE))","v":""}]
[null,null,{"$f":"IF(B1708=\"\",\"\",VLOOKUP(B1708,Magacin!A463:E5460,2,FALSE))","v":""}]
[null,null,{"$f":"IF(B1709=\"\",\"\",VLOOKUP(B1709,Magacin!A464:E5461,2,FALSE))","v":""}]
[null,null,{"$f":"IF(B1710=\"\",\"\",VLOOKUP(B1710,Magacin!A465:E5462,2,FALSE))","v":""}]
[null,null,{"$f":"IF(B1711=\"\",\"\",VLOOKUP(B1711,Magacin!A466:E5463,2,FALSE))","v":""}]
[null,null,{"$f":"IF(B1712=\"\",\"\",VLOOKUP(B1712,Magacin!A467:E5464,2,FALSE))","v":""}]
[null,null,{"$f":"IF(B1713=\"\",\"\",VLOOKUP(B1713,Magacin!A468:E5465,2,FALSE))","v":""}]
[null,null,{"$f":"IF(B1714=\"\",\"\",VLOOKUP(B1714,Magacin!A469:E5466,2,FALSE))","v":""}]
[null,null,{"$f":"IF(B1715=\"\",\"\",VLOOKUP(B1715,Magacin!A470:E5467,2,FALSE))","v":""}]
[null,null,{"$f":"IF(B1716=\"\",\"\",VLOOKUP(B1716,Magacin!A471:E5468,2,FALSE))","v":""}]
[null,null,{"$f":"IF(B1717=\"\",\"\",VLOOKUP(B1717,Magacin!A472:E5469,2,FALSE))","v":""}]
[null,null,{"$f":"IF(B1718=\"\",\"\",VLOOKUP(B1718,Magacin!A473:E5470,2,FALSE))","v":""}]
[null,null,{"$f":"IF(B1719=\"\",\"\",VLOOKUP(B1719,Magacin!A474:E5471,2,FALSE))","v":""}]
[null,null,{"$f":"IF(B1720=\"\",\"\",VLOOKUP(B1720,Magacin!A475:E5472,2,FALSE))","v":""}]
[null,null,{"$f":"IF(B1721=\"\",\"\",VLOOKUP(B1721,Magacin!A476:E5473,2,FALSE))","v":""}]
[null,null,{"$f":"IF(B1722=\"\",\"\",VLOOKUP(B1722,Magacin!A477:E5474,2,FALSE))","v":""}]
[null,null,{"$f":"IF(B1723=\"\",\"\",VLOOKUP(B1723,Magacin!A478:E5475,2,FALSE))","v":""}]
[null,null,{"$f":"IF(B1724=\"\",\"\",VLOOKUP(B1724,Magacin!A479:E5476,2,FALSE))","v":""}]
[null,null,{"$f":"IF(B1725=\"\",\"\",VLOOKUP(B1725,Magacin!A480:E5477,2,FALSE))","v":""}]
[null,null,{"$f":"IF(B1726=\"\",\"\",VLOOKUP(B1726,Magacin!A481:E5478,2,FALSE))","v":""}]
[null,null,{"$f":"IF(B1727=\"\",\"\",VLOOKUP(B1727,Magacin!A482:E5479,2,FALSE))","v":""}]
[null,null,{"$f":"IF(B1728=\"\",\"\",VLOOKUP(B1728,Magacin!A483:E5480,2,FALSE))","v":""}]
[null,null,{"$f":"IF(B1729=\"\",\"\",VLOOKUP(B1729,Magacin!A484:E5481,2,FALSE))","v":""}]
[null,null,{"$f":"IF(B1730=\"\",\"\",VLOOKUP(B1730,Magacin!A485:E5482,2,FALSE))","v":""}]
[null,null,{"$f":"IF(B1731=\"\",\"\",VLOOKUP(B1731,Magacin!A486:E5483,2,FALSE))","v":""}]
[null,null,{"$f":"IF(B1732=\"\",\"\",VLOOKUP(B1732,Magacin!A487:E5484,2,FALSE))","v":""}]
[null,null,{"$f":"IF(B1733=\"\",\"\",VLOOKUP(B1733,Magacin!A488:E5485,2,FALSE))","v":""}]
[null,null,{"$f":"IF(B1734=\"\",\"\",VLOOKUP(B1734,Magacin!A489:E5486,2,FALSE))","v":""}]
[null,null,{"$f":"IF(B1735=\"\",\"\",VLOOKUP(B1735,Magacin!A490:E5487,2,FALSE))","v":""}]
[null,null,{"$f":"IF(B1736=\"\",\"\",VLOOKUP(B1736,Magacin!A491:E5488,2,FALSE))","v":""}]
[null,null,{"$f":"IF(B1737=\"\",\"\",VLOOKUP(B1737,Magacin!A492:E5489,2,FALSE))","v":""}]
[null,null,{"$f":"IF(B1738=\"\",\"\",VLOOKUP(B1738,Magacin!A493:E5490,2,FALSE))","v":""}]
[null,null,{"$f":"IF(B1739=\"\",\"\",VLOOKUP(B1739,Magacin!A494:E5491,2,FALSE))","v":""}]
[null,null,{"$f":"IF(B1740=\"\",\"\",VLOOKUP(B1740,Magacin!A495:E5492,2,FALSE))","v":""}]
[null,null,{"$f":"IF(B1741=\"\",\"\",VLOOKUP(B1741,Magacin!A496:E5493,2,FALSE))","v":""}]
[null,null,{"$f":"IF(B1742=\"\",\"\",VLOOKUP(B1742,Magacin!A497:E5494,2,FALSE))","v":""}]
[null,null,{"$f":"IF(B1743=\"\",\"\",VLOOKUP(B1743,Magacin!A498:E5495,2,FALSE))","v":""}]
[null,null,{"$f":"IF(B1744=\"\",\"\",VLOOKUP(B1744,Magacin!A499:E5496,2,FALSE))","v":""}]
[null,null,{"$f":"IF(B1745=\"\",\"\",VLOOKUP(B1745,Magacin!A500:E5497,2,FALSE))","v":""}]
[null,null,{"$f":"IF(B1746=\"\",\"\",VLOOKUP(B1746,Magacin!A501:E5498,2,FALSE))","v":""}]
[null,null,{"$f":"IF(B1747=\"\",\"\",VLOOKUP(B1747,Magacin!A502:E5499,2,FALSE))","v":""}]
[null,null,{"$f":"IF(B1748=\"\",\"\",VLOOKUP(B1748,Magacin!A503:E5500,2,FALSE))","v":""}]
[null,null,{"$f":"IF(B1749=\"\",\"\",VLOOKUP(B1749,Magacin!A504:E5501,2,FALSE))","v":""}]
[null,null,{"$f":"IF(B1750=\"\",\"\",VLOOKUP(B1750,Magacin!A505:E5502,2,FALSE))","v":""}]
[null,null,{"$f":"IF(B1751=\"\",\"\",VLOOKUP(B1751,Magacin!A506:E5503,2,FALSE))","v":""}]
[null,null,{"$f":"IF(B1752=\"\",\"\",VLOOKUP(B1752,Magacin!A507:E5504,2,FALSE))","v":""}]
[null,null,{"$f":"IF(B1753=\"\",\"\",VLOOKUP(B1753,Magacin!A508:E5505,2,FALSE))","v":""}]
[null,null,{"$f":"IF(B1754=\"\",\"\",VLOOKUP(B1754,Magacin!A509:E5506,2,FALSE))","v":""}]
[null,null,{"$f":"IF(B1755=\"\",\"\",VLOOKUP(B1755,Magacin!A510:E5507,2,FALSE))","v":""}]
[null,null,{"$f":"IF(B1756=\"\",\"\",VLOOKUP(B1756,Magacin!A511:E5508,2,FALSE))","v":""}]
[null,null,{"$f":"IF(B1757=\"\",\"\",VLOOKUP(B1757,Magacin!A512:E5509,2,FALSE))","v":""}]
[null,null,{"$f":"IF(B1758=\"\",\"\",VLOOKUP(B1758,Magacin!A513:E5510,2,FALSE))","v":""}]
[null,null,{"$f":"IF(B1759=\"\",\"\",VLOOKUP(B1759,Magacin!A514:E5511,2,FALSE))","v":""}]
[null,null,{"$f":"IF(B1760=\"\",\"\",VLOOKUP(B1760,Magacin!A515:E5512,2,FALSE))","v":""}]
[null,null,{"$f":"IF(B1761=\"\",\"\",VLOOKUP(B1761,Magacin!A516:E5513,2,FALSE))","v":""}]
[null,null,{"$f":"IF(B1762=\"\",\"\",VLOOKUP(B1762,Magacin!A517:E5514,2,FALSE))","v":""}]
[null,null,{"$f":"IF(B1763=\"\",\"\",VLOOKUP(B1763,Magacin!A518:E5515,2,FALSE))","v":""}]
[null,null,{"$f":"IF(B1764=\"\",\"\",VLOOKUP(B1764,Magacin!A519:E5516,2,FALSE))","v":""}]
[null,null,{"$f":"IF(B1765=\"\",\"\",VLOOKUP(B1765,Magacin!A520:E5517,2,FALSE))","v":""}]
[null,null,{"$f":"IF(B1766=\"\",\"\",VLOOKUP(B1766,Magacin!A521:E5518,2,FALSE))","v":""}]
[null,null,{"$f":"IF(B1767=\"\",\"\",VLOOKUP(B1767,Magacin!A522:E5519,2,FALSE))","v":""}]
[null,null,{"$f":"IF(B1768=\"\",\"\",VLOOKUP(B1768,Magacin!A523:E5520,2,FALSE))","v":""}]
[null,null,{"$f":"IF(B1769=\"\",\"\",VLOOKUP(B1769,Magacin!A524:E5521,2,FALSE))","v":""}]
[null,null,{"$f":"IF(B1770=\"\",\"\",VLOOKUP(B1770,Magacin!A525:E5522,2,FALSE))","v":""}]
[null,null,{"$f":"IF(B1771=\"\",\"\",VLOOKUP(B1771,Magacin!A526:E5523,2,FALSE))","v":""}]
[null,null,{"$f":"IF(B1772=\"\",\"\",VLOOKUP(B1772,Magacin!A527:E5524,2,FALSE))","v":""}]
[null,null,{"$f":"IF(B1773=\"\",\"\",VLOOKUP(B1773,Magacin!A528:E5525,2,FALSE))","v":""}]
[null,null,{"$f":"IF(B1774=\"\",\"\",VLOOKUP(B1774,Magacin!A529:E5526,2,FALSE))","v":""}]
[null,null,{"$f":"IF(B1775=\"\",\"\",VLOOKUP(B1775,Magacin!A530:E5527,2,FALSE))","v":""}]
[null,null,{"$f":"IF(B1776=\"\",\"\",VLOOKUP(B1776,Magacin!A531:E5528,2,FALSE))","v":""}]
[null,null,{"$f":"IF(B1777=\"\",\"\",VLOOKUP(B1777,Magacin!A532:E5529,2,FALSE))","v":""}]
[null,null,{"$f":"IF(B1778=\"\",\"\",VLOOKUP(B1778,Magacin!A533:E5530,2,FALSE))","v":""}]
[null,null,{"$f":"IF(B1779=\"\",\"\",VLOOKUP(B1779,Magacin!A534:E5531,2,FALSE))","v":""}]
[null,null,{"$f":"IF(B1780=\"\",\"\",VLOOKUP(B1780,Magacin!A535:E5532,2,FALSE))","v":""}]
[null,null,{"$f":"IF(B1781=\"\",\"\",VLOOKUP(B1781,Magacin!A536:E5533,2,FALSE))","v":""}]
[null,null,{"$f":"IF(B1782=\"\",\"\",VLOOKUP(B1782,Magacin!A537:E5534,2,FALSE))","v":""}]
[null,null,{"$f":"IF(B1783=\"\",\"\",VLOOKUP(B1783,Magacin!A538:E5535,2,FALSE))","v":""}]
[null,null,{"$f":"IF(B1784=\"\",\"\",VLOOKUP(B1784,Magacin!A539:E5536,2,FALSE))","v":""}]
[null,null,{"$f":"IF(B1785=\"\",\"\",VLOOKUP(B1785,Magacin!A540:E5537,2,FALSE))","v":""}]
[null,null,{"$f":"IF(B1786=\"\",\"\",VLOOKUP(B1786,Magacin!A541:E5538,2,FALSE))","v":""}]
[null,null,{"$f":"IF(B1787=\"\",\"\",VLOOKUP(B1787,Magacin!A542:E5539,2,FALSE))","v":""}]
[null,null,{"$f":"IF(B1788=\"\",\"\",VLOOKUP(B1788,Magacin!A543:E5540,2,FALSE))","v":""}]
[null,null,{"$f":"IF(B1789=\"\",\"\",VLOOKUP(B1789,Magacin!A544:E5541,2,FALSE))","v":""}]
[null,null,{"$f":"IF(B1790=\"\",\"\",VLOOKUP(B1790,Magacin!A545:E5542,2,FALSE))","v":""}]
[null,null,{"$f":"IF(B1791=\"\",\"\",VLOOKUP(B1791,Magacin!A546:E5543,2,FALSE))","v":""}]
[null,null,{"$f":"IF(B1792=\"\",\"\",VLOOKUP(B1792,Magacin!A547:E5544,2,FALSE))","v":""}]
[null,null,{"$f":"IF(B1793=\"\",\"\",VLOOKUP(B1793,Magacin!A548:E5545,2,FALSE))","v":""}]
[null,null,{"$f":"IF(B1794=\"\",\"\",VLOOKUP(B1794,Magacin!A549:E5546,2,FALSE))","v":""}]
[null,null,{"$f":"IF(B1795=\"\",\"\",VLOOKUP(B1795,Magacin!A550:E5547,2,FALSE))","v":""}]
[null,null,{"$f":"IF(B1796=\"\",\"\",VLOOKUP(B1796,Magacin!A551:E5548,2,FALSE))","v":""}]
[null,null,{"$f":"IF(B1797=\"\",\"\",VLOOKUP(B1797,Magacin!A552:E5549,2,FALSE))","v":""}]
[null,null,{"$f":"IF(B1798=\"\",\"\",VLOOKUP(B1798,Magacin!A553:E5550,2,FALSE))","v":""}]
[null,null,{"$f":"IF(B1799=\"\",\"\",VLOOKUP(B1799,Magacin!A554:E5551,2,FALSE))","v":""}]
[null,null,{"$f":"IF(B1800=\"\",\"\",VLOOKUP(B1800,Magacin!A555:E5552,2,FALSE))","v":""}]
[null,null,{"$f":"IF(B1801=\"\",\"\",VLOOKUP(B1801,Magacin!A556:E5553,2,FALSE))","v":""}]
[null,null,{"$f":"IF(B1802=\"\",\"\",VLOOKUP(B1802,Magacin!A557:E5554,2,FALSE))","v":""}]
[null,null,{"$f":"IF(B1803=\"\",\"\",VLOOKUP(B1803,Magacin!A558:E5555,2,FALSE))","v":""}]
[null,null,{"$f":"IF(B1804=\"\",\"\",VLOOKUP(B1804,Magacin!A559:E5556,2,FALSE))","v":""}]
[null,null,{"$f":"IF(B1805=\"\",\"\",VLOOKUP(B1805,Magacin!A560:E5557,2,FALSE))","v":""}]
[null,null,{"$f":"IF(B1806=\"\",\"\",VLOOKUP(B1806,Magacin!A561:E5558,2,FALSE))","v":""}]
[null,null,{"$f":"IF(B1807=\"\",\"\",VLOOKUP(B1807,Magacin!A562:E5559,2,FALSE))","v":""}]
[null,null,{"$f":"IF(B1808=\"\",\"\",VLOOKUP(B1808,Magacin!A563:E5560,2,FALSE))","v":""}]
[null,null,{"$f":"IF(B1809=\"\",\"\",VLOOKUP(B1809,Magacin!A564:E5561,2,FALSE))","v":""}]
[null,null,{"$f":"IF(B1810=\"\",\"\",VLOOKUP(B1810,Magacin!A565:E5562,2,FALSE))","v":""}]
[null,null,{"$f":"IF(B1811=\"\",\"\",VLOOKUP(B1811,Magacin!A566:E5563,2,FALSE))","v":""}]
[null,null,{"$f":"IF(B1812=\"\",\"\",VLOOKUP(B1812,Magacin!A567:E5564,2,FALSE))","v":""}]
[null,null,{"$f":"IF(B1813=\"\",\"\",VLOOKUP(B1813,Magacin!A568:E5565,2,FALSE))","v":""}]
[null,null,{"$f":"IF(B1814=\"\",\"\",VLOOKUP(B1814,Magacin!A569:E5566,2,FALSE))","v":""}]
[null,null,{"$f":"IF(B1815=\"\",\"\",VLOOKUP(B1815,Magacin!A570:E5567,2,FALSE))","v":""}]
[null,null,{"$f":"IF(B1816=\"\",\"\",VLOOKUP(B1816,Magacin!A571:E5568,2,FALSE))","v":""}]
[null,null,{"$f":"IF(B1817=\"\",\"\",VLOOKUP(B1817,Magacin!A572:E5569,2,FALSE))","v":""}]
[null,null,{"$f":"IF(B1818=\"\",\"\",VLOOKUP(B1818,Magacin!A573:E5570,2,FALSE))","v":""}]
[null,null,{"$f":"IF(B1819=\"\",\"\",VLOOKUP(B1819,Magacin!A574:E5571,2,FALSE))","v":""}]
[null,null,{"$f":"IF(B1820=\"\",\"\",VLOOKUP(B1820,Magacin!A575:E5572,2,FALSE))","v":""}]
[null,null,{"$f":"IF(B1821=\"\",\"\",VLOOKUP(B1821,Magacin!A576:E5573,2,FALSE))","v":""}]
[null,null,{"$f":"IF(B1822=\"\",\"\",VLOOKUP(B1822,Magacin!A577:E5574,2,FALSE))","v":""}]
[null,null,{"$f":"IF(B1823=\"\",\"\",VLOOKUP(B1823,Magacin!A578:E5575,2,FALSE))","v":""}]
[null,null,{"$f":"IF(B1824=\"\",\"\",VLOOKUP(B1824,Magacin!A579:E5576,2,FALSE))","v":""}]
[null,null,{"$f":"IF(B1825=\"\",\"\",VLOOKUP(B1825,Magacin!A580:E5577,2,FALSE))","v":""}]
[null,null,{"$f":"IF(B1826=\"\",\"\",VLOOKUP(B1826,Magacin!A581:E5578,2,FALSE))","v":""}]
[null,null,{"$f":"IF(B1827=\"\",\"\",VLOOKUP(B1827,Magacin!A582:E5579,2,FALSE))","v":""}]
[null,null,{"$f":"IF(B1828=\"\",\"\",VLOOKUP(B1828,Magacin!A583:E5580,2,FALSE))","v":""}]
[null,null,{"$f":"IF(B1829=\"\",\"\",VLOOKUP(B1829,Magacin!A584:E5581,2,FALSE))","v":""}]
[null,null,{"$f":"IF(B1830=\"\",\"\",VLOOKUP(B1830,Magacin!A585:E5582,2,FALSE))","v":""}]
[null,null,{"$f":"IF(B1831=\"\",\"\",VLOOKUP(B1831,Magacin!A586:E5583,2,FALSE))","v":""}]
[null,null,{"$f":"IF(B1832=\"\",\"\",VLOOKUP(B1832,Magacin!A587:E5584,2,FALSE))","v":""}]
[null,null,{"$f":"IF(B1833=\"\",\"\",VLOOKUP(B1833,Magacin!A588:E5585,2,FALSE))","v":""}]
[null,null,{"$f":"IF(B1834=\"\",\"\",VLOOKUP(B1834,Magacin!A589:E5586,2,FALSE))","v":""}]
[null,null,{"$f":"IF(B1835=\"\",\"\",VLOOKUP(B1835,Magacin!A590:E5587,2,FALSE))","v":""}]
[null,null,{"$f":"IF(B1836=\"\",\"\",VLOOKUP(B1836,Magacin!A591:E5588,2,FALSE))","v":""}]
[null,null,{"$f":"IF(B1837=\"\",\"\",VLOOKUP(B1837,Magacin!A592:E5589,2,FALSE))","v":""}]
[null,null,{"$f":"IF(B1838=\"\",\"\",VLOOKUP(B1838,Magacin!A593:E5590,2,FALSE))","v":""}]
[null,null,{"$f":"IF(B1839=\"\",\"\",VLOOKUP(B1839,Magacin!A594:E5591,2,FALSE))","v":""}]
[null,null,{"$f":"IF(B1840=\"\",\"\",VLOOKUP(B1840,Magacin!A595:E5592,2,FALSE))","v":""}]
[null,null,{"$f":"IF(B1841=\"\",\"\",VLOOKUP(B1841,Magacin!A596:E5593,2,FALSE))","v":""}]
[null,null,{"$f":"IF(B1842=\"\",\"\",VLOOKUP(B1842,Magacin!A597:E5594,2,FALSE))","v":""}]
[null,null,{"$f":"IF(B1843=\"\",\"\",VLOOKUP(B1843,Magacin!A598:E5595,2,FALSE))","v":""}]
[null,null,{"$f":"IF(B1844=\"\",\"\",VLOOKUP(B1844,Magacin!A599:E5596,2,FALSE))","v":""}]
[null,null,{"$f":"IF(B1845=\"\",\"\",VLOOKUP(B1845,Magacin!A600:E5597,2,FALSE))","v":""}]
[null,null,{"$f":"IF(B1846=\"\",\"\",VLOOKUP(B1846,Magacin!A601:E5598,2,FALSE))","v":""}]
[null,null,{"$f":"IF(B1847=\"\",\"\",VLOOKUP(B1847,Magacin!A602:E5599,2,FALSE))","v":""}]
[null,null,{"$f":"IF(B1848=\"\",\"\",VLOOKUP(B1848,Magacin!A603:E5600,2,FALSE))","v":""}]
[null,null,{"$f":"IF(B1849=\"\",\"\",VLOOKUP(B1849,Magacin!A604:E5601,2,FALSE))","v":""}]
[null,null,{"$f":"IF(B1850=\"\",\"\",VLOOKUP(B1850,Magacin!A605:E5602,2,FALSE))","v":""}]
[null,null,{"$f":"IF(B1851=\"\",\"\",VLOOKUP(B1851,Magacin!A606:E5603,2,FALSE))","v":""}]
[null,null,{"$f":"IF(B1852=\"\",\"\",VLOOKUP(B1852,Magacin!A607:E5604,2,FALSE))","v":""}]
[null,null,{"$f":"IF(B1853=\"\",\"\",VLOOKUP(B1853,Magacin!A608:E5605,2,FALSE))","v":""}]
[null,null,{"$f":"IF(B1854=\"\",\"\",VLOOKUP(B1854,Magacin!A609:E5606,2,FALSE))","v":""}]
[null,null,{"$f":"IF(B1855=\"\",\"\",VLOOKUP(B1855,Magacin!A610:E5607,2,FALSE))","v":""}]
[null,null,{"$f":"IF(B1856=\"\",\"\",VLOOKUP(B1856,Magacin!A611:E5608,2,FALSE))","v":""}]
[null,null,{"$f":"IF(B1857=\"\",\"\",VLOOKUP(B1857,Magacin!A612:E5609,2,FALSE))","v":""}]
[null,null,{"$f":"IF(B1858=\"\",\"\",VLOOKUP(B1858,Magacin!A613:E5610,2,FALSE))","v":""}]
[null,null,{"$f":"IF(B1859=\"\",\"\",VLOOKUP(B1859,Magacin!A614:E5611,2,FALSE))","v":""}]
[null,null,{"$f":"IF(B1860=\"\",\"\",VLOOKUP(B1860,Magacin!A615:E5612,2,FALSE))","v":""}]
[null,null,{"$f":"IF(B1861=\"\",\"\",VLOOKUP(B1861,Magacin!A616:E5613,2,FALSE))","v":""}]
[null,null,{"$f":"IF(B1862=\"\",\"\",VLOOKUP(B1862,Magacin!A617:E5614,2,FALSE))","v":""}]
[null,null,{"$f":"IF(B1863=\"\",\"\",VLOOKUP(B1863,Magacin!A618:E5615,2,FALSE))","v":""}]
[null,null,{"$f":"IF(B1864=\"\",\"\",VLOOKUP(B1864,Magacin!A619:E5616,2,FALSE))","v":""}]
[null,null,{"$f":"IF(B1865=\"\",\"\",VLOOKUP(B1865,Magacin!A620:E5617,2,FALSE))","v":""}]
[null,null,{"$f":"IF(B1866=\"\",\"\",VLOOKUP(B1866,Magacin!A621:E5618,2,FALSE))","v":""}]
[null,null,{"$f":"IF(B1867=\"\",\"\",VLOOKUP(B1867,Magacin!A622:E5619,2,FALSE))","v":""}]
[null,null,{"$f":"IF(B1868=\"\",\"\",VLOOKUP(B1868,Magacin!A623:E5620,2,FALSE))","v":""}]
[null,null,{"$f":"IF(B1869=\"\",\"\",VLOOKUP(B1869,Magacin!A624:E5621,2,FALSE))","v":""}]
[null,null,{"$f":"IF(B1870=\"\",\"\",VLOOKUP(B1870,Magacin!A625:E5622,2,FALSE))","v":""}]
[null,null,{"$f":"IF(B1871=\"\",\"\",VLOOKUP(B1871,Magacin!A626:E5623,2,FALSE))","v":""}]
[null,null,{"$f":"IF(B1872=\"\",\"\",VLOOKUP(B1872,Magacin!A627:E5624,2,FALSE))","v":""}]
[null,null,{"$f":"IF(B1873=\"\",\"\",VLOOKUP(B1873,Magacin!A628:E5625,2,FALSE))","v":""}]
[null,null,{"$f":"IF(B1874=\"\",\"\",VLOOKUP(B1874,Magacin!A629:E5626,2,FALSE))","v":""}]
[null,null,{"$f":"IF(B1875=\"\",\"\",VLOOKUP(B1875,Magacin!A630:E5627,2,FALSE))","v":""}]
[null,null,{"$f":"IF(B1876=\"\",\"\",VLOOKUP(B1876,Magacin!A631:E5628,2,FALSE))","v":""}]
[null,null,{"$f":"IF(B1877=\"\",\"\",VLOOKUP(B1877,Magacin!A632:E5629,2,FALSE))","v":""}]
[null,null,{"$f":"IF(B1878=\"\",\"\",VLOOKUP(B1878,Magacin!A633:E5630,2,FALSE))","v":""}]
[null,null,{"$f":"IF(B1879=\"\",\"\",VLOOKUP(B1879,Magacin!A634:E5631,2,FALSE))","v":""}]
[null,null,{"$f":"IF(B1880=\"\",\"\",VLOOKUP(B1880,Magacin!A635:E5632,2,FALSE))","v":""}]
[null,null,{"$f":"IF(B1881=\"\",\"\",VLOOKUP(B1881,Magacin!A636:E5633,2,FALSE))","v":""}]
[null,null,{"$f":"IF(B1882=\"\",\"\",VLOOKUP(B1882,Magacin!A637:E5634,2,FALSE))","v":""}]
[null,null,{"$f":"IF(B1883=\"\",\"\",VLOOKUP(B1883,Magacin!A638:E5635,2,FALSE))","v":""}]
[null,null,{"$f":"IF(B1884=\"\",\"\",VLOOKUP(B1884,Magacin!A639:E5636,2,FALSE))","v":""}]
[null,null,{"$f":"IF(B1885=\"\",\"\",VLOOKUP(B1885,Magacin!A640:E5637,2,FALSE))","v":""}]
[null,null,{"$f":"IF(B1886=\"\",\"\",VLOOKUP(B1886,Magacin!A641:E5638,2,FALSE))","v":""}]
[null,null,{"$f":"IF(B1887=\"\",\"\",VLOOKUP(B1887,Magacin!A642:E5639,2,FALSE))","v":""}]
[null,null,{"$f":"IF(B1888=\"\",\"\",VLOOKUP(B1888,Magacin!A643:E5640,2,FALSE))","v":""}]
[null,null,{"$f":"IF(B1889=\"\",\"\",VLOOKUP(B1889,Magacin!A644:E5641,2,FALSE))","v":""}]
[null,null,{"$f":"IF(B1890=\"\",\"\",VLOOKUP(B1890,Magacin!A645:E5642,2,FALSE))","v":""}]
[null,null,{"$f":"IF(B1891=\"\",\"\",VLOOKUP(B1891,Magacin!A646:E5643,2,FALSE))","v":""}]
[null,null,{"$f":"IF(B1892=\"\",\"\",VLOOKUP(B1892,Magacin!A647:E5644,2,FALSE))","v":""}]
[null,null,{"$f":"IF(B1893=\"\",\"\",VLOOKUP(B1893,Magacin!A648:E5645,2,FALSE))","v":""}]
[null,null,{"$f":"IF(B1894=\"\",\"\",VLOOKUP(B1894,Magacin!A649:E5646,2,FALSE))","v":""}]
[null,null,{"$f":"IF(B1895=\"\",\"\",VLOOKUP(B1895,Magacin!A650:E5647,2,FALSE))","v":""}]
[null,null,{"$f":"IF(B1896=\"\",\"\",VLOOKUP(B1896,Magacin!A651:E5648,2,FALSE))","v":""}]
[null,null,{"$f":"IF(B1897=\"\",\"\",VLOOKUP(B1897,Magacin!A652:E5649,2,FALSE))","v":""}]
[null,null,{"$f":"IF(B1898=\"\",\"\",VLOOKUP(B1898,Magacin!A653:E5650,2,FALSE))","v":""}]
[null,null,{"$f":"IF(B1899=\"\",\"\",VLOOKUP(B1899,Magacin!A654:E5651,2,FALSE))","v":""}]
[null,null,{"$f":"IF(B1900=\"\",\"\",VLOOKUP(B1900,Magacin!A655:E5652,2,FALSE))","v":""}]
[null,null,{"$f":"IF(B1901=\"\",\"\",VLOOKUP(B1901,Magacin!A656:E5653,2,FALSE))","v":""}]
[null,null,{"$f":"IF(B1902=\"\",\"\",VLOOKUP(B1902,Magacin!A657:E5654,2,FALSE))","v":""}]
[null,null,{"$f":"IF(B1903=\"\",\"\",VLOOKUP(B1903,Magacin!A658:E5655,2,FALSE))","v":""}]
[null,null,{"$f":"IF(B1904=\"\",\"\",VLOOKUP(B1904,Magacin!A659:E5656,2,FALSE))","v":""}]
[null,null,{"$f":"IF(B1905=\"\",\"\",VLOOKUP(B1905,Magacin!A660:E5657,2,FALSE))","v":""}]
[null,null,{"$f":"IF(B1906=\"\",\"\",VLOOKUP(B1906,Magacin!A661:E5658,2,FALSE))","v":""}]
[null,null,{"$f":"IF(B1907=\"\",\"\",VLOOKUP(B1907,Magacin!A662:E5659,2,FALSE))","v":""}]
[null,null,{"$f":"IF(B1908=\"\",\"\",VLOOKUP(B1908,Magacin!A663:E5660,2,FALSE))","v":""}]
[null,null,{"$f":"IF(B1909=\"\",\"\",VLOOKUP(B1909,Magacin!A664:E5661,2,FALSE))","v":""}]
[null,null,{"$f":"IF(B1910=\"\",\"\",VLOOKUP(B1910,Magacin!A665:E5662,2,FALSE))","v":""}]
[null,null,{"$f":"IF(B1911=\"\",\"\",VLOOKUP(B1911,Magacin!A666:E5663,2,FALSE))","v":""}]
[null,null,{"$f":"IF(B1912=\"\",\"\",VLOOKUP(B1912,Magacin!A667:E5664,2,FALSE))","v":""}]
[null,null,{"$f":"IF(B1913=\"\",\"\",VLOOKUP(B1913,Magacin!A668:E5665,2,FALSE))","v":""}]
[null,null,{"$f":"IF(B1914=\"\",\"\",VLOOKUP(B1914,Magacin!A669:E5666,2,FALSE))","v":""}]
[null,null,{"$f":"IF(B1915=\"\",\"\",VLOOKUP(B1915,Magacin!A670:E5667,2,FALSE))","v":""}]
[null,null,{"$f":"IF(B1916=\"\",\"\",VLOOKUP(B1916,Magacin!A671:E5668,2,FALSE))","v":""}]
[null,null,{"$f":"IF(B1917=\"\",\"\",VLOOKUP(B1917,Magacin!A672:E5669,2,FALSE))","v":""}]
[null,null,{"$f":"IF(B1918=\"\",\"\",VLOOKUP(B1918,Magacin!A673:E5670,2,FALSE))","v":""}]
[null,null,{"$f":"IF(B1919=\"\",\"\",VLOOKUP(B1919,Magacin!A674:E5671,2,FALSE))","v":""}]
[null,null,{"$f":"IF(B1920=\"\",\"\",VLOOKUP(B1920,Magacin!A675:E5672,2,FALSE))","v":""}]
[null,null,{"$f":"IF(B1921=\"\",\"\",VLOOKUP(B1921,Magacin!A676:E5673,2,FALSE))","v":""}]
[null,null,{"$f":"IF(B1922=\"\",\"\",VLOOKUP(B1922,Magacin!A677:E5674,2,FALSE))","v":""}]
[null,null,{"$f":"IF(B1923=\"\",\"\",VLOOKUP(B1923,Magacin!A678:E5675,2,FALSE))","v":""}]
[null,null,{"$f":"IF(B1924=\"\",\"\",VLOOKUP(B1924,Magacin!A679:E5676,2,FALSE))","v":""}]
[null,null,{"$f":"IF(B1925=\"\",\"\",VLOOKUP(B1925,Magacin!A680:E5677,2,FALSE))","v":""}]
[null,null,{"$f":"IF(B1926=\"\",\"\",VLOOKUP(B1926,Magacin!A681:E5678,2,FALSE))","v":""}]
[null,null,{"$f":"IF(B1927=\"\",\"\",VLOOKUP(B1927,Magacin!A682:E5679,2,FALSE))","v":""}]
[null,null,{"$f":"IF(B1928=\"\",\"\",VLOOKUP(B1928,Magacin!A683:E5680,2,FALSE))","v":""}]
[null,null,{"$f":"IF(B1929=\"\",\"\",VLOOKUP(B1929,Magacin!A684:E5681,2,FALSE))","v":""}]
[null,null,{"$f":"IF(B1930=\"\",\"\",VLOOKUP(B1930,Magacin!A685:E5682,2,FALSE))","v":""}]
[null,null,{"$f":"IF(B1931=\"\",\"\",VLOOKUP(B1931,Magacin!A686:E5683,2,FALSE))","v":""}]
[null,null,{"$f":"IF(B1932=\"\",\"\",VLOOKUP(B1932,Magacin!A687:E5684,2,FALSE))","v":""}]
[null,null,{"$f":"IF(B1933=\"\",\"\",VLOOKUP(B1933,Magacin!A688:E5685,2,FALSE))","v":""}]
[null,null,{"$f":"IF(B1934=\"\",\"\",VLOOKUP(B1934,Magacin!A689:E5686,2,FALSE))","v":""}]
[null,null,{"$f":"IF(B1935=\"\",\"\",VLOOKUP(B1935,Magacin!A690:E5687,2,FALSE))","v":""}]
[null,null,{"$f":"IF(B1936=\"\",\"\",VLOOKUP(B1936,Magacin!A691:E5688,2,FALSE))","v":""}]
[null,null,{"$f":"IF(B1937=\"\",\"\",VLOOKUP(B1937,Magacin!A692:E5689,2,FALSE))","v":""}]
[null,null,{"$f":"IF(B1938=\"\",\"\",VLOOKUP(B1938,Magacin!A693:E5690,2,FALSE))","v":""}]
[null,null,{"$f":"IF(B1939=\"\",\"\",VLOOKUP(B1939,Magacin!A694:E5691,2,FALSE))","v":""}]
[null,null,{"$f":"IF(B1940=\"\",\"\",VLOOKUP(B1940,Magacin!A695:E5692,2,FALSE))","v":""}]
[null,null,{"$f":"IF(B1941=\"\",\"\",VLOOKUP(B1941,Magacin!A696:E5693,2,FALSE))","v":""}]
[null,null,{"$f":"IF(B1942=\"\",\"\",VLOOKUP(B1942,Magacin!A697:E5694,2,FALSE))","v":""}]
[null,null,{"$f":"IF(B1943=\"\",\"\",VLOOKUP(B1943,Magacin!A698:E5695,2,FALSE))","v":""}]
[null,null,{"$f":"IF(B1944=\"\",\"\",VLOOKUP(B1944,Magacin!A699:E5696,2,FALSE))","v":""}]
[null,null,{"$f":"IF(B1945=\"\",\"\",VLOOKUP(B1945,Magacin!A700:E5697,2,FALSE))","v":""}]
[null,null,{"$f":"IF(B1946=\"\",\"\",VLOOKUP(B1946,Magacin!A701:E5698,2,FALSE))","v":""}]
[null,null,{"$f":"IF(B1947=\"\",\"\",VLOOKUP(B1947,Magacin!A702:E5699,2,FALSE))","v":""}]
[null,null,{"$f":"IF(B1948=\"\",\"\",VLOOKUP(B1948,Magacin!A703:E5700,2,FALSE))","v":""}]
[null,null,{"$f":"IF(B1949=\"\",\"\",VLOOKUP(B1949,Magacin!A704:E5701,2,FALSE))","v":""}]
[null,null,{"$f":"IF(B1950=\"\",\"\",VLOOKUP(B1950,Magacin!A705:E5702,2,FALSE))","v":""}]
[null,null,{"$f":"IF(B1951=\"\",\"\",VLOOKUP(B1951,Magacin!A706:E5703,2,FALSE))","v":""}]
[null,null,{"$f":"IF(B1952=\"\",\"\",VLOOKUP(B1952,Magacin!A707:E5704,2,FALSE))","v":""}]
[null,null,{"$f":"IF(B1953=\"\",\"\",VLOOKUP(B1953,Magacin!A708:E5705,2,FALSE))","v":""}]
[null,null,{"$f":"IF(B1954=\"\",\"\",VLOOKUP(B1954,Magacin!A709:E5706,2,FALSE))","v":""}]
[null,null,{"$f":"IF(B1955=\"\",\"\",VLOOKUP(B1955,Magacin!A710:E5707,2,FALSE))","v":""}]
[null,null,{"$f":"IF(B1956=\"\",\"\",VLOOKUP(B1956,Magacin!A711:E5708,2,FALSE))","v":""}]
[null,null,{"$f":"IF(B1957=\"\",\"\",VLOOKUP(B1957,Magacin!A712:E5709,2,FALSE))","v":""}]
[null,null,{"$f":"IF(B1958=\"\",\"\",VLOOKUP(B1958,Magacin!A713:E5710,2,FALSE))","v":""}]
[null,null,{"$f":"IF(B1959=\"\",\"\",VLOOKUP(B1959,Magacin!A714:E5711,2,FALSE))","v":""}]
[null,null,{"$f":"IF(B1960=\"\",\"\",VLOOKUP(B1960,Magacin!A715:E5712,2,FALSE))","v":""}]
[null,null,{"$f":"IF(B1961=\"\",\"\",VLOOKUP(B1961,Magacin!A716:E5713,2,FALSE))","v":""}]
[null,null,{"$f":"IF(B1962=\"\",\"\",VLOOKUP(B1962,Magacin!A717:E5714,2,FALSE))","v":""}]
[null,null,{"$f":"IF(B1963=\"\",\"\",VLOOKUP(B1963,Magacin!A718:E5715,2,FALSE))","v":""}]
[null,null,{"$f":"IF(B1964=\"\",\"\",VLOOKUP(B1964,Magacin!A719:E5716,2,FALSE))","v":""}]
[null,null,{"$f":"IF(B1965=\"\",\"\",VLOOKUP(B1965,Magacin!A720:E5717,2,FALSE))","v":""}]
[null,null,{"$f":"IF(B1966=\"\",\"\",VLOOKUP(B1966,Magacin!A721:E5718,2,FALSE))","v":""}]
[null,null,{"$f":"IF(B1967=\"\",\"\",VLOOKUP(B1967,Magacin!A722:E5719,2,FALSE))","v":""}]
[null,null,{"$f":"IF(B1968=\"\",\"\",VLOOKUP(B1968,Magacin!A723:E5720,2,FALSE))","v":""}]
[null,null,{"$f":"IF(B1969=\"\",\"\",VLOOKUP(B1969,Magacin!A724:E5721,2,FALSE))","v":""}]
[null,null,{"$f":"IF(B1970=\"\",\"\",VLOOKUP(B1970,Magacin!A725:E5722,2,FALSE))","v":""}]
[null,null,{"$f":"IF(B1971=\"\",\"\",VLOOKUP(B1971,Magacin!A726:E5723,2,FALSE))","v":""}]
[null,null,{"$f":"IF(B1972=\"\",\"\",VLOOKUP(B1972,Magacin!A727:E5724,2,FALSE))","v":""}]
[null,null,{"$f":"IF(B1973=\"\",\"\",VLOOKUP(B1973,Magacin!A728:E5725,2,FALSE))","v":""}]
[null,null,{"$f":"IF(B1974=\"\",\"\",VLOOKUP(B1974,Magacin!A729:E5726,2,FALSE))","v":""}]
[null,null,{"$f":"IF(B1975=\"\",\"\",VLOOKUP(B1975,Magacin!A730:E5727,2,FALSE))","v":""}]
[null,null,{"$f":"IF(B1976=\"\",\"\",VLOOKUP(B1976,Magacin!A731:E5728,2,FALSE))","v":""}]
[null,null,{"$f":"IF(B1977=\"\",\"\",VLOOKUP(B1977,Magacin!A732:E5729,2,FALSE))","v":""}]
[null,null,{"$f":"IF(B1978=\"\",\"\",VLOOKUP(B1978,Magacin!A733:E5730,2,FALSE))","v":""}]
[null,null,{"$f":"IF(B1979=\"\",\"\",VLOOKUP(B1979,Magacin!A734:E5731,2,FALSE))","v":""}]
[null,null,{"$f":"IF(B1980=\"\",\"\",VLOOKUP(B1980,Magacin!A735:E5732,2,FALSE))","v":""}]
[null,null,{"$f":"IF(B1981=\"\",\"\",VLOOKUP(B1981,Magacin!A736:E5733,2,FALSE))","v":""}]
[null,null,{"$f":"IF(B1982=\"\",\"\",VLOOKUP(B1982,Magacin!A737:E5734,2,FALSE))","v":""}]
[null,null,{"$f":"IF(B1983=\"\",\"\",VLOOKUP(B1983,Magacin!A738:E5735,2,FALSE))","v":""}]
[null,null,{"$f":"IF(B1984=\"\",\"\",VLOOKUP(B1984,Magacin!A739:E5736,2,FALSE))","v":""}]
[null,null,{"$f":"IF(B1985=\"\",\"\",VLOOKUP(B1985,Magacin!A740:E5737,2,FALSE))","v":""}]
[null,null,{"$f":"IF(B1986=\"\",\"\",VLOOKUP(B1986,Magacin!A741:E5738,2,FALSE))","v":""}]
[null,null,{"$f":"IF(B1987=\"\",\"\",VLOOKUP(B1987,Magacin!A742:E5739,2,FALSE))","v":""}]
[null,null,{"$f":"IF(B1988=\"\",\"\",VLOOKUP(B1988,Magacin!A743:E5740,2,FALSE))","v":""}]
[null,null,{"$f":"IF(B1989=\"\",\"\",VLOOKUP(B1989,Magacin!A744:E5741,2,FALSE))","v":""}]
[null,null,{"$f":"IF(B1990=\"\",\"\",VLOOKUP(B1990,Magacin!A745:E5742,2,FALSE))","v":""}]
[null,null,{"$f":"IF(B1991=\"\",\"\",VLOOKUP(B1991,Magacin!A746:E5743,2,FALSE))","v":""}]
[null,null,{"$f":"IF(B1992=\"\",\"\",VLOOKUP(B1992,Magacin!A747:E5744,2,FALSE))","v":""}]
[null,null,{"$f":"IF(B1993=\"\",\"\",VLOOKUP(B1993,Magacin!A748:E5745,2,FALSE))","v":""}]
[null,null,{"$f":"IF(B1994=\"\",\"\",VLOOKUP(B1994,Magacin!A749:E5746,2,FALSE))","v":""}]
[null,null,{"$f":"IF(B1995=\"\",\"\",VLOOKUP(B1995,Magacin!A750:E5747,2,FALSE))","v":""}]
[null,null,{"$f":"IF(B1996=\"\",\"\",VLOOKUP(B1996,Magacin!A751:E5748,2,FALSE))","v":""}]
[null,null,{"$f":"IF(B1997=\"\",\"\",VLOOKUP(B1997,Magacin!A752:E5749,2,FALSE))","v":""}]
[null,null,{"$f":"IF(B1998=\"\",\"\",VLOOKUP(B1998,Magacin!A753:E5750,2,FALSE))","v":""}]
[null,null,{"$f":"IF(B1999=\"\",\"\",VLOOKUP(B1999,Magacin!A754:E5751,2,FALSE))","v":""}]
[null,null,{"$f":"IF(B2000=\"\",\"\",VLOOKUP(B2000,Magacin!A755:E5752,2,FALSE))","v":""}]
[null,null,{"$f":"IF(B2001=\"\",\"\",VLOOKUP(B2001,Magacin!A756:E5753,2,FALSE))","v":""}]
[null,null,{"$f":"IF(B2002=\"\",\"\",VLOOKUP(B2002,Magacin!A757:E5754,2,FALSE))","v":""}]
[null,null,{"$f":"IF(B2003=\"\",\"\",VLOOKUP(B2003,Magacin!A758:E5755,2,FALSE))","v":""}]
[null,null,{"$f":"IF(B2004=\"\",\"\",VLOOKUP(B2004,Magacin!A759:E5756,2,FALSE))","v":""}]
[null,null,{"$f":"IF(B2005=\"\",\"\",VLOOKUP(B2005,Magacin!A760:E5757,2,FALSE))","v":""}]
[null,null,{"$f":"IF(B2006=\"\",\"\",VLOOKUP(B2006,Magacin!A761:E5758,2,FALSE))","v":""}]
[null,null,{"$f":"IF(B2007=\"\",\"\",VLOOKUP(B2007,Magacin!A762:E5759,2,FALSE))","v":""}]
[null,null,{"$f":"IF(B2008=\"\",\"\",VLOOKUP(B2008,Magacin!A763:E5760,2,FALSE))","v":""}]
[null,null,{"$f":"IF(B2009=\"\",\"\",VLOOKUP(B2009,Magacin!A764:E5761,2,FALSE))","v":""}]
[null,null,{"$f":"IF(B2010=\"\",\"\",VLOOKUP(B2010,Magacin!A765:E5762,2,FALSE))","v":""}]
[null,null,{"$f":"IF(B2011=\"\",\"\",VLOOKUP(B2011,Magacin!A766:E5763,2,FALSE))","v":""}]
[null,null,{"$f":"IF(B2012=\"\",\"\",VLOOKUP(B2012,Magacin!A767:E5764,2,FALSE))","v":""}]
[null,null,{"$f":"IF(B2013=\"\",\"\",VLOOKUP(B2013,Magacin!A768:E5765,2,FALSE))","v":""}]
[null,null,{"$f":"IF(B2014=\"\",\"\",VLOOKUP(B2014,Magacin!A769:E5766,2,FALSE))","v":""}]
[null,null,{"$f":"IF(B2015=\"\",\"\",VLOOKUP(B2015,Magacin!A770:E5767,2,FALSE))","v":""}]
[null,null,{"$f":"IF(B2016=\"\",\"\",VLOOKUP(B2016,Magacin!A771:E5768,2,FALSE))","v":""}]
[null,null,{"$f":"IF(B2017=\"\",\"\",VLOOKUP(B2017,Magacin!A772:E5769,2,FALSE))","v":""}]
[null,null,{"$f":"IF(B2018=\"\",\"\",VLOOKUP(B2018,Magacin!A773:E5770,2,FALSE))","v":""}]
[null,null,{"$f":"IF(B2019=\"\",\"\",VLOOKUP(B2019,Magacin!A774:E5771,2,FALSE))","v":""}]
[null,null,{"$f":"IF(B2020=\"\",\"\",VLOOKUP(B2020,Magacin!A775:E5772,2,FALSE))","v":""}]
[null,null,{"$f":"IF(B2021=\"\",\"\",VLOOKUP(B2021,Magacin!A776:E5773,2,FALSE))","v":""}]
[null,null,{"$f":"IF(B2022=\"\",\"\",VLOOKUP(B2022,Magacin!A777:E5774,2,FALSE))","v":""}]
[null,null,{"$f":"IF(B2023=\"\",\"\",VLOOKUP(B2023,Magacin!A778:E5775,2,FALSE))","v":""}]
[null,null,{"$f":"IF(B2024=\"\",\"\",VLOOKUP(B2024,Magacin!A779:E5776,2,FALSE))","v":""}]
[null,null,{"$f":"IF(B2025=\"\",\"\",VLOOKUP(B2025,Magacin!A780:E5777,2,FALSE))","v":""}]
[null,null,{"$f":"IF(B2026=\"\",\"\",VLOOKUP(B2026,Magacin!A781:E5778,2,FALSE))","v":""}]
[null,null,{"$f":"IF(B2027=\"\",\"\",VLOOKUP(B2027,Magacin!A782:E5779,2,FALSE))","v":""}]
[null,null,{"$f":"IF(B2028=\"\",\"\",VLOOKUP(B2028,Magacin!A783:E5780,2,FALSE))","v":""}]
[null,null,{"$f":"IF(B2029=\"\",\"\",VLOOKUP(B2029,Magacin!A784:E5781,2,FALSE))","v":""}]
[null,null,{"$f":"IF(B2030=\"\",\"\",VLOOKUP(B2030,Magacin!A785:E5782,2,FALSE))","v":""}]
[null,null,{"$f":"IF(B2031=\"\",\"\",VLOOKUP(B2031,Magacin!A786:E5783,2,FALSE))","v":""}]
[null,null,{"$f":"IF(B2032=\"\",\"\",VLOOKUP(B2032,Magacin!A787:E5784,2,FALSE))","v":""}]
[null,null,{"$f":"IF(B2033=\"\",\"\",VLOOKUP(B2033,Magacin!A788:E5785,2,FALSE))","v":""}]
[null,null,{"$f":"IF(B2034=\"\",\"\",VLOOKUP(B2034,Magacin!A789:E5786,2,FALSE))","v":""}]
[null,null,{"$f":"IF(B2035=\"\",\"\",VLOOKUP(B2035,Magacin!A790:E5787,2,FALSE))","v":""}]
[null,null,{"$f":"IF(B2036=\"\",\"\",VLOOKUP(B2036,Magacin!A791:E5788,2,FALSE))","v":""}]
[null,null,{"$f":"IF(B2037=\"\",\"\",VLOOKUP(B2037,Magacin!A792:E5789,2,FALSE))","v":""}]
[null,null,{"$f":"IF(B2038=\"\",\"\",VLOOKUP(B2038,Magacin!A793:E5790,2,FALSE))","v":""}]
[null,null,{"$f":"IF(B2039=\"\",\"\",VLOOKUP(B2039,Magacin!A794:E5791,2,FALSE))","v":""}]
[null,null,{"$f":"IF(B2040=\"\",\"\",VLOOKUP(B2040,Magacin!A795:E5792,2,FALSE))","v":""}]
[null,null,{"$f":"IF(B2041=\"\",\"\",VLOOKUP(B2041,Magacin!A796:E5793,2,FALSE))","v":""}]
[null,null,{"$f":"IF(B2042=\"\",\"\",VLOOKUP(B2042,Magacin!A797:E5794,2,FALSE))","v":""}]
[null,null,{"$f":"IF(B2043=\"\",\"\",VLOOKUP(B2043,Magacin!A798:E5795,2,FALSE))","v":""}]
[null,null,{"$f":"IF(B2044=\"\",\"\",VLOOKUP(B2044,Magacin!A799:E5796,2,FALSE))","v":""}]
[null,null,{"$f":"IF(B2045=\"\",\"\",VLOOKUP(B2045,Magacin!A800:E5797,2,FALSE))","v":""}]
[null,null,{"$f":"IF(B2046=\"\",\"\",VLOOKUP(B2046,Magacin!A801:E5798,2,FALSE))","v":""}]
[null,null,{"$f":"IF(B2047=\"\",\"\",VLOOKUP(B2047,Magacin!A802:E5799,2,FALSE))","v":""}]
[null,null,{"$f":"IF(B2048=\"\",\"\",VLOOKUP(B2048,Magacin!A803:E5800,2,FALSE))","v":""}]
[null,null,{"$f":"IF(B2049=\"\",\"\",VLOOKUP(B2049,Magacin!A804:E5801,2,FALSE))","v":""}]
[null,null,{"$f":"IF(B2050=\"\",\"\",VLOOKUP(B2050,Magacin!A805:E5802,2,FALSE))","v":""}]
[null,null,{"$f":"IF(B2051=\"\",\"\",VLOOKUP(B2051,Magacin!A806:E5803,2,FALSE))","v":""}]
[null,null,{"$f":"IF(B2052=\"\",\"\",VLOOKUP(B2052,Magacin!A807:E5804,2,FALSE))","v":""}]
[null,null,{"$f":"IF(B2053=\"\",\"\",VLOOKUP(B2053,Magacin!A808:E5805,2,FALSE))","v":""}]
[null,null,{"$f":"IF(B2054=\"\",\"\",VLOOKUP(B2054,Magacin!A809:E5806,2,FALSE))","v":""}]
[null,null,{"$f":"IF(B2055=\"\",\"\",VLOOKUP(B2055,Magacin!A810:E5807,2,FALSE))","v":""}]
[null,null,{"$f":"IF(B2056=\"\",\"\",VLOOKUP(B2056,Magacin!A811:E5808,2,FALSE))","v":""}]
[null,null,{"$f":"IF(B2057=\"\",\"\",VLOOKUP(B2057,Magacin!A812:E5809,2,FALSE))","v":""}]
[null,null,{"$f":"IF(B2058=\"\",\"\",VLOOKUP(B2058,Magacin!A813:E5810,2,FALSE))","v":""}]
[null,null,{"$f":"IF(B2059=\"\",\"\",VLOOKUP(B2059,Magacin!A814:E5811,2,FALSE))","v":""}]
[null,null,{"$f":"IF(B2060=\"\",\"\",VLOOKUP(B2060,Magacin!A815:E5812,2,FALSE))","v":""}]
[null,null,{"$f":"IF(B2061=\"\",\"\",VLOOKUP(B2061,Magacin!A816:E5813,2,FALSE))","v":""}]
[null,null,{"$f":"IF(B2062=\"\",\"\",VLOOKUP(B2062,Magacin!A817:E5814,2,FALSE))","v":""}]
[null,null,{"$f":"IF(B2063=\"\",\"\",VLOOKUP(B2063,Magacin!A818:E5815,2,FALSE))","v":""}]
[null,null,{"$f":"IF(B2064=\"\",\"\",VLOOKUP(B2064,Magacin!A819:E5816,2,FALSE))","v":""}]
[null,null,{"$f":"IF(B2065=\"\",\"\",VLOOKUP(B2065,Magacin!A820:E5817,2,FALSE))","v":""}]
[null,null,{"$f":"IF(B2066=\"\",\"\",VLOOKUP(B2066,Magacin!A821:E5818,2,FALSE))","v":""}]
[null,null,{"$f":"IF(B2067=\"\",\"\",VLOOKUP(B2067,Magacin!A822:E5819,2,FALSE))","v":""}]
[null,null,{"$f":"IF(B2068=\"\",\"\",VLOOKUP(B2068,Magacin!A823:E5820,2,FALSE))","v":""}]
[null,null,{"$f":"IF(B2069=\"\",\"\",VLOOKUP(B2069,Magacin!A824:E5821,2,FALSE))","v":""}]
[null,null,{"$f":"IF(B2070=\"\",\"\",VLOOKUP(B2070,Magacin!A825:E5822,2,FALSE))","v":""}]
[null,null,{"$f":"IF(B2071=\"\",\"\",VLOOKUP(B2071,Magacin!A826:E5823,2,FALSE))","v":""}]
[null,null,{"$f":"IF(B2072=\"\",\"\",VLOOKUP(B2072,Magacin!A827:E5824,2,FALSE))","v":""}]
[null,null,{"$f":"IF(B2073=\"\",\"\",VLOOKUP(B2073,Magacin!A828:E5825,2,FALSE))","v":""}]
[null,null,{"$f":"IF(B2074=\"\",\"\",VLOOKUP(B2074,Magacin!A829:E5826,2,FALSE))","v":""}]
[null,null,{"$f":"IF(B2075=\"\",\"\",VLOOKUP(B2075,Magacin!A830:E5827,2,FALSE))","v":""}]
[null,null,{"$f":"IF(B2076=\"\",\"\",VLOOKUP(B2076,Magacin!A831:E5828,2,FALSE))","v":""}]
[null,null,{"$f":"IF(B2077=\"\",\"\",VLOOKUP(B2077,Magacin!A832:E5829,2,FALSE))","v":""}]
[null,null,{"$f":"IF(B2078=\"\",\"\",VLOOKUP(B2078,Magacin!A833:E5830,2,FALSE))","v":""}]
[null,null,{"$f":"IF(B2079=\"\",\"\",VLOOKUP(B2079,Magacin!A834:E5831,2,FALSE))","v":""}]
[null,null,{"$f":"IF(B2080=\"\",\"\",VLOOKUP(B2080,Magacin!A835:E5832,2,FALSE))","v":""}]
[null,null,{"$f":"IF(B2081=\"\",\"\",VLOOKUP(B2081,Magacin!A836:E5833,2,FALSE))","v":""}]
[null,null,{"$f":"IF(B2082=\"\",\"\",VLOOKUP(B2082,Magacin!A837:E5834,2,FALSE))","v":""}]
[null,null,{"$f":"IF(B2083=\"\",\"\",VLOOKUP(B2083,Magacin!A838:E5835,2,FALSE))","v":""}]
[null,null,{"$f":"IF(B2084=\"\",\"\",VLOOKUP(B2084,Magacin!A839:E5836,2,FALSE))","v":""}]
[null,null,{"$f":"IF(B2085=\"\",\"\",VLOOKUP(B2085,Magacin!A840:E5837,2,FALSE))","v":""}]
[null,null,{"$f":"IF(B2086=\"\",\"\",VLOOKUP(B2086,Magacin!A841:E5838,2,FALSE))","v":""}]
[null,null,{"$f":"IF(B2087=\"\",\"\",VLOOKUP(B2087,Magacin!A842:E5839,2,FALSE))","v":""}]
[null,null,{"$f":"IF(B2088=\"\",\"\",VLOOKUP(B2088,Magacin!A843:E5840,2,FALSE))","v":""}]
[null,null,{"$f":"IF(B2089=\"\",\"\",VLOOKUP(B2089,Magacin!A844:E5841,2,FALSE))","v":""}]
[null,null,{"$f":"IF(B2090=\"\",\"\",VLOOKUP(B2090,Magacin!A845:E5842,2,FALSE))","v":""}]
[null,null,{"$f":"IF(B2091=\"\",\"\",VLOOKUP(B2091,Magacin!A846:E5843,2,FALSE))","v":""}]
[null,null,{"$f":"IF(B2092=\"\",\"\",VLOOKUP(B2092,Magacin!A847:E5844,2,FALSE))","v":""}]
[null,null,{"$f":"IF(B2093=\"\",\"\",VLOOKUP(B2093,Magacin!A848:E5845,2,FALSE))","v":""}]
[null,null,{"$f":"IF(B2094=\"\",\"\",VLOOKUP(B2094,Magacin!A849:E5846,2,FALSE))","v":""}]
[null,null,{"$f":"IF(B2095=\"\",\"\",VLOOKUP(B2095,Magacin!A850:E5847,2,FALSE))","v":""}]
[null,null,{"$f":"IF(B2096=\"\",\"\",VLOOKUP(B2096,Magacin!A851:E5848,2,FALSE))","v":""}]
[null,null,{"$f":"IF(B2097=\"\",\"\",VLOOKUP(B2097,Magacin!A852:E5849,2,FALSE))","v":""}]
[null,null,{"$f":"IF(B2098=\"\",\"\",VLOOKUP(B2098,Magacin!A853:E5850,2,FALSE))","v":""}]
[null,null,{"$f":"IF(B2099=\"\",\"\",VLOOKUP(B2099,Magacin!A854:E5851,2,FALSE))","v":""}]
[null,null,{"$f":"IF(B2100=\"\",\"\",VLOOKUP(B2100,Magacin!A855:E5852,2,FALSE))","v":""}]
[null,null,{"$f":"IF(B2101=\"\",\"\",VLOOKUP(B2101,Magacin!A856:E5853,2,FALSE))","v":""}]
[null,null,{"$f":"IF(B2102=\"\",\"\",VLOOKUP(B2102,Magacin!A857:E5854,2,FALSE))","v":""}]
[null,null,{"$f":"IF(B2103=\"\",\"\",VLOOKUP(B2103,Magacin!A858:E5855,2,FALSE))","v":""}]
[null,null,{"$f":"IF(B2104=\"\",\"\",VLOOKUP(B2104,Magacin!A859:E5856,2,FALSE))","v":""}]
[null,null,{"$f":"IF(B2105=\"\",\"\",VLOOKUP(B2105,Magacin!A860:E5857,2,FALSE))","v":""}]
[null,null,{"$f":"IF(B2106=\"\",\"\",VLOOKUP(B2106,Magacin!A861:E5858,2,FALSE))","v":""}]
[null,null,{"$f":"IF(B2107=\"\",\"\",VLOOKUP(B2107,Magacin!A862:E5859,2,FALSE))","v":""}]
[null,null,{"$f":"IF(B2108=\"\",\"\",VLOOKUP(B2108,Magacin!A863:E5860,2,FALSE))","v":""}]
[null,null,{"$f":"IF(B2109=\"\",\"\",VLOOKUP(B2109,Magacin!A864:E5861,2,FALSE))","v":""}]
[null,null,{"$f":"IF(B2110=\"\",\"\",VLOOKUP(B2110,Magacin!A865:E5862,2,FALSE))","v":""}]
[null,null,{"$f":"IF(B2111=\"\",\"\",VLOOKUP(B2111,Magacin!A866:E5863,2,FALSE))","v":""}]
[null,null,{"$f":"IF(B2112=\"\",\"\",VLOOKUP(B2112,Magacin!A867:E5864,2,FALSE))","v":""}]
[null,null,{"$f":"IF(B2113=\"\",\"\",VLOOKUP(B2113,Magacin!A868:E5865,2,FALSE))","v":""}]
[null,null,{"$f":"IF(B2114=\"\",\"\",VLOOKUP(B2114,Magacin!A869:E5866,2,FALSE))","v":""}]
[null,null,{"$f":"IF(B2115=\"\",\"\",VLOOKUP(B2115,Magacin!A870:E5867,2,FALSE))","v":""}]
[null,null,{"$f":"IF(B2116=\"\",\"\",VLOOKUP(B2116,Magacin!A871:E5868,2,FALSE))","v":""}]
[null,null,{"$f":"IF(B2117=\"\",\"\",VLOOKUP(B2117,Magacin!A872:E5869,2,FALSE))","v":""}]
[null,null,{"$f":"IF(B2118=\"\",\"\",VLOOKUP(B2118,Magacin!A873:E5870,2,FALSE))","v":""}]
[null,null,{"$f":"IF(B2119=\"\",\"\",VLOOKUP(B2119,Magacin!A874:E5871,2,FALSE))","v":""}]
[null,null,{"$f":"IF(B2120=\"\",\"\",VLOOKUP(B2120,Magacin!A875:E5872,2,FALSE))","v":""}]
[null,null,{"$f":"IF(B2121=\"\",\"\",VLOOKUP(B2121,Magacin!A876:E5873,2,FALSE))","v":""}]
[null,null,{"$f":"IF(B2122=\"\",\"\",VLOOKUP(B2122,Magacin!A877:E5874,2,FALSE))","v":""}]
[null,null,{"$f":"IF(B2123=\"\",\"\",VLOOKUP(B2123,Magacin!A878:E5875,2,FALSE))","v":""}]
[null,null,{"$f":"IF(B2124=\"\",\"\",VLOOKUP(B2124,Magacin!A879:E5876,2,FALSE))","v":""}]
[null,null,{"$f":"IF(B2125=\"\",\"\",VLOOKUP(B2125,Magacin!A880:E5877,2,FALSE))","v":""}]
[null,null,{"$f":"IF(B2126=\"\",\"\",VLOOKUP(B2126,Magacin!A881:E5878,2,FALSE))","v":""}]
[null,null,{"$f":"IF(B2127=\"\",\"\",VLOOKUP(B2127,Magacin!A882:E5879,2,FALSE))","v":""}]
[null,null,{"$f":"IF(B2128=\"\",\"\",VLOOKUP(B2128,Magacin!A883:E5880,2,FALSE))","v":""}]
[null,null,{"$f":"IF(B2129=\"\",\"\",VLOOKUP(B2129,Magacin!A884:E5881,2,FALSE))","v":""}]
[null,null,{"$f":"IF(B2130=\"\",\"\",VLOOKUP(B2130,Magacin!A885:E5882,2,FALSE))","v":""}]
[null,null,{"$f":"IF(B2131=\"\",\"\",VLOOKUP(B2131,Magacin!A886:E5883,2,FALSE))","v":""}]
[null,null,{"$f":"IF(B2132=\"\",\"\",VLOOKUP(B2132,Magacin!A887:E5884,2,FALSE))","v":""}]
[null,null,{"$f":"IF(B2133=\"\",\"\",VLOOKUP(B2133,Magacin!A888:E5885,2,FALSE))","v":""}]
[null,null,{"$f":"IF(B2134=\"\",\"\",VLOOKUP(B2134,Magacin!A889:E5886,2,FALSE))","v":""}]
[null,null,{"$f":"IF(B2135=\"\",\"\",VLOOKUP(B2135,Magacin!A890:E5887,2,FALSE))","v":""}]
[null,null,{"$f":"IF(B2136=\"\",\"\",VLOOKUP(B2136,Magacin!A891:E5888,2,FALSE))","v":""}]
[null,null,{"$f":"IF(B2137=\"\",\"\",VLOOKUP(B2137,Magacin!A892:E5889,2,FALSE))","v":""}]
[null,null,{"$f":"IF(B2138=\"\",\"\",VLOOKUP(B2138,Magacin!A893:E5890,2,FALSE))","v":""}]
[null,null,{"$f":"IF(B2139=\"\",\"\",VLOOKUP(B2139,Magacin!A894:E5891,2,FALSE))","v":""}]
[null,null,{"$f":"IF(B2140=\"\",\"\",VLOOKUP(B2140,Magacin!A895:E5892,2,FALSE))","v":""}]
[null,null,{"$f":"IF(B2141=\"\",\"\",VLOOKUP(B2141,Magacin!A896:E5893,2,FALSE))","v":""}]
[null,null,{"$f":"IF(B2142=\"\",\"\",VLOOKUP(B2142,Magacin!A897:E5894,2,FALSE))","v":""}]
[null,null,{"$f":"IF(B2143=\"\",\"\",VLOOKUP(B2143,Magacin!A898:E5895,2,FALSE))","v":""}]
[null,null,{"$f":"IF(B2144=\"\",\"\",VLOOKUP(B2144,Magacin!A899:E5896,2,FALSE))","v":""}]
[null,null,{"$f":"IF(B2145=\"\",\"\",VLOOKUP(B2145,Magacin!A900:E5897,2,FALSE))","v":""}]
[null,null,{"$f":"IF(B2146=\"\",\"\",VLOOKUP(B2146,Magacin!A901:E5898,2,FALSE))","v":""}]
[null,null,{"$f":"IF(B2147=\"\",\"\",VLOOKUP(B2147,Magacin!A902:E5899,2,FALSE))","v":""}]
[null,null,{"$f":"IF(B2148=\"\",\"\",VLOOKUP(B2148,Magacin!A903:E5900,2,FALSE))","v":""}]
[null,null,{"$f":"IF(B2149=\"\",\"\",VLOOKUP(B2149,Magacin!A904:E5901,2,FALSE))","v":""}]
[null,null,{"$f":"IF(B2150=\"\",\"\",VLOOKUP(B2150,Magacin!A905:E5902,2,FALSE))","v":""}]
[null,null,{"$f":"IF(B2151=\"\",\"\",VLOOKUP(B2151,Magacin!A906:E5903,2,FALSE))","v":""}]
[null,null,{"$f":"IF(B2152=\"\",\"\",VLOOKUP(B2152,Magacin!A907:E5904,2,FALSE))","v":""}]
[null,null,{"$f":"IF(B2153=\"\",\"\",VLOOKUP(B2153,Magacin!A908:E5905,2,FALSE))","v":""}]
[null,null,{"$f":"IF(B2154=\"\",\"\",VLOOKUP(B2154,Magacin!A909:E5906,2,FALSE))","v":""}]
[null,null,{"$f":"IF(B2155=\"\",\"\",VLOOKUP(B2155,Magacin!A910:E5907,2,FALSE))","v":""}]
[null,null,{"$f":"IF(B2156=\"\",\"\",VLOOKUP(B2156,Magacin!A911:E5908,2,FALSE))","v":""}]
[null,null,{"$f":"IF(B2157=\"\",\"\",VLOOKUP(B2157,Magacin!A912:E5909,2,FALSE))","v":""}]
[null,null,{"$f":"IF(B2158=\"\",\"\",VLOOKUP(B2158,Magacin!A913:E5910,2,FALSE))","v":""}]
[null,null,{"$f":"IF(B2159=\"\",\"\",VLOOKUP(B2159,Magacin!A914:E5911,2,FALSE))","v":""}]
[null,null,{"$f":"IF(B2160=\"\",\"\",VLOOKUP(B2160,Magacin!A915:E5912,2,FALSE))","v":""}]
[null,null,{"$f":"IF(B2161=\"\",\"\",VLOOKUP(B2161,Magacin!A916:E5913,2,FALSE))","v":""}]
[null,null,{"$f":"IF(B2162=\"\",\"\",VLOOKUP(B2162,Magacin!A917:E5914,2,FALSE))","v":""}]
[null,null,{"$f":"IF(B2163=\"\",\"\",VLOOKUP(B2163,Magacin!A918:E5915,2,FALSE))","v":""}]
[null,null,{"$f":"IF(B2164=\"\",\"\",VLOOKUP(B2164,Magacin!A919:E5916,2,FALSE))","v":""}]
[null,null,{"$f":"IF(B2165=\"\",\"\",VLOOKUP(B2165,Magacin!A920:E5917,2,FALSE))","v":""}]
[null,null,{"$f":"IF(B2166=\"\",\"\",VLOOKUP(B2166,Magacin!A921:E5918,2,FALSE))","v":""}]
[null,null,{"$f":"IF(B2167=\"\",\"\",VLOOKUP(B2167,Magacin!A922:E5919,2,FALSE))","v":""}]
[null,null,{"$f":"IF(B2168=\"\",\"\",VLOOKUP(B2168,Magacin!A923:E5920,2,FALSE))","v":""}]
[null,null,{"$f":"IF(B2169=\"\",\"\",VLOOKUP(B2169,Magacin!A924:E5921,2,FALSE))","v":""}]
[null,null,{"$f":"IF(B2170=\"\",\"\",VLOOKUP(B2170,Magacin!A925:E5922,2,FALSE))","v":""}]
[null,null,{"$f":"IF(B2171=\"\",\"\",VLOOKUP(B2171,Magacin!A926:E5923,2,FALSE))","v":""}]
[null,null,{"$f":"IF(B2172=\"\",\"\",VLOOKUP(B2172,Magacin!A927:E5924,2,FALSE))","v":""}]
[null,null,{"$f":"IF(B2173=\"\",\"\",VLOOKUP(B2173,Magacin!A928:E5925,2,FALSE))","v":""}]
[null,null,{"$f":"IF(B2174=\"\",\"\",VLOOKUP(B2174,Magacin!A929:E5926,2,FALSE))","v":""}]
[null,null,{"$f":"IF(B2175=\"\",\"\",VLOOKUP(B2175,Magacin!A930:E5927,2,FALSE))","v":""}]
[null,null,{"$f":"IF(B2176=\"\",\"\",VLOOKUP(B2176,Magacin!A931:E5928,2,FALSE))","v":""}]
[null,null,{"$f":"IF(B2177=\"\",\"\",VLOOKUP(B2177,Magacin!A932:E5929,2,FALSE))","v":""}]
[null,null,{"$f":"IF(B2178=\"\",\"\",VLOOKUP(B2178,Magacin!A933:E5930,2,FALSE))","v":""}]
[null,null,{"$f":"IF(B2179=\"\",\"\",VLOOKUP(B2179,Magacin!A934:E5931,2,FALSE))","v":""}]
[null,null,{"$f":"IF(B2180=\"\",\"\",VLOOKUP(B2180,Magacin!A935:E5932,2,FALSE))","v":""}]
[null,null,{"$f":"IF(B2181=\"\",\"\",VLOOKUP(B2181,Magacin!A936:E5933,2,FALSE))","v":""}]
[null,null,{"$f":"IF(B2182=\"\",\"\",VLOOKUP(B2182,Magacin!A937:E5934,2,FALSE))","v":""}]
[null,null,{"$f":"IF(B2183=\"\",\"\",VLOOKUP(B2183,Magacin!A938:E5935,2,FALSE))","v":""}]
[null,null,{"$f":"IF(B2184=\"\",\"\",VLOOKUP(B2184,Magacin!A939:E5936,2,FALSE))","v":""}]
[null,null,{"$f":"IF(B2185=\"\",\"\",VLOOKUP(B2185,Magacin!A940:E5937,2,FALSE))","v":""}]
[null,null,{"$f":"IF(B2186=\"\",\"\",VLOOKUP(B2186,Magacin!A941:E5938,2,FALSE))","v":""}]
[null,null,{"$f":"IF(B2187=\"\",\"\",VLOOKUP(B2187,Magacin!A942:E5939,2,FALSE))","v":""}]
[null,null,{"$f":"IF(B2188=\"\",\"\",VLOOKUP(B2188,Magacin!A943:E5940,2,FALSE))","v":""}]
[null,null,{"$f":"IF(B2189=\"\",\"\",VLOOKUP(B2189,Magacin!A944:E5941,2,FALSE))","v":""}]
[null,null,{"$f":"IF(B2190=\"\",\"\",VLOOKUP(B2190,Magacin!A945:E5942,2,FALSE))","v":""}]
[null,null,{"$f":"IF(B2191=\"\",\"\",VLOOKUP(B2191,Magacin!A946:E5943,2,FALSE))","v":""}]
[null,null,{"$f":"IF(B2192=\"\",\"\",VLOOKUP(B2192,Magacin!A947:E5944,2,FALSE))","v":""}]
[null,null,{"$f":"IF(B2193=\"\",\"\",VLOOKUP(B2193,Magacin!A948:E5945,2,FALSE))","v":""}]
[null,null,{"$f":"IF(B2194=\"\",\"\",VLOOKUP(B2194,Magacin!A949:E5946,2,FALSE))","v":""}]
[null,null,{"$f":"IF(B2195=\"\",\"\",VLOOKUP(B2195,Magacin!A950:E5947,2,FALSE))","v":""}]
[null,null,{"$f":"IF(B2196=\"\",\"\",VLOOKUP(B2196,Magacin!A951:E5948,2,FALSE))","v":""}]
[null,null,{"$f":"IF(B2197=\"\",\"\",VLOOKUP(B2197,Magacin!A952:E5949,2,FALSE))","v":""}]
[null,null,{"$f":"IF(B2198=\"\",\"\",VLOOKUP(B2198,Magacin!A953:E5950,2,FALSE))","v":""}]
[null,null,{"$f":"IF(B2199=\"\",\"\",VLOOKUP(B2199,Magacin!A954:E5951,2,FALSE))","v":""}]
[null,null,{"$f":"IF(B2200=\"\",\"\",VLOOKUP(B2200,Magacin!A955:E5952,2,FALSE))","v":""}]
[null,null,{"$f":"IF(B2201=\"\",\"\",VLOOKUP(B2201,Magacin!A956:E5953,2,FALSE))","v":""}]
[null,null,{"$f":"IF(B2202=\"\",\"\",VLOOKUP(B2202,Magacin!A957:E5954,2,FALSE))","v":""}]
[null,null,{"$f":"IF(B2203=\"\",\"\",VLOOKUP(B2203,Magacin!A958:E5955,2,FALSE))","v":""}]
[null,null,{"$f":"IF(B2204=\"\",\"\",VLOOKUP(B2204,Magacin!A959:E5956,2,FALSE))","v":""}]
[null,null,{"$f":"IF(B2205=\"\",\"\",VLOOKUP(B2205,Magacin!A960:E5957,2,FALSE))","v":""}]
[null,null,{"$f":"IF(B2206=\"\",\"\",VLOOKUP(B2206,Magacin!A961:E5958,2,FALSE))","v":""}]
[null,null,{"$f":"IF(B2207=\"\",\"\",VLOOKUP(B2207,Magacin!A962:E5959,2,FALSE))","v":""}]
[null,null,{"$f":"IF(B2208=\"\",\"\",VLOOKUP(B2208,Magacin!A963:E5960,2,FALSE))","v":""}]
[null,null,{"$f":"IF(B2209=\"\",\"\",VLOOKUP(B2209,Magacin!A964:E5961,2,FALSE))","v":""}]
[null,null,{"$f":"IF(B2210=\"\",\"\",VLOOKUP(B2210,Magacin!A965:E5962,2,FALSE))","v":""}]
[null,null,{"$f":"IF(B2211=\"\",\"\",VLOOKUP(B2211,Magacin!A966:E5963,2,FALSE))","v":""}]
[null,null,{"$f":"IF(B2212=\"\",\"\",VLOOKUP(B2212,Magacin!A967:E5964,2,FALSE))","v":""}]
[null,null,{"$f":"IF(B2213=\"\",\"\",VLOOKUP(B2213,Magacin!A968:E5965,2,FALSE))","v":""}]
[null,null,{"$f":"IF(B2214=\"\",\"\",VLOOKUP(B2214,Magacin!A969:E5966,2,FALSE))","v":""}]
[null,null,{"$f":"IF(B2215=\"\",\"\",VLOOKUP(B2215,Magacin!A970:E5967,2,FALSE))","v":""}]
[null,null,{"$f":"IF(B2216=\"\",\"\",VLOOKUP(B2216,Magacin!A971:E5968,2,FALSE))","v":""}]
[null,null,{"$f":"IF(B2217=\"\",\"\",VLOOKUP(B2217,Magacin!A972:E5969,2,FALSE))","v":""}]
[null,null,{"$f":"IF(B2218=\"\",\"\",VLOOKUP(B2218,Magacin!A973:E5970,2,FALSE))","v":""}]
[null,null,{"$f":"IF(B2219=\"\",\"\",VLOOKUP(B2219,Magacin!A974:E5971,2,FALSE))","v":""}]
[null,null,{"$f":"IF(B2220=\"\",\"\",VLOOKUP(B2220,Magacin!A975:E5972,2,FALSE))","v":""}]
[null,null,{"$f":"IF(B2221=\"\",\"\",VLOOKUP(B2221,Magacin!A976:E5973,2,FALSE))","v":""}]
[null,null,{"$f":"IF(B2222=\"\",\"\",VLOOKUP(B2222,Magacin!A977:E5974,2,FALSE))","v":""}]
[null,null,{"$f":"IF(B2223=\"\",\"\",VLOOKUP(B2223,Magacin!A978:E5975,2,FALSE))","v":""}]
[null,null,{"$f":"IF(B2224=\"\",\"\",VLOOKUP(B2224,Magacin!A979:E5976,2,FALSE))","v":""}]
[null,null,{"$f":"IF(B2225=\"\",\"\",VLOOKUP(B2225,Magacin!A980:E5977,2,FALSE))","v":""}]
[null,null,{"$f":"IF(B2226=\"\",\"\",VLOOKUP(B2226,Magacin!A981:E5978,2,FALSE))","v":""}]
[null,null,{"$f":"IF(B2227=\"\",\"\",VLOOKUP(B2227,Magacin!A982:E5979,2,FALSE))","v":""}]
[null,null,{"$f":"IF(B2228=\"\",\"\",VLOOKUP(B2228,Magacin!A983:E5980,2,FALSE))","v":""}]
[null,null,{"$f":"IF(B2229=\"\",\"\",VLOOKUP(B2229,Magacin!A984:E5981,2,FALSE))","v":""}]
[null,null,{"$f":"IF(B2230=\"\",\"\",VLOOKUP(B2230,Magacin!A985:E5982,2,FALSE))","v":""}]
[null,null,{"$f":"IF(B2231=\"\",\"\",VLOOKUP(B2231,Magacin!A986:E5983,2,FALSE))","v":""}]
[null,null,{"$f":"IF(B2232=\"\",\"\",VLOOKUP(B2232,Magacin!A987:E5984,2,FALSE))","v":""}]
[null,null,{"$f":"IF(B2233=\"\",\"\",VLOOKUP(B2233,Magacin!A988:E5985,2,FALSE))","v":""}]
[null,null,{"$f":"IF(B2234=\"\",\"\",VLOOKUP(B2234,Magacin!A989:E5986,2,FALSE))","v":""}]
[null,null,{"$f":"IF(B2235=\"\",\"\",VLOOKUP(B2235,Magacin!A990:E5987,2,FALSE))","v":""}]
[null,null,{"$f":"IF(B2236=\"\",\"\",VLOOKUP(B2236,Magacin!A991:E5988,2,FALSE))","v":""}]
[null,null,{"$f":"IF(B2237=\"\",\"\",VLOOKUP(B2237,Magacin!A992:E5989,2,FALSE))","v":""}]
[null,null,{"$f":"IF(B2238=\"\",\"\",VLOOKUP(B2238,Magacin!A993:E5990,2,FALSE))","v":""}]
[null,null,{"$f":"IF(B2239=\"\",\"\",VLOOKUP(B2239,Magacin!A994:E5991,2,FALSE))","v":""}]
[null,null,{"$f":"IF(B2240=\"\",\"\",VLOOKUP(B2240,Magacin!A995:E5992,2,FALSE))","v":""}]
[null,null,{"$f":"IF(B2241=\"\",\"\",VLOOKUP(B2241,Magacin!A996:E5993,2,FALSE))","v":""}]
[null,null,{"$f":"IF(B2242=\"\",\"\",VLOOKUP(B2242,Magacin!A997:E5994,2,FALSE))","v":""}]
[null,null,{"$f":"IF(B2243=\"\",\"\",VLOOKUP(B2243,Magacin!A998:E5995,2,FALSE))","v":""}]
[null,null,{"$f":"IF(B2244=\"\",\"\",VLOOKUP(B2244,Magacin!A999:E5996,2,FALSE))","v":""}]
[null,null,{"$f":"IF(B2245=\"\",\"\",VLOOKUP(B2245,Magacin!A1000:E5997,2,FALSE))","v":""}]
[null,null,{"$f":"IF(B2246=\"\",\"\",VLOOKUP(B2246,Magacin!A1001:E5998,2,FALSE))","v":""}]
[null,null,{"$f":"IF(B2247=\"\",\"\",VLOOKUP(B2247,Magacin!A1002:E5999,2,FALSE))","v":""}]
[null,null,{"$f":"IF(B2248=\"\",\"\",VLOOKUP(B2248,Magacin!A1003:E6000,2,FALSE))","v":""}]
[null,null,{"$f":"IF(B2249=\"\",\"\",VLOOKUP(B2249,Magacin!A1004:E6001,2,FALSE))","v":""}]
[null,null,{"$f":"IF(B2250=\"\",\"\",VLOOKUP(B2250,Magacin!A1005:E6002,2,FALSE))","v":""}]
[null,null,{"$f":"IF(B2251=\"\",\"\",VLOOKUP(B2251,Magacin!A1006:E6003,2,FALSE))","v":""}]
[null,null,{"$f":"IF(B2252=\"\",\"\",VLOOKUP(B2252,Magacin!A1007:E6004,2,FALSE))","v":""}]
[null,null,{"$f":"IF(B2253=\"\",\"\",VLOOKUP(B2253,Magacin!A1008:E6005,2,FALSE))","v":""}]
[null,null,{"$f":"IF(B2254=\"\",\"\",VLOOKUP(B2254,Magacin!A1009:E6006,2,FALSE))","v":""}]
[null,null,{"$f":"IF(B2255=\"\",\"\",VLOOKUP(B2255,Magacin!A1010:E6007,2,FALSE))","v":""}]
[null,null,{"$f":"IF(B2256=\"\",\"\",VLOOKUP(B2256,Magacin!A1011:E6008,2,FALSE))","v":""}]
[null,null,{"$f":"IF(B2257=\"\",\"\",VLOOKUP(B2257,Magacin!A1012:E6009,2,FALSE))","v":""}]
[null,null,{"$f":"IF(B2258=\"\",\"\",VLOOKUP(B2258,Magacin!A1013:E6010,2,FALSE))","v":""}]
[null,null,{"$f":"IF(B2259=\"\",\"\",VLOOKUP(B2259,Magacin!A1014:E6011,2,FALSE))","v":""}]
[null,null,{"$f":"IF(B2260=\"\",\"\",VLOOKUP(B2260,Magacin!A1015:E6012,2,FALSE))","v":""}]
[null,null,{"$f":"IF(B2261=\"\",\"\",VLOOKUP(B2261,Magacin!A1016:E6013,2,FALSE))","v":""}]
[null,null,{"$f":"IF(B2262=\"\",\"\",VLOOKUP(B2262,Magacin!A1017:E6014,2,FALSE))","v":""}]
[null,null,{"$f":"IF(B2263=\"\",\"\",VLOOKUP(B2263,Magacin!A1018:E6015,2,FALSE))","v":""}]
[null,null,{"$f":"IF(B2264=\"\",\"\",VLOOKUP(B2264,Magacin!A1019:E6016,2,FALSE))","v":""}]
[null,null,{"$f":"IF(B2265=\"\",\"\",VLOOKUP(B2265,Magacin!A1020:E6017,2,FALSE))","v":""}]
[null,null,{"$f":"IF(B2266=\"\",\"\",VLOOKUP(B2266,Magacin!A1021:E6018,2,FALSE))","v":""}]
[null,null,{"$f":"IF(B2267=\"\",\"\",VLOOKUP(B2267,Magacin!A1022:E6019,2,FALSE))","v":""}]
[null,null,{"$f":"IF(B2268=\"\",\"\",VLOOKUP(B2268,Magacin!A1023:E6020,2,FALSE))","v":""}]
[null,null,{"$f":"IF(B2269=\"\",\"\",VLOOKUP(B2269,Magacin!A1024:E6021,2,FALSE))","v":""}]
[null,null,{"$f":"IF(B2270=\"\",\"\",VLOOKUP(B2270,Magacin!A1025:E6022,2,FALSE))","v":""}]
[null,null,{"$f":"IF(B2271=\"\",\"\",VLOOKUP(B2271,Magacin!A1026:E6023,2,FALSE))","v":""}]
[null,null,{"$f":"IF(B2272=\"\",\"\",VLOOKUP(B2272,Magacin!A1027:E6024,2,FALSE))","v":""}]
[null,null,{"$f":"IF(B2273=\"\",\"\",VLOOKUP(B2273,Magacin!A1028:E6025,2,FALSE))","v":""}]
[null,null,{"$f":"IF(B2274=\"\",\"\",VLOOKUP(B2274,Magacin!A1029:E6026,2,FALSE))","v":""}]
[null,null,{"$f":"IF(B2275=\"\",\"\",VLOOKUP(B2275,Magacin!A1030:E6027,2,FALSE))","v":""}]
[null,null,{"$f":"IF(B2276=\"\",\"\",VLOOKUP(B2276,Magacin!A1031:E6028,2,FALSE))","v":""}]
[null,null,{"$f":"IF(B2277=\"\",\"\",VLOOKUP(B2277,Magacin!A1032:E6029,2,FALSE))","v":""}]
[null,null,{"$f":"IF(B2278=\"\",\"\",VLOOKUP(B2278,Magacin!A1033:E6030,2,FALSE))","v":""}]
[null,null,{"$f":"IF(B2279=\"\",\"\",VLOOKUP(B2279,Magacin!A1034:E6031,2,FALSE))","v":""}]
[null,null,{"$f":"IF(B2280=\"\",\"\",VLOOKUP(B2280,Magacin!A1035:E6032,2,FALSE))","v":""}]
[null,null,{"$f":"IF(B2281=\"\",\"\",VLOOKUP(B2281,Magacin!A1036:E6033,2,FALSE))","v":""}]
[null,null,{"$f":"IF(B2282=\"\",\"\",VLOOKUP(B2282,Magacin!A1037:E6034,2,FALSE))","v":""}]
[null,null,{"$f":"IF(B2283=\"\",\"\",VLOOKUP(B2283,Magacin!A1038:E6035,2,FALSE))","v":""}]
[null,null,{"$f":"IF(B2284=\"\",\"\",VLOOKUP(B2284,Magacin!A1039:E6036,2,FALSE))","v":""}]
[null,null,{"$f":"IF(B2285=\"\",\"\",VLOOKUP(B2285,Magacin!A1040:E6037,2,FALSE))","v":""}]
[null,null,{"$f":"IF(B2286=\"\",\"\",VLOOKUP(B2286,Magacin!A1041:E6038,2,FALSE))","v":""}]
[null,null,{"$f":"IF(B2287=\"\",\"\",VLOOKUP(B2287,Magacin!A1042:E6039,2,FALSE))","v":""}]
[null,null,{"$f":"IF(B2288=\"\",\"\",VLOOKUP(B2288,Magacin!A1043:E6040,2,FALSE))","v":""}]
[null,null,{"$f":"IF(B2289=\"\",\"\",VLOOKUP(B2289,Magacin!A1044:E6041,2,FALSE))","v":""}]
[null,null,{"$f":"IF(B2290=\"\",\"\",VLOOKUP(B2290,Magacin!A1045:E6042,2,FALSE))","v":""}]
[null,null,{"$f":"IF(B2291=\"\",\"\",VLOOKUP(B2291,Magacin!A1046:E6043,2,FALSE))","v":""}]
[null,null,{"$f":"IF(B2292=\"\",\"\",VLOOKUP(B2292,Magacin!A1047:E6044,2,FALSE))","v":""}]
[null,null,{"$f":"IF(B2293=\"\",\"\",VLOOKUP(B2293,Magacin!A1048:E6045,2,FALSE))","v":""}]
[null,null,{"$f":"IF(B2294=\"\",\"\",VLOOKUP(B2294,Magacin!A1049:E6046,2,FALSE))","v":""}]
[null,null,{"$f":"IF(B2295=\"\",\"\",VLOOKUP(B2295,Magacin!A1050:E6047,2,FALSE))","v":""}]
[null,null,{"$f":"IF(B2296=\"\",\"\",VLOOKUP(B2296,Magacin!A1051:E6048,2,FALSE))","v":""}]
[null,null,{"$f":"IF(B2297=\"\",\"\",VLOOKUP(B2297,Magacin!A1052:E6049,2,FALSE))","v":""}]
[null,null,{"$f":"IF(B2298=\"\",\"\",VLOOKUP(B2298,Magacin!A1053:E6050,2,FALSE))","v":""}]
[null,null,{"$f":"IF(B2299=\"\",\"\",VLOOKUP(B2299,Magacin!A1054:E6051,2,FALSE))","v":""}]
[null,null,{"$f":"IF(B2300=\"\",\"\",VLOOKUP(B2300,Magacin!A1055:E6052,2,FALSE))","v":""}]
[null,null,{"$f":"IF(B2301=\"\",\"\",VLOOKUP(B2301,Magacin!A1056:E6053,2,FALSE))","v":""}]
[null,null,{"$f":"IF(B2302=\"\",\"\",VLOOKUP(B2302,Magacin!A1057:E6054,2,FALSE))","v":""}]
[null,null,{"$f":"IF(B2303=\"\",\"\",VLOOKUP(B2303,Magacin!A1058:E6055,2,FALSE))","v":""}]
[null,null,{"$f":"IF(B2304=\"\",\"\",VLOOKUP(B2304,Magacin!A1059:E6056,2,FALSE))","v":""}]
[null,null,{"$f":"IF(B2305=\"\",\"\",VLOOKUP(B2305,Magacin!A1060:E6057,2,FALSE))","v":""}]
[null,null,{"$f":"IF(B2306=\"\",\"\",VLOOKUP(B2306,Magacin!A1061:E6058,2,FALSE))","v":""}]
[null,null,{"$f":"IF(B2307=\"\",\"\",VLOOKUP(B2307,Magacin!A1062:E6059,2,FALSE))","v":""}]
[null,null,{"$f":"IF(B2308=\"\",\"\",VLOOKUP(B2308,Magacin!A1063:E6060,2,FALSE))","v":""}]
[null,null,{"$f":"IF(B2309=\"\",\"\",VLOOKUP(B2309,Magacin!A1064:E6061,2,FALSE))","v":""}]
[null,null,{"$f":"IF(B2310=\"\",\"\",VLOOKUP(B2310,Magacin!A1065:E6062,2,FALSE))","v":""}]
[null,null,{"$f":"IF(B2311=\"\",\"\",VLOOKUP(B2311,Magacin!A1066:E6063,2,FALSE))","v":""}]
[null,null,{"$f":"IF(B2312=\"\",\"\",VLOOKUP(B2312,Magacin!A1067:E6064,2,FALSE))","v":""}]
[null,null,{"$f":"IF(B2313=\"\",\"\",VLOOKUP(B2313,Magacin!A1068:E6065,2,FALSE))","v":""}]
[null,null,{"$f":"IF(B2314=\"\",\"\",VLOOKUP(B2314,Magacin!A1069:E6066,2,FALSE))","v":""}]
[null,null,{"$f":"IF(B2315=\"\",\"\",VLOOKUP(B2315,Magacin!A1070:E6067,2,FALSE))","v":""}]
[null,null,{"$f":"IF(B2316=\"\",\"\",VLOOKUP(B2316,Magacin!A1071:E6068,2,FALSE))","v":""}]
[null,null,{"$f":"IF(B2317=\"\",\"\",VLOOKUP(B2317,Magacin!A1072:E6069,2,FALSE))","v":""}]
[null,null,{"$f":"IF(B2318=\"\",\"\",VLOOKUP(B2318,Magacin!A1073:E6070,2,FALSE))","v":""}]
[null,null,{"$f":"IF(B2319=\"\",\"\",VLOOKUP(B2319,Magacin!A1074:E6071,2,FALSE))","v":""}]
[null,null,{"$f":"IF(B2320=\"\",\"\",VLOOKUP(B2320,Magacin!A1075:E6072,2,FALSE))","v":""}]
[null,null,{"$f":"IF(B2321=\"\",\"\",VLOOKUP(B2321,Magacin!A1076:E6073,2,FALSE))","v":""}]
[null,null,{"$f":"IF(B2322=\"\",\"\",VLOOKUP(B2322,Magacin!A1077:E6074,2,FALSE))","v":""}]
[null,null,{"$f":"IF(B2323=\"\",\"\",VLOOKUP(B2323,Magacin!A1078:E6075,2,FALSE))","v":""}]
[null,null,{"$f":"IF(B2324=\"\",\"\",VLOOKUP(B2324,Magacin!A1079:E6076,2,FALSE))","v":""}]
[null,null,{"$f":"IF(B2325=\"\",\"\",VLOOKUP(B2325,Magacin!A1080:E6077,2,FALSE))","v":""}]
[null,null,{"$f":"IF(B2326=\"\",\"\",VLOOKUP(B2326,Magacin!A1081:E6078,2,FALSE))","v":""}]
[null,null,{"$f":"IF(B2327=\"\",\"\",VLOOKUP(B2327,Magacin!A1082:E6079,2,FALSE))","v":""}]
[null,null,{"$f":"IF(B2328=\"\",\"\",VLOOKUP(B2328,Magacin!A1083:E6080,2,FALSE))","v":""}]
[null,null,{"$f":"IF(B2329=\"\",\"\",VLOOKUP(B2329,Magacin!A1084:E6081,2,FALSE))","v":""}]
[null,null,{"$f":"IF(B2330=\"\",\"\",VLOOKUP(B2330,Magacin!A1085:E6082,2,FALSE))","v":""}]
[null,null,{"$f":"IF(B2331=\"\",\"\",VLOOKUP(B2331,Magacin!A1086:E6083,2,FALSE))","v":""}]
[null,null,{"$f":"IF(B2332=\"\",\"\",VLOOKUP(B2332,Magacin!A1087:E6084,2,FALSE))","v":""}]
[null,null,{"$f":"IF(B2333=\"\",\"\",VLOOKUP(B2333,Magacin!A1088:E6085,2,FALSE))","v":""}]
[null,null,{"$f":"IF(B2334=\"\",\"\",VLOOKUP(B2334,Magacin!A1089:E6086,2,FALSE))","v":""}]
[null,null,{"$f":"IF(B2335=\"\",\"\",VLOOKUP(B2335,Magacin!A1090:E6087,2,FALSE))","v":""}]
[null,null,{"$f":"IF(B2336=\"\",\"\",VLOOKUP(B2336,Magacin!A1091:E6088,2,FALSE))","v":""}]
[null,null,{"$f":"IF(B2337=\"\",\"\",VLOOKUP(B2337,Magacin!A1092:E6089,2,FALSE))","v":""}]
[null,null,{"$f":"IF(B2338=\"\",\"\",VLOOKUP(B2338,Magacin!A1093:E6090,2,FALSE))","v":""}]
[null,null,{"$f":"IF(B2339=\"\",\"\",VLOOKUP(B2339,Magacin!A1094:E6091,2,FALSE))","v":""}]
[null,null,{"$f":"IF(B2340=\"\",\"\",VLOOKUP(B2340,Magacin!A1095:E6092,2,FALSE))","v":""}]
[null,null,{"$f":"IF(B2341=\"\",\"\",VLOOKUP(B2341,Magacin!A1096:E6093,2,FALSE))","v":""}]
[null,null,{"$f":"IF(B2342=\"\",\"\",VLOOKUP(B2342,Magacin!A1097:E6094,2,FALSE))","v":""}]
[null,null,{"$f":"IF(B2343=\"\",\"\",VLOOKUP(B2343,Magacin!A1098:E6095,2,FALSE))","v":""}]
[null,null,{"$f":"IF(B2344=\"\",\"\",VLOOKUP(B2344,Magacin!A1099:E6096,2,FALSE))","v":""}]
[null,null,{"$f":"IF(B2345=\"\",\"\",VLOOKUP(B2345,Magacin!A1100:E6097,2,FALSE))","v":""}]
[null,null,{"$f":"IF(B2346=\"\",\"\",VLOOKUP(B2346,Magacin!A1101:E6098,2,FALSE))","v":""}]
[null,null,{"$f":"IF(B2347=\"\",\"\",VLOOKUP(B2347,Magacin!A1102:E6099,2,FALSE))","v":""}]
[null,null,{"$f":"IF(B2348=\"\",\"\",VLOOKUP(B2348,Magacin!A1103:E6100,2,FALSE))","v":""}]
[null,null,{"$f":"IF(B2349=\"\",\"\",VLOOKUP(B2349,Magacin!A1104:E6101,2,FALSE))","v":""}]
[null,null,{"$f":"IF(B2350=\"\",\"\",VLOOKUP(B2350,Magacin!A1105:E6102,2,FALSE))","v":""}]

{"sheet":"Otpremnice","index":3,"n_rows":19,"n_cols":10,"rows_kept":19,"cut":false,"hidden":false,"merged":[[2,2,2,3],[3,2,3,3],[4,2,4,3]]}
[]
[]
[]
[]
[]
[]
[]
[]
[]
[]
[]
["r.br","šifra","Naziv artikla","Količina","Nabavna\nCijena","Nabavna.\nVrijednost","Veleprod.\n Cijena","Veleprod. \nVijednost","Maloprod.\nCijena","Maloprod.\nCijena"]
[1,33,{"$f":"IF(B13=\"\",\"\",VLOOKUP(B13,Magacin!$A$3:$H$49985,2,FALSE))","v":"Artikal 3 - 15kg"},30,{"$f":"IF(C13=\"\",\"\",VLOOKUP(C13,Magacin!$B$3:$H49985,5,FALSE))","v":1.119},{"$f":"D13*E13","v":33.57},{"$f":"IF(C13=\"\",\"\",VLOOKUP(C13,Magacin!$B$3:$H49985,6,FALSE))","v":2.1419999999999999},{"$f":"D13*G13","v":64.259999999999991},{"$f":"IF(C13=\"\",\"\",VLOOKUP(C13,Magacin!$B$3:$H49985,7,TRUE))","v":2.8},{"$f":"D13*I13","v":84}]
[{"$f":"IF(B14=\"\",\"\",A13+1)","v":2},11,{"$f":"IF(B14=\"\",\"\",VLOOKUP(B14,Magacin!$A$3:$H$49985,2,FALSE))","v":"Artikal 1 - 25kg"},684,{"$f":"IF(C14=\"\",\"\",VLOOKUP(C14,Magacin!$B$3:$H49986,5,FALSE))","v":0.48599999999999999},{"$f":"D14*E14","v":332.42399999999998},{"$f":"IF(C14=\"\",\"\",VLOOKUP(C14,Magacin!$B$3:$H49986,6,FALSE))","v":0.91},{"$f":"D14*G14","v":622.44000000000005},{"$f":"IF(C14=\"\",\"\",VLOOKUP(C14,Magacin!$B$3:$H49986,7,TRUE))","v":1.4},{"$f":"D14*I14","v":957.59999999999991}]
[{"$f":"IF(B15=\"\",\"\",A14+1)","v":3},22,{"$f":"IF(B15=\"\",\"\",VLOOKUP(B15,Magacin!$A$3:$H$49985,2,FALSE))","v":"Artikal 2 - 15kg"},108,{"$f":"IF(C15=\"\",\"\",VLOOKUP(C15,Magacin!$B$3:$H49987,5,FALSE))","v":0.39900000000000002},43.091999999999999,{"$f":"IF(C15=\"\",\"\",VLOOKUP(C15,Magacin!$B$3:$H49987,6,FALSE))","v":0.92800000000000005},100.224,{"$f":"IF(C15=\"\",\"\",VLOOKUP(C15,Magacin!$B$3:$H49987,7,TRUE))","v":1.2},129.6]
["",null,{"$f":"IF(B16=\"\",\"\",VLOOKUP(B16,Magacin!$A$3:$H$49985,2,FALSE))","v":""},null,{"$f":"IF(C16=\"\",\"\",VLOOKUP(C16,Magacin!$B$3:$H49988,5,FALSE))","v":""},{"$error":"#VALUE!"},{"$f":"IF(C16=\"\",\"\",VLOOKUP(C16,Magacin!$B$3:$H49988,6,FALSE))","v":""},{"$error":"#VALUE!"},{"$f":"IF(C16=\"\",\"\",VLOOKUP(C16,Magacin!$B$3:$H49988,7,TRUE))","v":""},{"$error":"#VALUE!"}]
["",null,{"$f":"IF(B17=\"\",\"\",VLOOKUP(B17,Magacin!$A$3:$H$49985,2,FALSE))","v":""},null,{"$f":"IF(C17=\"\",\"\",VLOOKUP(C17,Magacin!$B$3:$H49989,5,FALSE))","v":""},{"$error":"#VALUE!"},{"$f":"IF(C17=\"\",\"\",VLOOKUP(C17,Magacin!$B$3:$H49989,6,FALSE))","v":""},{"$error":"#VALUE!"},{"$f":"IF(C17=\"\",\"\",VLOOKUP(C17,Magacin!$B$3:$H49989,7,TRUE))","v":""},{"$error":"#VALUE!"}]
["",null,{"$f":"IF(B18=\"\",\"\",VLOOKUP(B18,Magacin!$A$3:$H$49985,2,FALSE))","v":""},null,{"$f":"IF(C18=\"\",\"\",VLOOKUP(C18,Magacin!$B$3:$H49990,5,FALSE))","v":""},{"$error":"#VALUE!"},{"$f":"IF(C18=\"\",\"\",VLOOKUP(C18,Magacin!$B$3:$H49990,6,FALSE))","v":""},{"$error":"#VALUE!"},{"$f":"IF(C18=\"\",\"\",VLOOKUP(C18,Magacin!$B$3:$H49990,7,TRUE))","v":""},{"$error":"#VALUE!"}]
["",null,{"$f":"IF(B19=\"\",\"\",VLOOKUP(B19,Magacin!$A$3:$H$49985,2,FALSE))","v":""},null,{"$f":"IF(C19=\"\",\"\",VLOOKUP(C19,Magacin!$B$3:$H49991,5,FALSE))","v":""},{"$error":"#VALUE!"},{"$f":"IF(C19=\"\",\"\",VLOOKUP(C19,Magacin!$B$3:$H49991,6,FALSE))","v":""},{"$error":"#VALUE!"},{"$f":"IF(C19=\"\",\"\",VLOOKUP(C19,Magacin!$B$3:$H49991,7,TRUE))","v":""},{"$error":"#VALUE!"}]