{"text_format":"1","workbook":"xlsx","n_sheets":5,"sheets":["Podaci","Promet","Total","AC","Podrska"],"not_rendered":{"charts":0,"images":0,"macros":1,"external_links":0,"defined_names":5,"comments":4,"pivot_tables":0},"unopened":[],"bounds":{"document_bytes":16777216,"sheet_cells":100000,"rows_first":2000,"rows_last":500,"rows_between":2000,"halvings":0,"cell_chars":16384,"cell_head_chars":4096},"cells_cut":0,"cells_raw":0,"read":"whole","date_system":"1900"}

{"sheet":"Podaci","index":0,"n_rows":103,"n_cols":10,"rows_kept":103,"cut":false,"hidden":false,"merged":[[0,1,1,2]]}
[null,"Podaci o korisnicima (kupcima)"]
[]
["R. br.","Ime i prezime","Ulica","Broj stana","Mesto","Telefon","Mobilni telefon","E-mail","WWW adresa","Napomena"]
[1,"Miroslav Popović","Rade Končara",9,"Donji Tavankut"]
[2,"Strahinja Arsić","Gornji Tavankut",108,"Gornji Tavankut"]
[3,"Predrag Arsić"]
[4,"Nenad Arsić"]
[5]
[6]
[7]
[8]
[9]
[10]
[11]
[12]
[13]
[14]
[15]
[16]
[17]
[18]
[19]
[20]
[21]
[22]
[23]
[24]
[25]
[26]
[27]
[28]
[29]
[30]
[31]
[32]
[33]
[34]
[35]
[36]
[37]
[38]
[39]
[40]
[41]
[42]
[43]
[44]
[45]
[46]
[47]
[48]
[49]
[50]
[51]
[52]
[53]
[54]
[55]
[56]
[57]
[58]
[59]
[60]
[61]
[62]
[63]
[64]
[65]
[66]
[67]
[68]
[69]
[70]
[71]
[72]
[73]
[74]
[75]
[76]
[77]
[78]
[79]
[80]
[81]
[82]
[83]
[84]
[85]
[86]
[87]
[88]
[89]
[90]
[91]
[92]
[93]
[94]
[95]
[96]
[97]
[98]
[99]
[100]

{"sheet":"Promet","index":1,"n_rows":103,"n_cols":11,"rows_kept":103,"cut":false,"hidden":false,"merged":[[0,6,0,9],[0,1,1,3]]}
[null,"Podaci o dnevnoj aktivnosti",null,null,null,null,"S"]
[null,null,null,null,null,null,{"$f":"SUM(G4:G103)","v":24},{"$f":"SUM(H4:H103)","v":130100},342261,23100]
["R. br.","Datum","Ime i prezime (kupac)","ID Artikla","Artikal","Cena","Kol","Ukupno","Plaćeno","Duguje","Napomena"]
[1,"2016-01-25","Miroslav Popović",1,{"$f":"IF(ISNUMBER(D4), VLOOKUP(D4, Tablica2[], 2, FALSE), \"\")","v":"Bukva - drvo"},{"$f":"IF(ISNUMBER(D4),VLOOKUP(D4,Tablica2[],3,FALSE),\"\")","v":4700},2,{"$f":"IF(AND(F4<>\"\",G4<>\"\"),F4*G4,\"\")","v":9400},9000,{"$f":"IF(AND(F4<>\"\",H4<>\"\"),H4-I4,\"\")","v":400}]
[2,"2016-10-28","Strahinja Arsić",3,{"$f":"IF(ISNUMBER(D5), VLOOKUP(D5, Tablica2[], 2, FALSE), \"\")","v":"Hrast - drvo"},{"$f":"IF(ISNUMBER(D5),VLOOKUP(D5,Tablica2[],3,FALSE),\"\")","v":4700},5,23500,23000,500]
[3,"2010-12-31","Predrag Arsić",4,{"$f":"IF(ISNUMBER(D6), VLOOKUP(D6, Tablica2[], 2, FALSE), \"\")","v":"Paletna bukva - drvo"},{"$f":"IF(ISNUMBER(D6),VLOOKUP(D6,Tablica2[],3,FALSE),\"\")","v":6500},10,65000,39000,26000]
[4,"2015-01-31","Nenad Arsić",2,{"$f":"IF(ISNUMBER(D7), VLOOKUP(D7, Tablica2[], 2, FALSE), \"\")","v":"Bagrem - drvo"},{"$f":"IF(ISNUMBER(D7),VLOOKUP(D7,Tablica2[],3,FALSE),\"\")","v":4600},7,32200,36000,-3800]
[5,"2017-03-01","Miroslav Popović",3,{"$f":"IF(ISNUMBER(D8), VLOOKUP(D8, Tablica2[], 2, FALSE), \"\")","v":"Hrast - drvo"},null,null,"",12500,""]
[6,"2018-12-31","Miroslav Popović",1,{"$f":"IF(ISNUMBER(D9), VLOOKUP(D9, Tablica2[], 2, FALSE), \"\")","v":"Bukva - drvo"},null,null,"",18800,""]
[7,null,"Nenad Arsić",4,{"$f":"IF(ISNUMBER(D10), VLOOKUP(D10, Tablica2[], 2, FALSE), \"\")","v":"Paletna bukva - drvo"},null,null,"",45000,""]
[8,null,"Predrag Arsić",1,{"$f":"IF(ISNUMBER(D11), VLOOKUP(D11, Tablica2[], 2, FALSE), \"\")","v":"Bukva - drvo"},null,null,"",28200,""]
[9,null,"Strahinja Arsić",2,{"$f":"IF(ISNUMBER(D12), VLOOKUP(D12, Tablica2[], 2, FALSE), \"\")","v":"Bagrem - drvo"},null,null,"",13000,""]
[10,null,"Miroslav Popović",3,{"$f":"IF(ISNUMBER(D13), VLOOKUP(D13, Tablica2[], 2, FALSE), \"\")","v":"Hrast - drvo"},null,null,"",9400,""]
[11,null,"Predrag Arsić",2,{"$f":"IF(ISNUMBER(D14), VLOOKUP(D14, Tablica2[], 2, FALSE), \"\")","v":"Bagrem - drvo"},null,null,"",11500,""]
[12,null,"Slavko Benčik",3,{"$f":"IF(ISNUMBER(D15), VLOOKUP(D15, Tablica2[], 2, FALSE), \"\")","v":"Hrast - drvo"},null,null,"",35000,""]
[13,null,"Strahinja Arsić",5,{"$f":"IF(ISNUMBER(D16), VLOOKUP(D16, Tablica2[], 2, FALSE), \"\")","v":"Ćumur"},null,null,"",5855,""]
[14,null,"Petar Petrović",4,{"$f":"IF(ISNUMBER(D17), VLOOKUP(D17, Tablica2[], 2, FALSE), \"\")","v":"Paletna bukva - drvo"},null,null,"",19500,""]
[15,null,"Marko Marković",6,{"$f":"IF(ISNUMBER(D18), VLOOKUP(D18, Tablica2[], 2, FALSE), \"\")","v":"Pesak"},null,null,"",17854,""]
[16,null,"Petar Petrović",3,{"$f":"IF(ISNUMBER(D19), VLOOKUP(D19, Tablica2[], 2, FALSE), \"\")","v":"Hrast - drvo"},null,null,"",18652,""]
[17,null,null,null,{"$f":"IF(ISNUMBER(D20), VLOOKUP(D20, Tablica2[], 2, FALSE), \"\")","v":""},null,null,"",null,""]
[18,null,null,null,{"$f":"IF(ISNUMBER(D21), VLOOKUP(D21, Tablica2[], 2, FALSE), \"\")","v":""},null,null,"",null,""]
[19,null,null,null,{"$f":"IF(ISNUMBER(D22), VLOOKUP(D22, Tablica2[], 2, FALSE), \"\")","v":""},null,null,"",null,""]
[20,null,null,null,{"$f":"IF(ISNUMBER(D23), VLOOKUP(D23, Tablica2[], 2, FALSE), \"\")","v":""},null,null,"",null,""]
[21,null,null,null,{"$f":"IF(ISNUMBER(D24), VLOOKUP(D24, Tablica2[], 2, FALSE), \"\")","v":""},null,null,"",null,""]
[22,null,null,null,{"$f":"IF(ISNUMBER(D25), VLOOKUP(D25, Tablica2[], 2, FALSE), \"\")","v":""},null,null,"",null,""]
[23,null,null,null,{"$f":"IF(ISNUMBER(D26), VLOOKUP(D26, Tablica2[], 2, FALSE), \"\")","v":""},null,null,"",null,""]
[24,null,null,null,{"$f":"IF(ISNUMBER(D27), VLOOKUP(D27, Tablica2[], 2, FALSE), \"\")","v":""},null,null,"",null,""]
[25,null,null,null,{"$f":"IF(ISNUMBER(D28), VLOOKUP(D28, Tablica2[], 2, FALSE), \"\")","v":""},null,null,"",null,""]
[26,null,null,null,{"$f":"IF(ISNUMBER(D29), VLOOKUP(D29, Tablica2[], 2, FALSE), \"\")","v":""},null,null,"",null,""]
[27,null,null,null,{"$f":"IF(ISNUMBER(D30), VLOOKUP(D30, Tablica2[], 2, FALSE), \"\")","v":""},null,null,"",null,""]
[28,null,null,null,{"$f":"IF(ISNUMBER(D31), VLOOKUP(D31, Tablica2[], 2, FALSE), \"\")","v":""},null,null,"",null,""]
[29,null,null,null,{"$f":"IF(ISNUMBER(D32), VLOOKUP(D32, Tablica2[], 2, FALSE), \"\")","v":""},null,null,"",null,""]
[30,null,null,null,{"$f":"IF(ISNUMBER(D33), VLOOKUP(D33, Tablica2[], 2, FALSE), \"\")","v":""},null,null,"",null,""]
[31,null,null,null,{"$f":"IF(ISNUMBER(D34), VLOOKUP(D34, Tablica2[], 2, FALSE), \"\")","v":""},null,null,"",null,""]
[32,null,null,null,{"$f":"IF(ISNUMBER(D35), VLOOKUP(D35, Tablica2[], 2, FALSE), \"\")","v":""},null,null,"",null,""]
[33,null,null,null,{"$f":"IF(ISNUMBER(D36), VLOOKUP(D36, Tablica2[], 2, FALSE), \"\")","v":""},null,null,"",null,""]
[34,null,null,null,{"$f":"IF(ISNUMBER(D37), VLOOKUP(D37, Tablica2[], 2, FALSE), \"\")","v":""},null,null,"",null,""]
[35,null,null,null,{"$f":"IF(ISNUMBER(D38), VLOOKUP(D38, Tablica2[], 2, FALSE), \"\")","v":""},null,null,"",null,""]
[36,null,null,null,{"$f":"IF(ISNUMBER(D39), VLOOKUP(D39, Tablica2[], 2, FALSE), \"\")","v":""},null,null,"",null,""]
[37,null,null,null,{"$f":"IF(ISNUMBER(D40), VLOOKUP(D40, Tablica2[], 2, FALSE), \"\")","v":""},null,null,"",null,""]
[38,null,null,null,{"$f":"IF(ISNUMBER(D41), VLOOKUP(D41, Tablica2[], 2, FALSE), \"\")","v":""},null,null,"",null,""]
[39,null,null,null,{"$f":"IF(ISNUMBER(D42), VLOOKUP(D42, Tablica2[], 2, FALSE), \"\")","v":""},null,null,"",null,""]
[40,null,null,null,{"$f":"IF(ISNUMBER(D43), VLOOKUP(D43, Tablica2[], 2, FALSE), \"\")","v":""},null,null,"",null,""]
[41,null,null,null,{"$f":"IF(ISNUMBER(D44), VLOOKUP(D44, Tablica2[], 2, FALSE), \"\")","v":""},null,null,"",null,""]
[42,null,null,null,{"$f":"IF(ISNUMBER(D45), VLOOKUP(D45, Tablica2[], 2, FALSE), \"\")","v":""},null,null,"",null,""]
[43,null,null,null,{"$f":"IF(ISNUMBER(D46), VLOOKUP(D46, Tablica2[], 2, FALSE), \"\")","v":""},null,null,"",null,""]
[44,null,null,null,{"$f":"IF(ISNUMBER(D47), VLOOKUP(D47, Tablica2[], 2, FALSE), \"\")","v":""},null,null,"",null,""]
[45,null,null,null,{"$f":"IF(ISNUMBER(D48), VLOOKUP(D48, Tablica2[], 2, FALSE), \"\")","v":""},null,null,"",null,""]
[46,null,null,null,{"$f":"IF(ISNUMBER(D49), VLOOKUP(D49, Tablica2[], 2, FALSE), \"\")","v":""},null,null,"",null,""]
[47,null,null,null,{"$f":"IF(ISNUMBER(D50), VLOOKUP(D50, Tablica2[], 2, FALSE), \"\")","v":""},null,null,"",null,""]
[48,null,null,null,{"$f":"IF(ISNUMBER(D51), VLOOKUP(D51, Tablica2[], 2, FALSE), \"\")","v":""},null,null,"",null,""]
[49,null,null,null,{"$f":"IF(ISNUMBER(D52), VLOOKUP(D52, Tablica2[], 2, FALSE), \"\")","v":""},null,null,"",null,""]
[50,null,null,null,{"$f":"IF(ISNUMBER(D53), VLOOKUP(D53, Tablica2[], 2, FALSE), \"\")","v":""},null,null,"",null,""]
[51,null,null,null,{"$f":"IF(ISNUMBER(D54), VLOOKUP(D54, Tablica2[], 2, FALSE), \"\")","v":""},null,null,"",null,""]
[52,null,null,null,{"$f":"IF(ISNUMBER(D55), VLOOKUP(D55, Tablica2[], 2, FALSE), \"\")","v":""},null,null,"",null,""]
[53,null,null,null,{"$f":"IF(ISNUMBER(D56), VLOOKUP(D56, Tablica2[], 2, FALSE), \"\")","v":""},null,null,"",null,""]
[54,null,null,null,{"$f":"IF(ISNUMBER(D57), VLOOKUP(D57, Tablica2[], 2, FALSE), \"\")","v":""},null,null,"",null,""]
[55,null,null,null,{"$f":"IF(ISNUMBER(D58), VLOOKUP(D58, Tablica2[], 2, FALSE), \"\")","v":""},null,null,"",null,""]
[56,null,null,null,{"$f":"IF(ISNUMBER(D59), VLOOKUP(D59, Tablica2[], 2, FALSE), \"\")","v":""},null,null,"",null,""]
[57,null,null,null,{"$f":"IF(ISNUMBER(D60), VLOOKUP(D60, Tablica2[], 2, FALSE), \"\")","v":""},null,null,"",null,""]
[58,null,null,null,{"$f":"IF(ISNUMBER(D61), VLOOKUP(D61, Tablica2[], 2, FALSE), \"\")","v":""},null,null,"",null,""]
[59,null,null,null,{"$f":"IF(ISNUMBER(D62), VLOOKUP(D62, Tablica2[], 2, FALSE), \"\")","v":""},null,null,"",null,""]
[60,null,null,null,{"$f":"IF(ISNUMBER(D63), VLOOKUP(D63, Tablica2[], 2, FALSE), \"\")","v":""},null,null,"",null,""]
[61,null,null,null,{"$f":"IF(ISNUMBER(D64), VLOOKUP(D64, Tablica2[], 2, FALSE), \"\")","v":""},null,null,"",null,""]
[62,null,null,null,{"$f":"IF(ISNUMBER(D65), VLOOKUP(D65, Tablica2[], 2, FALSE), \"\")","v":""},null,null,"",null,""]
[63,null,null,null,{"$f":"IF(ISNUMBER(D66), VLOOKUP(D66, Tablica2[], 2, FALSE), \"\")","v":""},null,null,"",null,""]
[64,null,null,null,{"$f":"IF(ISNUMBER(D67), VLOOKUP(D67, Tablica2[], 2, FALSE), \"\")","v":""},null,null,"",null,""]
[65,null,null,null,{"$f":"IF(ISNUMBER(D68), VLOOKUP(D68, Tablica2[], 2, FALSE), \"\")","v":""},null,null,{"$f":"IF(AND(F68<>\"\",G68<>\"\"),F68*G68,\"\")","v":""},null,{"$f":"IF(AND(F68<>\"\",H68<>\"\"),H68-I68,\"\")","v":""}]
[66,null,null,null,{"$f":"IF(ISNUMBER(D69), VLOOKUP(D69, Tablica2[], 2, FALSE), \"\")","v":""},null,null,"",null,""]
[67,null,null,null,{"$f":"IF(ISNUMBER(D70), VLOOKUP(D70, Tablica2[], 2, FALSE), \"\")","v":""},null,null,"",null,""]
[68,null,null,null,{"$f":"IF(ISNUMBER(D71), VLOOKUP(D71, Tablica2[], 2, FALSE), \"\")","v":""},null,null,"",null,""]
[69,null,null,null,{"$f":"IF(ISNUMBER(D72), VLOOKUP(D72, Tablica2[], 2, FALSE), \"\")","v":""},null,null,"",null,""]
[70,null,null,null,{"$f":"IF(ISNUMBER(D73), VLOOKUP(D73, Tablica2[], 2, FALSE), \"\")","v":""},null,null,"",null,""]
[71,null,null,null,{"$f":"IF(ISNUMBER(D74), VLOOKUP(D74, Tablica2[], 2, FALSE), \"\")","v":""},null,null,"",null,""]
[72,null,null,null,{"$f":"IF(ISNUMBER(D75), VLOOKUP(D75, Tablica2[], 2, FALSE), \"\")","v":""},null,null,"",null,""]
[73,null,null,null,{"$f":"IF(ISNUMBER(D76), VLOOKUP(D76, Tablica2[], 2, FALSE), \"\")","v":""},null,null,"",null,""]
[74,null,null,null,{"$f":"IF(ISNUMBER(D77), VLOOKUP(D77, Tablica2[], 2, FALSE), \"\")","v":""},null,null,"",null,""]
[75,null,null,null,{"$f":"IF(ISNUMBER(D78), VLOOKUP(D78, Tablica2[], 2, FALSE), \"\")","v":""},null,null,"",null,""]
[76,null,null,null,{"$f":"IF(ISNUMBER(D79), VLOOKUP(D79, Tablica2[], 2, FALSE), \"\")","v":""},null,null,"",null,""]
[77,null,null,null,{"$f":"IF(ISNUMBER(D80), VLOOKUP(D80, Tablica2[], 2, FALSE), \"\")","v":""},null,null,"",null,""]
[78,null,null,null,{"$f":"IF(ISNUMBER(D81), VLOOKUP(D81, Tablica2[], 2, FALSE), \"\")","v":""},null,null,"",null,""]
[79,null,null,null,{"$f":"IF(ISNUMBER(D82), VLOOKUP(D82, Tablica2[], 2, FALSE), \"\")","v":""},null,null,"",null,""]
[80,null,null,null,{"$f":"IF(ISNUMBER(D83), VLOOKUP(D83, Tablica2[], 2, FALSE), \"\")","v":""},null,null,"",null,""]
[81,null,null,null,{"$f":"IF(ISNUMBER(D84), VLOOKUP(D84, Tablica2[], 2, FALSE), \"\")","v":""},null,null,"",null,""]
[82,null,null,null,{"$f":"IF(ISNUMBER(D85), VLOOKUP(D85, Tablica2[], 2, FALSE), \"\")","v":""},null,null,"",null,""]
[83,null,null,null,{"$f":"IF(ISNUMBER(D86), VLOOKUP(D86, Tablica2[], 2, FALSE), \"\")","v":""},null,null,"",null,""]
[84,null,null,null,{"$f":"IF(ISNUMBER(D87), VLOOKUP(D87, Tablica2[], 2, FALSE), \"\")","v":""},null,null,"",null,""]
[85,null,null,null,{"$f":"IF(ISNUMBER(D88), VLOOKUP(D88, Tablica2[], 2, FALSE), \"\")","v":""},null,null,"",null,""]
[86,null,null,null,{"$f":"IF(ISNUMBER(D89), VLOOKUP(D89, Tablica2[], 2, FALSE), \"\")","v":""},null,null,"",null,""]
[87,null,null,null,{"$f":"IF(ISNUMBER(D90), VLOOKUP(D90, Tablica2[], 2, FALSE), \"\")","v":""},null,null,"",null,""]
[88,null,null,null,{"$f":"IF(ISNUMBER(D91), VLOOKUP(D91, Tablica2[], 2, FALSE), \"\")","v":""},null,null,"",null,""]
[89,null,null,null,{"$f":"IF(ISNUMBER(D92), VLOOKUP(D92, Tablica2[], 2, FALSE), \"\")","v":""},null,null,"",null,""]
[90,null,null,null,{"$f":"IF(ISNUMBER(D93), VLOOKUP(D93, Tablica2[], 2, FALSE), \"\")","v":""},null,null,"",null,""]
[91,null,null,null,{"$f":"IF(ISNUMBER(D94), VLOOKUP(D94, Tablica2[], 2, FALSE), \"\")","v":""},null,null,"",null,""]
[92,null,null,null,{"$f":"IF(ISNUMBER(D95), VLOOKUP(D95, Tablica2[], 2, FALSE), \"\")","v":""},null,null,"",null,""]
[93,null,null,null,{"$f":"IF(ISNUMBER(D96), VLOOKUP(D96, Tablica2[], 2, FALSE), \"\")","v":""},null,null,"",null,""]
[94,null,null,null,{"$f":"IF(ISNUMBER(D97), VLOOKUP(D97, Tablica2[], 2, FALSE), \"\")","v":""},null,null,"",null,""]
[95,null,null,null,{"$f":"IF(ISNUMBER(D98), VLOOKUP(D98, Tablica2[], 2, FALSE), \"\")","v":""},null,null,"",null,""]
[96,null,null,null,{"$f":"IF(ISNUMBER(D99), VLOOKUP(D99, Tablica2[], 2, FALSE), \"\")","v":""},null,null,"",null,""]
[97,null,null,null,{"$f":"IF(ISNUMBER(D100), VLOOKUP(D100, Tablica2[], 2, FALSE), \"\")","v":""},null,null,"",null,""]
[98,null,null,null,{"$f":"IF(ISNUMBER(D101), VLOOKUP(D101, Tablica2[], 2, FALSE), \"\")","v":""},null,null,"",null,""]
[99,null,null,null,{"$f":"IF(ISNUMBER(D102), VLOOKUP(D102, Tablica2[], 2, FALSE), \"\")","v":""},null,null,"",null,""]
[100,null,null,null,{"$f":"IF(ISNUMBER(D103), VLOOKUP(D103, Tablica2[], 2, FALSE), \"\")","v":""},null,null,"",null,""]

{"sheet":"Total","index":2,"n_rows":16,"n_cols":12,"rows_kept":16,"cut":false,"hidden":false,"merged":[[13,1,13,2],[13,5,13,6],[13,8,13,9],[14,5,14,6],[15,5,15,6],[14,8,14,9],[15,8,15,9],[5,1,5,2],[5,4,5,5],[5,7,5,8],[5,10,5,11],[0,1,1,3]]}
[null,"Promet po vrstama"]
[]
[]
[]
[]
[null,"Bukva - drvo",null,null,"Bagrem - drvo",null,null,"Hrast - drvo",null,null,"Paletna bukva - drvo"]
[null,"Kol","Suma",null,"Kol","Suma",null,"Kol","Suma",null,"Kol","Suma"]
[null,{"$f":"SUMIFS(Promet!G4:G103,Promet!E4:E103,\"Bukva - drvo\")","v":2},{"$f":"SUMIFS(Promet!H4:H103,Promet!E4:E103,\"Bukva - drvo\")","v":9400},null,{"$f":"SUMIFS(Promet!G4:G103,Promet!E4:E103,\"Bagrem - drvo\")","v":7},{"$f":"SUMIFS(Promet!H4:H103,Promet!E4:E103,\"Bagrem - drvo\")","v":32200},null,{"$f":"SUMIFS(Promet!G4:G103,Promet!E4:E103,\"Hrast - drvo\")","v":5},{"$f":"SUMIFS(Promet!H4:H103,Promet!E4:E103,\"Hrast - drvo\")","v":23500},null,{"$f":"SUMIFS(Promet!G4:G103,Promet!E4:E103,\"Paletna bukva - drvo\")","v":10},{"$f":"SUMIFS(Promet!H4:H103,Promet!E4:E103,\"Paletna bukva - drvo\")","v":65000}]
[]
[]
[]
[]
[]
[null,"Ukupan Promet",null,null,null,"Svega naplaćeno",null,null,"Svega nenaplaćeno"]
[null,"Kol","Suma",null,null,"Suma",null,null,"Suma"]
[null,{"$f":"SUM(Promet!G4:G103)","v":24},{"$f":"SUM(Promet!H4:H103)","v":130100},null,null,{"$f":"SUM(Promet!I4:I103)","v":342261},null,null,{"$f":"SUM(Promet!J4:J103)","v":23100}]

{"sheet":"AC","index":3,"n_rows":25,"n_cols":4,"rows_kept":25,"cut":false,"hidden":false,"merged":[[0,1,1,3]]}
[null,"Artikli - Cena"]
[]
[]
[null,"R. br.","Artikal","Cena"]
[null,"Stupac1","Stupac2","Stupac3"]
[null,1,"Bukva - drvo",4700]
[null,2,"Bagrem - drvo",4600]
[null,3,"Hrast - drvo",4700]
[null,4,"Paletna bukva - drvo",6500]
[null,5,"Ćumur",3000]
[null,6,"Pesak",1980]
[null,7]
[null,8]
[null,9]
[null,10]
[null,11]
[null,12]
[null,13]
[null,14]
[null,15]
[null,16]
[null,17]
[null,18]
[null,19]
[null,20]

{"sheet":"Podrska","index":4,"n_rows":0,"n_cols":0,"rows_kept":0,"cut":false,"hidden":false,"merged":[]}