{"text_format":"1","workbook":"xlsx","n_sheets":3,"sheets":["Sheet1","Sheet2","Sheet3"],"not_rendered":{"charts":0,"images":0,"macros":1,"external_links":0,"defined_names":1,"comments":0,"pivot_tables":0},"unopened":[],"bounds":{"document_bytes":16777216,"sheet_cells":100000,"rows_first":2000,"rows_last":500,"rows_between":2000,"halvings":0,"cell_chars":16384,"cell_head_chars":4096},"cells_cut":0,"cells_raw":0,"read":"whole","date_system":"1900"}

{"sheet":"Sheet1","index":0,"n_rows":1000,"n_cols":39,"rows_kept":1000,"cut":false,"hidden":false,"merged":[[0,13,0,15],[14,3,17,3],[10,3,13,3]]}
[{"$f":"IF(B1=\"\",\"\",1)","v":""},null,null,{"$f":"MAX(A:A)","v":5},null,null,null,null,null,{"$f":"IFERROR(VLOOKUP(H1,A:B,2,FALSE),\"\")","v":""},{"$f":"IF(J1=\"\",\"\",\"-\")","v":""},{"$f":"IFERROR(VLOOKUP(I1,A:B,2,FALSE),\"\")","v":""},null,"rezlutat",null,null,null,"tip",null,null,null,"rang","klub","broj utakmica","dao golova","primio golova","gol razlika","bodovi","kriterij",null,"pozicija","klub","Odigranih utakmica","dao golova","primio golova","gol razlika","bodovi",null,{"$f":"COUNT(R:R)+COUNTIF(R:R,\"x\")+1","v":1}]
[{"$f":"IF(B2=\"\",\"\",MAX(A$1:A1)+1)","v":1},"Dejan",null,{"$f":"2*COMBIN(D1,2)","v":20},null,0.48242807388305664,{"$f":"RANK($F2,$F$2:$F$21)","v":11},1,2,"Dejan",{"$f":"IF(J2=\"\",\"\",\"-\")","v":"-"},"Darko",null,null,{"$f":"IF(J2=\"\",\"\",\"-\")","v":"-"},null,null,{"$f":"IF(N2=\"\",\"\",IF(N2>P2,1,IF(N2<P2,2,\"x\")))","v":""},{"$f":"IF(J2=\"\",\"\",(IF(R2=1,3,IF(R2=\"x\",1,0))))","v":0},{"$f":"IF(J2=\"\",\"\",IF(R2=2,3,IF(R2=\"x\",1,0)))","v":0},{"$f":"IF(R2=\"\",\"\",1)","v":""},{"$f":"IFERROR(RANK(AC2,$AC$2:$AC$21),\"\")","v":""},{"$f":"IF(B1=\"\",\"  \",B1)","v":"  "},{"$f":"SUMIFS(U:U,J:J,W2)+SUMIFS(U:U,L:L,W2)","v":0},{"$f":"SUMIF(J:J,W2,N$1:N$1000)+SUMIF(L:L,W2,P$1:P$1000)","v":0},{"$f":"SUMIF(J:J,W2,P$1:P$1000)+SUMIF(L:L,W2,N$1:N$1000)","v":0},{"$f":"Y2-Z2","v":0},{"$f":"SUMIF(J:J,W2,S:S)+SUMIF(L:L,W2,T:T)","v":0},{"$f":"IF(W2=\"  \",\"\",AB2+AA2/100+Y2/1000+MATCH(W2,B:B,0)/10000000)","v":""},null,1,{"$f":"IFERROR(VLOOKUP($AE2,$V$2:$AC$100,2,FALSE),\"\")","v":"Sandra"},{"$f":"IFERROR(IF(AE2=\"\",\"\",VLOOKUP($AE2,$V$2:$AC$100,3,FALSE)),\"\")","v":0},{"$f":"IFERROR(IF(AE2=\"\",\"\",VLOOKUP($AE2,$V$2:$AC$100,4,FALSE)),\"\")","v":0},{"$f":"IFERROR(IF(AE2=\"\",\"\",VLOOKUP($AE2,$V$2:$AC$100,5,FALSE)),\"\")","v":0},{"$f":"IFERROR(IF(AE2=\"\",\"\",VLOOKUP($AE2,$V$2:$AC$100,6,FALSE)),\"\")","v":0},{"$f":"IFERROR(IF(AE2=\"\",\"\",VLOOKUP($AE2,$V$2:$AC$100,7,FALSE)),\"\")","v":0}]
[{"$f":"IF(B3=\"\",\"\",MAX(A$1:A2)+1)","v":""},null,null,null,null,0.20601719617843628,{"$f":"RANK($F3,$F$2:$F$21)","v":17},2,1,"Darko","-","Dejan",null,null,"-",null,null,{"$f":"IF(N3=\"\",\"\",IF(N3>P3,1,IF(N3<P3,2,\"x\")))","v":""},{"$f":"IF(J3=\"\",\"\",(IF(R3=1,3,IF(R3=\"x\",1,0))))","v":0},{"$f":"IF(J3=\"\",\"\",IF(R3=2,3,IF(R3=\"x\",1,0)))","v":0},{"$f":"IF(R3=\"\",\"\",1)","v":""},{"$f":"IFERROR(RANK(AC3,$AC$2:$AC$100),\"\")","v":5},{"$f":"IF(B2=\"\",\"  \",B2)","v":"Dejan"},{"$f":"SUMIFS(U:U,J:J,W3)+SUMIFS(U:U,L:L,W3)","v":0},{"$f":"SUMIF(J:J,W3,N$1:N$1000)+SUMIF(L:L,W3,P$1:P$1000)","v":0},{"$f":"SUMIF(J:J,W3,P$1:P$1000)+SUMIF(L:L,W3,N$1:N$1000)","v":0},{"$f":"Y3-Z3","v":0},{"$f":"SUMIF(J:J,W3,S:S)+SUMIF(L:L,W3,T:T)","v":0},1.9999999999999999E-7,null,{"$f":"IFERROR(IF(AE2+1<=MAX(A:A),AE2+1,\"\"),\"\")","v":2},{"$f":"IFERROR(VLOOKUP($AE3,$V$2:$AC$100,2,FALSE),\"\")","v":"Zvezdan"},{"$f":"IFERROR(IF(AE3=\"\",\"\",VLOOKUP($AE3,$V$2:$AC$100,3,FALSE)),\"\")","v":0},{"$f":"IFERROR(IF(AE3=\"\",\"\",VLOOKUP($AE3,$V$2:$AC$100,4,FALSE)),\"\")","v":0},{"$f":"IFERROR(IF(AE3=\"\",\"\",VLOOKUP($AE3,$V$2:$AC$100,5,FALSE)),\"\")","v":0},{"$f":"IFERROR(IF(AE3=\"\",\"\",VLOOKUP($AE3,$V$2:$AC$100,6,FALSE)),\"\")","v":0},{"$f":"IFERROR(IF(AE3=\"\",\"\",VLOOKUP($AE3,$V$2:$AC$100,7,FALSE)),\"\")","v":0}]
[{"$f":"IF(B4=\"\",\"\",MAX(A$1:A3)+1)","v":2},"Darko",null,null,null,0.86453449726104736,{"$f":"RANK($F4,$F$2:$F$21)","v":5},1,3,"Dejan","-","Ivan",null,null,"-",null,null,"",0,0,"",{"$f":"IFERROR(RANK(AC4,$AC$2:$AC$100),\"\")","v":""},"  ",{"$f":"SUMIFS(U:U,J:J,W4)+SUMIFS(U:U,L:L,W4)","v":0},0,0,0,0,"",null,3,"Ivan",0,0,0,0,0]
[{"$f":"IF(B5=\"\",\"\",MAX(A$1:A4)+1)","v":3},"Ivan",null,"Upisi parove",null,0.58862859010696411,{"$f":"RANK($F5,$F$2:$F$21)","v":9},3,1,"Ivan","-","Dejan",null,null,"-",null,null,"",0,0,"",4,"Darko",0,0,0,0,0,3.9999999999999998E-7,null,4,"Darko",0,0,0,0,0]
[{"$f":"IF(B6=\"\",\"\",MAX(A$1:A5)+1)","v":4},"Zvezdan",null,null,null,0.75490832328796387,{"$f":"RANK($F6,$F$2:$F$21)","v":6},1,4,"Dejan","-","Zvezdan",null,null,"-",null,null,"",0,0,"",3,"Ivan",0,0,0,0,0,4.9999999999999998E-7,null,5,"Dejan",0,0,0,0,0]
[{"$f":"IF(B7=\"\",\"\",MAX(A$1:A6)+1)","v":""},null,null,null,null,0.9278830885887146,{"$f":"RANK($F7,$F$2:$F$21)","v":3},4,1,"Zvezdan","-","Dejan",null,null,"-",null,null,"",0,0,"",2,{"$f":"IF(B6=\"\",\"  \",B6)","v":"Zvezdan"},0,0,0,0,0,5.9999999999999997E-7,null,"","  ","","","","",""]
[{"$f":"IF(B8=\"\",\"\",MAX(A$1:A7)+1)","v":5},"Sandra",null,null,null,0.3310168981552124,{"$f":"RANK($F8,$F$2:$F$21)","v":15},1,5,"Dejan","-","Sandra",null,null,"-",null,null,"",0,0,"","",{"$f":"IF(B7=\"\",\"  \",B7)","v":"  "},0,0,0,0,0,"",null,"","  ","","","","",""]
[{"$f":"IF(B9=\"\",\"\",MAX(A$1:A8)+1)","v":""},null,null,null,null,0.54294115304946899,{"$f":"RANK($F9,$F$2:$F$21)","v":10},5,1,"Sandra","-","Dejan",null,null,"-",null,null,"",0,0,"",1,"Sandra",0,0,0,0,0,7.9999999999999996E-7,null,"","  ","","","","",""]
[{"$f":"IF(B10=\"\",\"\",MAX(A$1:A9)+1)","v":""},null,null,null,null,8.0691337585449219E-2,{"$f":"RANK($F10,$F$2:$F$21)","v":20},2,3,"Darko","-","Ivan",null,null,"-",null,null,"",0,0,"","","  ",0,0,0,0,0,"",null,"","  ","","","","",""]
[{"$f":"IF(B11=\"\",\"\",MAX(A$1:A10)+1)","v":""},null,null,{"$f":"\"Ukupno utakmica \"&COUNT(G:G)&\", \"&\"jos treba da se odigra \"&COUNT(G:G)-COUNT(R:R)-COUNTIF(R:R,\"x\")&\".\"","v":"Ukupno utakmica 20, jos treba da se odigra 20."},null,0.63437193632125854,{"$f":"RANK($F11,$F$2:$F$21)","v":7},3,2,"Ivan","-","Darko",null,null,"-",null,null,"",0,0,"","","  ",0,0,0,0,0,"",null,"","  ","","","","",""]
[{"$f":"IF(B12=\"\",\"\",MAX(A$1:A11)+1)","v":""},null,null,null,null,0.41003668308258057,{"$f":"RANK($F12,$F$2:$F$21)","v":13},2,4,"Darko","-","Zvezdan",null,null,{"$f":"IF(J12=\"\",\"\",\"-\")","v":"-"},null,null,{"$f":"IF(N12=\"\",\"\",IF(N12>P12,1,IF(N12<P12,2,\"x\")))","v":""},0,0,"","","  ",0,0,0,0,0,"",null,"","  ","","","","",""]
[{"$f":"IF(B13=\"\",\"\",MAX(A$1:A12)+1)","v":""},null,null,null,null,0.9604228138923645,{"$f":"RANK($F13,$F$2:$F$21)","v":2},4,2,"Zvezdan","-","Darko",null,null,"-",null,null,"",0,0,"","","  ",0,0,0,0,0,"",null,"","  ","","","","",""]
[{"$f":"IF(B14=\"\",\"\",MAX(A$1:A13)+1)","v":""},null,null,null,null,0.1146233081817627,{"$f":"RANK($F14,$F$2:$F$21)","v":19},2,5,"Darko","-","Sandra",null,null,"-",null,null,"",0,0,"","","  ",0,0,0,0,0,"",null,"","  ","","","","",""]
[{"$f":"IF(B15=\"\",\"\",MAX(A$1:A14)+1)","v":""},null,null,{"$f":"IFERROR(\"Sledeci mec je:   \"&VLOOKUP(COUNT(R:R)+COUNTIF(R:R,\"x\")+1,G:L,4,FALSE)&\" - \"&VLOOKUP(COUNT(R:R)+COUNTIF(R:R,\"x\")+1,G:L,6,FALSE),\"Nema meceva.\")","v":"Sledeci mec je:   Sandra - Zvezdan"},null,0.92344516515731812,{"$f":"RANK($F15,$F$2:$F$21)","v":4},5,2,"Sandra","-","Darko",null,null,"-",null,null,"",0,0,"","","  ",0,0,0,0,0,"",null,"","  ","","","","",""]
[{"$f":"IF(B16=\"\",\"\",MAX(A$1:A15)+1)","v":""},null,null,null,null,0.62020957469940186,{"$f":"RANK($F16,$F$2:$F$21)","v":8},3,4,"Ivan","-","Zvezdan",null,null,"-",null,null,"",0,0,"","","  ",0,0,0,0,0,"",null,"","  ","","","","",""]
[{"$f":"IF(B17=\"\",\"\",MAX(A$1:A16)+1)","v":""},null,null,null,null,0.34772640466690063,{"$f":"RANK($F17,$F$2:$F$21)","v":14},4,3,"Zvezdan","-","Ivan",null,null,"-",null,null,"",0,0,"","","  ",0,0,0,0,0,"",null,"","  ","","","","",""]
[{"$f":"IF(B18=\"\",\"\",MAX(A$1:A17)+1)","v":""},null,null,null,null,0.1492457389831543,{"$f":"RANK($F18,$F$2:$F$21)","v":18},3,5,"Ivan","-","Sandra",null,null,"-",null,null,"",0,0,"","","  ",0,0,0,0,0,"",null,"","  ","","","","",""]
[{"$f":"IF(B19=\"\",\"\",MAX(A$1:A18)+1)","v":""},null,null,null,null,0.47997826337814331,{"$f":"RANK($F19,$F$2:$F$21)","v":12},5,3,"Sandra","-","Ivan",null,null,"-",null,null,"",0,0,"","","  ",0,0,0,0,0,"",null,"","  ","","","","",""]
[{"$f":"IF(B20=\"\",\"\",MAX(A$1:A19)+1)","v":""},null,null,null,null,0.21940910816192627,{"$f":"RANK($F20,$F$2:$F$21)","v":16},4,5,"Zvezdan","-","Sandra",null,null,"-",null,null,"",0,0,"","","  ",0,0,0,0,0,"",null,"","  ","","","","",""]
[{"$f":"IF(B21=\"\",\"\",MAX(A$1:A20)+1)","v":""},null,null,null,null,0.99373131990432739,{"$f":"RANK($F21,$F$2:$F$21)","v":1},5,4,"Sandra","-","Zvezdan",null,null,"-",null,null,"",0,0,"","","  ",0,0,0,0,0,"",null,"","  ","","","","",""]
[{"$f":"IF(B22=\"\",\"\",MAX(A$1:A21)+1)","v":""},null,null,null,null,0.49216562509536743,null,null,null,"","","",null,null,"",null,null,"","","","","",{"$f":"IF(B21=\"\",\"  \",B21)","v":"  "},{"$f":"SUMIFS(U:U,J:J,W22)+SUMIFS(U:U,L:L,W22)","v":0},{"$f":"SUMIF(J:J,W22,N$1:N$1000)+SUMIF(L:L,W22,P$1:P$1000)","v":0},{"$f":"SUMIF(J:J,W22,P$1:P$1000)+SUMIF(L:L,W22,N$1:N$1000)","v":0},{"$f":"Y22-Z22","v":0},{"$f":"SUMIF(J:J,W22,S:S)+SUMIF(L:L,W22,T:T)","v":0},{"$f":"IF(W22=\"  \",\"\",AB22+AA22/100+Y22/1000+MATCH(W22,B:B,0)/10000000)","v":""},null,{"$f":"IFERROR(IF(AE21+1<=MAX(A:A),AE21+1,\"\"),\"\")","v":""},"  ","","","","",""]
[{"$f":"IF(B23=\"\",\"\",MAX(A$1:A22)+1)","v":""},null,null,null,null,0.20762729644775391,null,null,null,"","","",null,null,"",null,null,"","","","","","  ",0,0,0,0,0,"",null,"","  ","","","","",""]
[{"$f":"IF(B24=\"\",\"\",MAX(A$1:A23)+1)","v":""},null,null,null,null,0.32973593473434448,null,null,null,"","","",null,null,"",null,null,"","","","","","  ",0,0,0,0,0,"",null,"","  ","","","","",""]
[{"$f":"IF(B25=\"\",\"\",MAX(A$1:A24)+1)","v":""},null,null,null,null,9.5429062843322754E-2,null,null,null,"","","",null,null,"",null,null,"","","","","","  ",0,0,0,0,0,"",null,"","  ","","","","",""]
[{"$f":"IF(B26=\"\",\"\",MAX(A$1:A25)+1)","v":""},null,null,null,null,0.58979254961013794,null,null,null,"","",{"$f":"IFERROR(VLOOKUP(I26,A:B,2,FALSE),\"\")","v":""},null,null,"",null,null,"","","","","","  ",0,0,0,0,0,"",null,"","  ","","","","",""]
[{"$f":"IF(B27=\"\",\"\",MAX(A$1:A26)+1)","v":""},null,null,null,null,0.16987347602844238,null,null,null,"","","",null,null,"",null,null,"","","","","","  ",0,0,0,0,0,"",null,"","  ","","","","",""]
[{"$f":"IF(B28=\"\",\"\",MAX(A$1:A27)+1)","v":""},null,null,null,null,0.92761653661727905,null,null,null,"","","",null,null,"",null,null,"","","","","","  ",0,0,0,0,0,"",null,"","  ","","","","",""]
[{"$f":"IF(B29=\"\",\"\",MAX(A$1:A28)+1)","v":""},null,null,null,null,9.7929835319519043E-2,null,null,null,"","","",null,null,"",null,null,"","","","","","  ",0,0,0,0,0,"",null,"","  ","","","","",""]
[{"$f":"IF(B30=\"\",\"\",MAX(A$1:A29)+1)","v":""},null,null,null,null,0.44386249780654907,null,null,null,"","","",null,null,"",null,null,"","","","","","  ",0,0,0,0,0,"",null,"","  ","","","","",""]
[{"$f":"IF(B31=\"\",\"\",MAX(A$1:A30)+1)","v":""},null,null,null,null,0.27294683456420898,null,null,null,"","","",null,null,"",null,null,"","","","","","  ",0,0,0,0,0,"",null,"","  ","","","","",""]
[{"$f":"IF(B32=\"\",\"\",MAX(A$1:A31)+1)","v":""},null,null,null,null,0.87254685163497925,null,null,null,"","","",null,null,"",null,null,"","","","","","  ",0,0,0,0,0,"",null,"","  ","","","","",""]
[{"$f":"IF(B33=\"\",\"\",MAX(A$1:A32)+1)","v":""},null,null,null,null,0.75068771839141846,null,null,null,"","","",null,null,"",null,null,"","","","","","  ",0,0,0,0,0,"",null,"","  ","","","","",""]
[{"$f":"IF(B34=\"\",\"\",MAX(A$1:A33)+1)","v":""},null,null,null,null,0.27294236421585083,null,null,null,"","","",null,null,"",null,null,"","","","","","  ",0,0,0,0,0,"",null,"","  ","","","","",""]
[{"$f":"IF(B35=\"\",\"\",MAX(A$1:A34)+1)","v":""},null,null,null,null,0.67364668846130371,null,null,null,"","","",null,null,"",null,null,"","","","","","  ",0,0,0,0,0,"",null,"","  ","","","","",""]
[{"$f":"IF(B36=\"\",\"\",MAX(A$1:A35)+1)","v":""},null,null,null,null,0.25662893056869507,null,null,null,"","","",null,null,"",null,null,"","","","","","  ",0,0,0,0,0,"",null,"","  ","","","","",""]
[{"$f":"IF(B37=\"\",\"\",MAX(A$1:A36)+1)","v":""},null,null,null,null,8.9896559715270996E-2,null,null,null,"","","",null,null,"",null,null,"","","","","","  ",0,0,0,0,0,"",null,"","  ","","","","",""]
[{"$f":"IF(B38=\"\",\"\",MAX(A$1:A37)+1)","v":""},null,null,null,null,3.0950605869293213E-2,null,null,null,"","","",null,null,"",null,null,"","","","","","  ",0,0,0,0,0,"",null,"","  ","","","","",""]
[{"$f":"IF(B39=\"\",\"\",MAX(A$1:A38)+1)","v":""},null,null,null,null,0.32271766662597656,null,null,null,"","","",null,null,"",null,null,"","","","","","  ",0,0,0,0,0,"",null,"","  ","","","","",""]
[{"$f":"IF(B40=\"\",\"\",MAX(A$1:A39)+1)","v":""},null,null,null,null,0.79012888669967651,null,null,null,"","","",null,null,"",null,null,"","","","","","  ",0,0,0,0,0,"",null,"","  ","","","","",""]
[{"$f":"IF(B41=\"\",\"\",MAX(A$1:A40)+1)","v":""},null,null,null,null,0.29725801944732666,null,null,null,"","","",null,null,"",null,null,"","","","","","  ",0,0,0,0,0,"",null,"","  ","","","","",""]
[{"$f":"IF(B42=\"\",\"\",MAX(A$1:A41)+1)","v":""},null,null,null,null,0.23528224229812622,null,null,null,"","","",null,null,"",null,null,"","","","","","  ",0,0,0,0,0,"",null,"","  ","","","","",""]
[{"$f":"IF(B43=\"\",\"\",MAX(A$1:A42)+1)","v":""},null,null,null,null,0.48047471046447754,null,null,null,"","","",null,null,"",null,null,"","","","","","  ",0,0,0,0,0,"",null,"","  ","","","","",""]
[{"$f":"IF(B44=\"\",\"\",MAX(A$1:A43)+1)","v":""},null,null,null,null,0.25460189580917358,null,null,null,"","","",null,null,"",null,null,"","","","","","  ",0,0,0,0,0,"",null,"","  ","","","","",""]
[{"$f":"IF(B45=\"\",\"\",MAX(A$1:A44)+1)","v":""},null,null,null,null,0.34060657024383545,null,null,null,"","","",null,null,"",null,null,"","","","","","  ",0,0,0,0,0,"",null,"","  ","","","","",""]
[{"$f":"IF(B46=\"\",\"\",MAX(A$1:A45)+1)","v":""},null,null,null,null,4.4933855533599854E-2,null,null,null,"","","",null,null,"",null,null,"","","","","","  ",0,0,0,0,0,"",null,"","  ","","","","",""]
[{"$f":"IF(B47=\"\",\"\",MAX(A$1:A46)+1)","v":""},null,null,null,null,0.62764203548431396,null,null,null,"","","",null,null,"",null,null,"","","","","","  ",0,0,0,0,0,"",null,"","  ","","","","",""]
[{"$f":"IF(B48=\"\",\"\",MAX(A$1:A47)+1)","v":""},null,null,null,null,0.42845636606216431,null,null,null,"","","",null,null,"",null,null,"","","","","","  ",0,0,0,0,0,"",null,"","  ","","","","",""]
[{"$f":"IF(B49=\"\",\"\",MAX(A$1:A48)+1)","v":""},null,null,null,null,9.7973823547363281E-2,null,null,null,"","","",null,null,"",null,null,"","","","","","  ",0,0,0,0,0,"",null,"","  ","","","","",""]
[{"$f":"IF(B50=\"\",\"\",MAX(A$1:A49)+1)","v":""},null,null,null,null,0.56104010343551636,null,null,null,"","","",null,null,"",null,null,"","","","","","  ",0,0,0,0,0,"",null,"","  ","","","","",""]
[{"$f":"IF(B51=\"\",\"\",MAX(A$1:A50)+1)","v":""},null,null,null,null,0.69448530673980713,null,null,null,"","","",null,null,"",null,null,"","","","","","  ",0,0,0,0,0,"",null,"","  ","","","","",""]
[{"$f":"IF(B52=\"\",\"\",MAX(A$1:A51)+1)","v":""},null,null,null,null,0.91371756792068481,null,null,null,"","","",null,null,"",null,null,"","","","","","  ",0,0,0,0,0,"",null,"","  ","","","","",""]
[{"$f":"IF(B53=\"\",\"\",MAX(A$1:A52)+1)","v":""},null,null,null,null,0.83481717109680176,null,null,null,"","","",null,null,"",null,null,"","","","","","  ",0,0,0,0,0,"",null,"","  ","","","","",""]
[{"$f":"IF(B54=\"\",\"\",MAX(A$1:A53)+1)","v":""},null,null,null,null,2.2629201412200928E-2,null,null,null,"","","",null,null,"",null,null,"","","","","","  ",0,0,0,0,0,"",null,"","  ","","","","",""]
[{"$f":"IF(B55=\"\",\"\",MAX(A$1:A54)+1)","v":""},null,null,null,null,0.54336059093475342,null,null,null,"","","",null,null,"",null,null,"","","","","","  ",0,0,0,0,0,"",null,"","  ","","","","",""]
[{"$f":"IF(B56=\"\",\"\",MAX(A$1:A55)+1)","v":""},null,null,null,null,0.91616398096084595,null,null,null,"","","",null,null,"",null,null,"","","","","","  ",0,0,0,0,0,"",null,"","  ","","","","",""]
[{"$f":"IF(B57=\"\",\"\",MAX(A$1:A56)+1)","v":""},null,null,null,null,0.43026113510131836,null,null,null,"","","",null,null,"",null,null,"","","","","","  ",0,0,0,0,0,"",null,"","  ","","","","",""]
[{"$f":"IF(B58=\"\",\"\",MAX(A$1:A57)+1)","v":""},null,null,null,null,0.67794770002365112,null,null,null,"","","",null,null,"",null,null,"","","","","","  ",0,0,0,0,0,"",null,"","  ","","","","",""]
[{"$f":"IF(B59=\"\",\"\",MAX(A$1:A58)+1)","v":""},null,null,null,null,0.50245392322540283,null,null,null,"","","",null,null,"",null,null,"","","","","","  ",0,0,0,0,0,"",null,"","  ","","","","",""]
[{"$f":"IF(B60=\"\",\"\",MAX(A$1:A59)+1)","v":""},null,null,null,null,0.51373749971389771,null,null,null,"","","",null,null,"",null,null,"","","","","","  ",0,0,0,0,0,"",null,"","  ","","","","",""]
[{"$f":"IF(B61=\"\",\"\",MAX(A$1:A60)+1)","v":""},null,null,null,null,0.46298003196716309,null,null,null,"","","",null,null,"",null,null,"","","","","","  ",0,0,0,0,0,"",null,"","  ","","","","",""]
[{"$f":"IF(B62=\"\",\"\",MAX(A$1:A61)+1)","v":""},null,null,null,null,0.35347265005111694,null,null,null,"","","",null,null,"",null,null,"","","","","","  ",0,0,0,0,0,"",null,"","  ","","","","",""]
[{"$f":"IF(B63=\"\",\"\",MAX(A$1:A62)+1)","v":""},null,null,null,null,0.40483415126800537,null,null,null,"","","",null,null,"",null,null,"","","","","","  ",0,0,0,0,0,"",null,"","  ","","","","",""]
[{"$f":"IF(B64=\"\",\"\",MAX(A$1:A63)+1)","v":""},null,null,null,null,0.26973158121109009,null,null,null,"","","",null,null,"",null,null,"","","","","","  ",0,0,0,0,0,"",null,"","  ","","","","",""]
[{"$f":"IF(B65=\"\",\"\",MAX(A$1:A64)+1)","v":""},null,null,null,null,5.5593490600585938E-2,null,null,null,{"$f":"IFERROR(VLOOKUP(H65,A:B,2,FALSE),\"\")","v":""},"","",null,null,"",null,null,"","","","","","  ",0,0,0,0,0,"",null,"","  ","","","","",""]
[{"$f":"IF(B66=\"\",\"\",MAX(A$1:A65)+1)","v":""},null,null,null,null,0.24384516477584839,null,null,null,"",{"$f":"IF(J66=\"\",\"\",\"-\")","v":""},"",null,null,"",null,null,"","","","","","  ",0,0,0,0,0,"",null,"","  ","","","","",""]
[{"$f":"IF(B67=\"\",\"\",MAX(A$1:A66)+1)","v":""},null,null,null,null,0.97907793521881104,null,null,null,"","","",null,null,"",null,null,"",{"$f":"IF(J67=\"\",\"\",(IF(R67=1,3,IF(R67=\"x\",1,0))))","v":""},{"$f":"IF(J67=\"\",\"\",IF(R67=2,3,IF(R67=\"x\",1,0)))","v":""},{"$f":"IF(R67=\"\",\"\",1)","v":""},"","  ",0,0,0,0,0,"",null,"",{"$f":"IFERROR(VLOOKUP($AE67,$V$2:$AC$100,2,FALSE),\"\")","v":"  "},{"$f":"IFERROR(IF(AE67=\"\",\"\",VLOOKUP($AE67,$V$2:$AC$100,3,FALSE)),\"\")","v":""},{"$f":"IFERROR(IF(AE67=\"\",\"\",VLOOKUP($AE67,$V$2:$AC$100,4,FALSE)),\"\")","v":""},{"$f":"IFERROR(IF(AE67=\"\",\"\",VLOOKUP($AE67,$V$2:$AC$100,5,FALSE)),\"\")","v":""},{"$f":"IFERROR(IF(AE67=\"\",\"\",VLOOKUP($AE67,$V$2:$AC$100,6,FALSE)),\"\")","v":""},{"$f":"IFERROR(IF(AE67=\"\",\"\",VLOOKUP($AE67,$V$2:$AC$100,7,FALSE)),\"\")","v":""}]
[{"$f":"IF(B68=\"\",\"\",MAX(A$1:A67)+1)","v":""},null,null,null,null,6.0916244983673096E-2,null,null,null,"","","",null,null,"",null,null,"","","","",{"$f":"IFERROR(RANK(AC68,$AC$2:$AC$100),\"\")","v":""},"  ",0,0,0,0,0,"",null,"","  ","","","","",""]
[{"$f":"IF(B69=\"\",\"\",MAX(A$1:A68)+1)","v":""},null,null,null,null,0.39029145240783691,null,null,null,"","","",null,null,"",null,null,"","","","","","  ",0,0,0,0,0,"",null,"","  ","","","","",""]
[{"$f":"IF(B70=\"\",\"\",MAX(A$1:A69)+1)","v":""},null,null,null,null,0.36499541997909546,null,null,null,"","","",null,null,"",null,null,"","","","","","  ",0,0,0,0,0,"",null,"","  ","","","","",""]
[{"$f":"IF(B71=\"\",\"\",MAX(A$1:A70)+1)","v":""},null,null,null,null,0.48989474773406982,null,null,null,"","","",null,null,"",null,null,"","","","","","  ",0,0,0,0,0,"",null,"","  ","","","","",""]
[{"$f":"IF(B72=\"\",\"\",MAX(A$1:A71)+1)","v":""},null,null,null,null,0.15566307306289673,null,null,null,"","","",null,null,"",null,null,"","","","","","  ",0,0,0,0,0,"",null,"","  ","","","","",""]
[{"$f":"IF(B73=\"\",\"\",MAX(A$1:A72)+1)","v":""},null,null,null,null,0.47445917129516602,null,null,null,"","","",null,null,"",null,null,"","","","","","  ",0,0,0,0,0,"",null,"","  ","","","","",""]
[{"$f":"IF(B74=\"\",\"\",MAX(A$1:A73)+1)","v":""},null,null,null,null,0.25726765394210815,null,null,null,"","","",null,null,"",null,null,"","","","","","  ",0,0,0,0,0,"",null,"","  ","","","","",""]
[{"$f":"IF(B75=\"\",\"\",MAX(A$1:A74)+1)","v":""},null,null,null,null,0.62875187397003174,null,null,null,"","","",null,null,"",null,null,"","","","","","  ",0,0,0,0,0,"",null,"","  ","","","","",""]
[{"$f":"IF(B76=\"\",\"\",MAX(A$1:A75)+1)","v":""},null,null,null,null,0.54207020998001099,null,null,null,"","","",null,null,{"$f":"IF(J76=\"\",\"\",\"-\")","v":""},null,null,{"$f":"IF(N76=\"\",\"\",IF(N76>P76,1,IF(N76<P76,2,\"x\")))","v":""},"","","","","  ",0,0,0,0,0,"",null,"","  ","","","","",""]
[{"$f":"IF(B77=\"\",\"\",MAX(A$1:A76)+1)","v":""},null,null,null,null,0.15630221366882324,null,null,null,"","","",null,null,"",null,null,"","","","","","  ",0,0,0,0,0,"",null,"","  ","","","","",""]
[{"$f":"IF(B78=\"\",\"\",MAX(A$1:A77)+1)","v":""},null,null,null,null,0.93854516744613647,null,null,null,"","","",null,null,"",null,null,"","","","","","  ",0,0,0,0,0,"",null,"","  ","","","","",""]
[{"$f":"IF(B79=\"\",\"\",MAX(A$1:A78)+1)","v":""},null,null,null,null,0.65449941158294678,null,null,null,"","","",null,null,"",null,null,"","","","","","  ",0,0,0,0,0,"",null,"","  ","","","","",""]
[{"$f":"IF(B80=\"\",\"\",MAX(A$1:A79)+1)","v":""},null,null,null,null,0.50608736276626587,null,null,null,"","","",null,null,"",null,null,"","","","","","  ",0,0,0,0,0,"",null,"","  ","","","","",""]
[{"$f":"IF(B81=\"\",\"\",MAX(A$1:A80)+1)","v":""},null,null,null,null,0.39047145843505859,null,null,null,"","","",null,null,"",null,null,"","","","","","  ",0,0,0,0,0,"",null,"","  ","","","","",""]
[{"$f":"IF(B82=\"\",\"\",MAX(A$1:A81)+1)","v":""},null,null,null,null,0.10737532377243042,null,null,null,"","","",null,null,"",null,null,"","","","","","  ",0,0,0,0,0,"",null,"","  ","","","","",""]
[{"$f":"IF(B83=\"\",\"\",MAX(A$1:A82)+1)","v":""},null,null,null,null,0.78399527072906494,null,null,null,"","","",null,null,"",null,null,"","","","","","  ",0,0,0,0,0,"",null,"","  ","","","","",""]
[{"$f":"IF(B84=\"\",\"\",MAX(A$1:A83)+1)","v":""},null,null,null,null,0.45964080095291138,null,null,null,"","","",null,null,"",null,null,"","","","","","  ",0,0,0,0,0,"",null,"","  ","","","","",""]
[{"$f":"IF(B85=\"\",\"\",MAX(A$1:A84)+1)","v":""},null,null,null,null,0.75368809700012207,null,null,null,"","","",null,null,"",null,null,"","","","","","  ",0,0,0,0,0,"",null,"","  ","","","","",""]
[{"$f":"IF(B86=\"\",\"\",MAX(A$1:A85)+1)","v":""},null,null,null,null,0.59609454870223999,null,null,null,"","","",null,null,"",null,null,"","","","","",{"$f":"IF(B85=\"\",\"  \",B85)","v":"  "},{"$f":"SUMIFS(U:U,J:J,W86)+SUMIFS(U:U,L:L,W86)","v":0},{"$f":"SUMIF(J:J,W86,N$1:N$1000)+SUMIF(L:L,W86,P$1:P$1000)","v":0},{"$f":"SUMIF(J:J,W86,P$1:P$1000)+SUMIF(L:L,W86,N$1:N$1000)","v":0},{"$f":"Y86-Z86","v":0},{"$f":"SUMIF(J:J,W86,S:S)+SUMIF(L:L,W86,T:T)","v":0},{"$f":"IF(W86=\"  \",\"\",AB86+AA86/100+Y86/1000+MATCH(W86,B:B,0)/10000000)","v":""},null,{"$f":"IFERROR(IF(AE85+1<=MAX(A:A),AE85+1,\"\"),\"\")","v":""},"  ","","","","",""]
[{"$f":"IF(B87=\"\",\"\",MAX(A$1:A86)+1)","v":""},null,null,null,null,0.83273017406463623,null,null,null,"","","",null,null,"",null,null,"","","","","","  ",0,0,0,0,0,"",null,"","  ","","","","",""]
[{"$f":"IF(B88=\"\",\"\",MAX(A$1:A87)+1)","v":""},null,null,null,null,1.875835657119751E-2,null,null,null,"","","",null,null,"",null,null,"","","","","","  ",0,0,0,0,0,"",null,"","  ","","","","",""]
[{"$f":"IF(B89=\"\",\"\",MAX(A$1:A88)+1)","v":""},null,null,null,null,0.21036863327026367,null,null,null,"","","",null,null,"",null,null,"","","","","","  ",0,0,0,0,0,"",null,"","  ","","","","",""]
[{"$f":"IF(B90=\"\",\"\",MAX(A$1:A89)+1)","v":""},null,null,null,null,7.3953330516815186E-2,null,null,null,"","",{"$f":"IFERROR(VLOOKUP(I90,A:B,2,FALSE),\"\")","v":""},null,null,"",null,null,"","","","","","  ",0,0,0,0,0,"",null,"","  ","","","","",""]
[{"$f":"IF(B91=\"\",\"\",MAX(A$1:A90)+1)","v":""},null,null,null,null,0.10545265674591064,null,null,null,"","","",null,null,"",null,null,"","","","","","  ",0,0,0,0,0,"",null,"","  ","","","","",""]
[{"$f":"IF(B92=\"\",\"\",MAX(A$1:A91)+1)","v":""},null,null,null,null,0.88606619834899902,null,null,null,"","","",null,null,"",null,null,"","","","","","  ",0,0,0,0,0,"",null,"","  ","","","","",""]
[{"$f":"IF(B93=\"\",\"\",MAX(A$1:A92)+1)","v":""},null,null,null,null,4.3198525905609131E-2,null,null,null,"","","",null,null,"",null,null,"","","","","","  ",0,0,0,0,0,"",null,"","  ","","","","",""]
[{"$f":"IF(B94=\"\",\"\",MAX(A$1:A93)+1)","v":""},null,null,null,null,0.45870339870452881,null,null,null,"","","",null,null,"",null,null,"","","","","","  ",0,0,0,0,0,"",null,"","  ","","","","",""]
[{"$f":"IF(B95=\"\",\"\",MAX(A$1:A94)+1)","v":""},null,null,null,null,0.73898321390151978,null,null,null,"","","",null,null,"",null,null,"","","","","","  ",0,0,0,0,0,"",null,"","  ","","","","",""]
[{"$f":"IF(B96=\"\",\"\",MAX(A$1:A95)+1)","v":""},null,null,null,null,0.75526046752929688,null,null,null,"","","",null,null,"",null,null,"","","","","","  ",0,0,0,0,0,"",null,"","  ","","","","",""]
[{"$f":"IF(B97=\"\",\"\",MAX(A$1:A96)+1)","v":""},null,null,null,null,0.82257860898971558,null,null,null,"","","",null,null,"",null,null,"","","","","","  ",0,0,0,0,0,"",null,"","  ","","","","",""]
[{"$f":"IF(B98=\"\",\"\",MAX(A$1:A97)+1)","v":""},null,null,null,null,0.20967447757720947,null,null,null,"","","",null,null,"",null,null,"","","","","","  ",0,0,0,0,0,"",null,"","  ","","","","",""]
[{"$f":"IF(B99=\"\",\"\",MAX(A$1:A98)+1)","v":""},null,null,null,null,0.46873599290847778,null,null,null,"","","",null,null,"",null,null,"","","","","","  ",0,0,0,0,0,"",null,"","  ","","","","",""]
[{"$f":"IF(B100=\"\",\"\",MAX(A$1:A99)+1)","v":""},null,null,null,null,0.86800408363342285,null,null,null,"","","",null,null,"",null,null,"","","","","","  ",0,0,0,0,0,"",null,"","  ","","","","",""]
[{"$f":"IF(B101=\"\",\"\",MAX(A$1:A100)+1)","v":""},null,null,null,null,0.82834190130233765,null,null,null,"","","",null,null,"",null,null,"","","",""]
[null,null,null,null,null,0.41040217876434326,null,null,null,"","","",null,null,"",null,null,"","","",""]
[null,null,null,null,null,0.46250015497207642,null,null,null,"","","",null,null,"",null,null,"","","",""]
[null,null,null,null,null,0.34886980056762695,null,null,null,"","","",null,null,"",null,null,"","","",""]
[null,null,null,null,null,0.24927014112472534,null,null,null,"","","",null,null,"",null,null,"","","",""]
[null,null,null,null,null,0.80704128742218018,null,null,null,"","","",null,null,"",null,null,"","","",""]
[null,null,null,null,null,0.54431134462356567,null,null,null,"","","",null,null,"",null,null,"","","",""]
[null,null,null,null,null,0.53825068473815918,null,null,null,"","","",null,null,"",null,null,"","","",""]
[null,null,null,null,null,0.62668412923812866,null,null,null,"","","",null,null,"",null,null,"","","",""]
[null,null,null,null,null,8.8129401206970215E-2,null,null,null,"","","",null,null,"",null,null,"","","",""]
[null,null,null,null,null,0.71105676889419556,null,null,null,"","","",null,null,"",null,null,"","","",""]
[null,null,null,null,null,0.25798511505126953,null,null,null,"","","",null,null,"",null,null,"","","",""]
[null,null,null,null,null,5.7568728923797607E-2,null,null,null,"","","",null,null,"",null,null,"","","",""]
[null,null,null,null,null,0.27521193027496338,null,null,null,"","","",null,null,"",null,null,"","","",""]
[null,null,null,null,null,0.96060019731521606,null,null,null,"","","",null,null,"",null,null,"","","",""]
[null,null,null,null,null,0.32698178291320801,null,null,null,"","","",null,null,"",null,null,"","","",""]
[null,null,null,null,null,0.64769786596298218,null,null,null,"","","",null,null,"",null,null,"","","",""]
[null,null,null,null,null,0.36346709728240967,null,null,null,"","","",null,null,"",null,null,"","","",""]
[null,null,null,null,null,0.3699069619178772,null,null,null,"","","",null,null,"",null,null,"","","",""]
[null,null,null,null,null,0.32684469223022461,null,null,null,"","","",null,null,"",null,null,"","","",""]
[null,null,null,null,null,0.21475952863693237,null,null,null,"","","",null,null,"",null,null,"","","",""]
[null,null,null,null,null,0.21233093738555908,null,null,null,"","","",null,null,"",null,null,"","","",""]
[null,null,null,null,null,0.42316895723342896,null,null,null,"","","",null,null,"",null,null,"","","",""]
[null,null,null,null,null,0.61749815940856934,null,null,null,"","","",null,null,"",null,null,"","","",""]
[null,null,null,null,null,0.24148076772689819,null,null,null,"","","",null,null,"",null,null,"","","",""]
[null,null,null,null,null,0.68612229824066162,null,null,null,"","","",null,null,"",null,null,"","","",""]
[null,null,null,null,null,0.58992964029312134,null,null,null,"","","",null,null,"",null,null,"","","",""]
[null,null,null,null,null,0.60281181335449219,null,null,null,"","","",null,null,"",null,null,"","","",""]
[null,null,null,null,null,7.8752696514129639E-2,null,null,null,{"$f":"IFERROR(VLOOKUP(H129,A:B,2,FALSE),\"\")","v":""},"","",null,null,"",null,null,"","","",""]
[null,null,null,null,null,4.4667840003967285E-2,null,null,null,"",{"$f":"IF(J130=\"\",\"\",\"-\")","v":""},"",null,null,"",null,null,"","","",""]
[null,null,null,null,null,0.15320903062820435,null,null,null,"","","",null,null,"",null,null,"",{"$f":"IF(J131=\"\",\"\",(IF(R131=1,3,IF(R131=\"x\",1,0))))","v":""},{"$f":"IF(J131=\"\",\"\",IF(R131=2,3,IF(R131=\"x\",1,0)))","v":""},{"$f":"IF(R131=\"\",\"\",1)","v":""}]
[null,null,null,null,null,0.24622559547424316,null,null,null,"","","",null,null,"",null,null,"","","",""]
[null,null,null,null,null,0.39875549077987671,null,null,null,"","","",null,null,"",null,null,"","","",""]
[null,null,null,null,null,0.58392703533172607,null,null,null,"","","",null,null,"",null,null,"","","",""]
[null,null,null,null,null,0.28762871026992798,null,null,null,"","","",null,null,"",null,null,"","","",""]
[null,null,null,null,null,0.83637475967407227,null,null,null,"","","",null,null,"",null,null,"","","",""]
[null,null,null,null,null,0.8980833888053894,null,null,null,"","","",null,null,"",null,null,"","","",""]
[null,null,null,null,null,0.52661716938018799,null,null,null,"","","",null,null,"",null,null,"","","",""]
[null,null,null,null,null,0.38753682374954224,null,null,null,"","","",null,null,"",null,null,"","","",""]
[null,null,null,null,null,2.7148723602294922E-3,null,null,null,"","","",null,null,{"$f":"IF(J140=\"\",\"\",\"-\")","v":""},null,null,{"$f":"IF(N140=\"\",\"\",IF(N140>P140,1,IF(N140<P140,2,\"x\")))","v":""},"","",""]
[null,null,null,null,null,0.25086969137191772,null,null,null,"","","",null,null,"",null,null,"","","",""]
[null,null,null,null,null,0.16283833980560303,null,null,null,"","","",null,null,"",null,null,"","","",""]
[null,null,null,null,null,0.64513307809829712,null,null,null,"","","",null,null,"",null,null,"","","",""]
[null,null,null,null,null,0.98114681243896484,null,null,null,"","","",null,null,"",null,null,"","","",""]
[null,null,null,null,null,0.31191176176071167,null,null,null,"","","",null,null,"",null,null,"","","",""]
[null,null,null,null,null,0.24069845676422119,null,null,null,"","","",null,null,"",null,null,"","","",""]
[null,null,null,null,null,0.87859374284744263,null,null,null,"","","",null,null,"",null,null,"","","",""]
[null,null,null,null,null,0.12964177131652832,null,null,null,"","","",null,null,"",null,null,"","","",""]
[null,null,null,null,null,0.56979602575302124,null,null,null,"","","",null,null,"",null,null,"","","",""]
[null,null,null,null,null,0.60693824291229248,null,null,null,"","","",null,null,"",null,null,"","","",""]
[null,null,null,null,null,0.61019665002822876,null,null,null,"","","",null,null,"",null,null,"","","",""]
[null,null,null,null,null,0.69386625289916992,null,null,null,"","","",null,null,"",null,null,"","","",""]
[null,null,null,null,null,0.85002297163009644,null,null,null,"","","",null,null,"",null,null,"","","",""]
[null,null,null,null,null,9.7556233406066895E-2,null,null,null,"","",{"$f":"IFERROR(VLOOKUP(I154,A:B,2,FALSE),\"\")","v":""},null,null,"",null,null,"","","",""]
[null,null,null,null,null,0.39444619417190552,null,null,null,"","","",null,null,"",null,null,"","","",""]
[null,null,null,null,null,0.82280707359313965,null,null,null,"","","",null,null,"",null,null,"","","",""]
[null,null,null,null,null,0.26813215017318726,null,null,null,"","","",null,null,"",null,null,"","","",""]
[null,null,null,null,null,0.67843377590179443,null,null,null,"","","",null,null,"",null,null,"","","",""]
[null,null,null,null,null,0.3961983323097229,null,null,null,"","","",null,null,"",null,null,"","","",""]
[null,null,null,null,null,0.8343963623046875,null,null,null,"","","",null,null,"",null,null,"","","",""]
[null,null,null,null,null,0.4328271746635437,null,null,null,"","","",null,null,"",null,null,"","","",""]
[null,null,null,null,null,0.8359600305557251,null,null,null,"","","",null,null,"",null,null,"","","",""]
[null,null,null,null,null,0.21878558397293091,null,null,null,"","","",null,null,"",null,null,"","","",""]
[null,null,null,null,null,0.73113656044006348,null,null,null,"","","",null,null,"",null,null,"","","",""]
[null,null,null,null,null,0.89910072088241577,null,null,null,"","","",null,null,"",null,null,"","","",""]
[null,null,null,null,null,0.21765697002410889,null,null,null,"","","",null,null,"",null,null,"","","",""]
[null,null,null,null,null,0.98214203119277954,null,null,null,"","","",null,null,"",null,null,"","","",""]
[null,null,null,null,null,0.96572542190551758,null,null,null,"","","",null,null,"",null,null,"","","",""]
[null,null,null,null,null,0.87135952711105347,null,null,null,"","","",null,null,"",null,null,"","","",""]
[null,null,null,null,null,0.5228043794631958,null,null,null,"","","",null,null,"",null,null,"","","",""]
[null,null,null,null,null,0.6509283185005188,null,null,null,"","","",null,null,"",null,null,"","","",""]
[null,null,null,null,null,0.4566810131072998,null,null,null,"","","",null,null,"",null,null,"","","",""]
[null,null,null,null,null,0.15654939413070679,null,null,null,"","","",null,null,"",null,null,"","","",""]
[null,null,null,null,null,0.64306485652923584,null,null,null,"","","",null,null,"",null,null,"","","",""]
[null,null,null,null,null,0.61265665292739868,null,null,null,"","","",null,null,"",null,null,"","","",""]
[null,null,null,null,null,0.85396671295166016,null,null,null,"","","",null,null,"",null,null,"","","",""]
[null,null,null,null,null,0.36728018522262573,null,null,null,"","","",null,null,"",null,null,"","","",""]
[null,null,null,null,null,5.3108811378479004E-2,null,null,null,"","","",null,null,"",null,null,"","","",""]
[null,null,null,null,null,0.50581580400466919,null,null,null,"","","",null,null,"",null,null,"","","",""]
[null,null,null,null,null,5.4616212844848633E-2,null,null,null,"","","",null,null,"",null,null,"","","",""]
[null,null,null,null,null,0.3749508261680603,null,null,null,"","","",null,null,"",null,null,"","","",""]
[null,null,null,null,null,0.45123946666717529,null,null,null,"","","",null,null,"",null,null,"","","",""]
[null,null,null,null,null,0.29799610376358032,null,null,null,"","","",null,null,"",null,null,"","","",""]
[null,null,null,null,null,0.96835851669311523,null,null,null,"","","",null,null,"",null,null,"","","",""]
[null,null,null,null,null,1.2874305248260498E-2,null,null,null,"","","",null,null,"",null,null,"","","",""]
[null,null,null,null,null,0.65001785755157471,null,null,null,"","","",null,null,"",null,null,"","","",""]
[null,null,null,null,null,0.61401444673538208,null,null,null,"","","",null,null,"",null,null,"","","",""]
[null,null,null,null,null,0.53324294090270996,null,null,null,"","","",null,null,"",null,null,"","","",""]
[null,null,null,null,null,2.9402673244476318E-2,null,null,null,"","","",null,null,"",null,null,"","","",""]
[null,null,null,null,null,0.71688783168792725,null,null,null,"","","",null,null,"",null,null,"","","",""]
[null,null,null,null,null,0.31403928995132446,null,null,null,"","","",null,null,"",null,null,"","","",""]
[null,null,null,null,null,0.98126411437988281,null,null,null,"","","",null,null,"",null,null,"","","",""]
[null,null,null,null,null,0.29105204343795776,null,null,null,{"$f":"IFERROR(VLOOKUP(H193,A:B,2,FALSE),\"\")","v":""},"","",null,null,"",null,null,"","","",""]
[null,null,null,null,null,0.36480104923248291,null,null,null,"",{"$f":"IF(J194=\"\",\"\",\"-\")","v":""},"",null,null,"",null,null,"","","",""]
[null,null,null,null,null,0.32171565294265747,null,null,null,"","","",null,null,"",null,null,"",{"$f":"IF(J195=\"\",\"\",(IF(R195=1,3,IF(R195=\"x\",1,0))))","v":""},{"$f":"IF(J195=\"\",\"\",IF(R195=2,3,IF(R195=\"x\",1,0)))","v":""},{"$f":"IF(R195=\"\",\"\",1)","v":""}]
[null,null,null,null,null,0.35398697853088379,null,null,null,"","","",null,null,"",null,null,"","","",""]
[null,null,null,null,null,0.23562759160995483,null,null,null,"","","",null,null,"",null,null,"","","",""]
[null,null,null,null,null,0.5928419828414917,null,null,null,"","","",null,null,"",null,null,"","","",""]
[null,null,null,null,null,0.7022901177406311,null,null,null,"","","",null,null,"",null,null,"","","",""]
[null,null,null,null,null,0.26817178726196289,null,null,null,"","","",null,null,"",null,null,"","","",""]
[null,null,null,null,null,0.57534855604171753,null,null,null,"","","",null,null,"",null,null,"","","",""]
[null,null,null,null,null,0.57685291767120361,null,null,null,"","","",null,null,"",null,null,"","","",""]
[null,null,null,null,null,0.99073582887649536,null,null,null,"","","",null,null,"",null,null,"","","",""]
[null,null,null,null,null,0.93139910697937012,null,null,null,"","","",null,null,{"$f":"IF(J204=\"\",\"\",\"-\")","v":""},null,null,{"$f":"IF(N204=\"\",\"\",IF(N204>P204,1,IF(N204<P204,2,\"x\")))","v":""},"","",""]
[null,null,null,null,null,0.24997323751449585,null,null,null,"","","",null,null,"",null,null,"","","",""]
[null,null,null,null,null,0.81005895137786865,null,null,null,"","","",null,null,"",null,null,"","","",""]
[null,null,null,null,null,0.76987749338150024,null,null,null,"","","",null,null,"",null,null,"","","",""]
[null,null,null,null,null,0.40769481658935547,null,null,null,"","","",null,null,"",null,null,"","","",""]
[null,null,null,null,null,0.62992399930953979,null,null,null,"","","",null,null,"",null,null,"","","",""]
[null,null,null,null,null,0.49369299411773682,null,null,null,"","","",null,null,"",null,null,"","","",""]
[null,null,null,null,null,0.49851638078689575,null,null,null,"","","",null,null,"",null,null,"","","",""]
[null,null,null,null,null,0.38256931304931641,null,null,null,"","","",null,null,"",null,null,"","","",""]
[null,null,null,null,null,0.19553488492965698,null,null,null,"","","",null,null,"",null,null,"","","",""]
[null,null,null,null,null,0.32615721225738525,null,null,null,"","","",null,null,"",null,null,"","","",""]
[null,null,null,null,null,0.41323310136795044,null,null,null,"","","",null,null,"",null,null,"","","",""]
[null,null,null,null,null,0.15267682075500488,null,null,null,"","","",null,null,"",null,null,"","","",""]
[null,null,null,null,null,0.61983150243759155,null,null,null,"","","",null,null,"",null,null,"","","",""]
[null,null,null,null,null,9.9409937858581543E-2,null,null,null,"","",{"$f":"IFERROR(VLOOKUP(I218,A:B,2,FALSE),\"\")","v":""},null,null,"",null,null,"","","",""]
[null,null,null,null,null,0.20504719018936157,null,null,null,"","","",null,null,"",null,null,"","","",""]
[null,null,null,null,null,0.69251775741577148,null,null,null,"","","",null,null,"",null,null,"","","",""]
[null,null,null,null,null,0.50445908308029175,null,null,null,"","","",null,null,"",null,null,"","","",""]
[null,null,null,null,null,0.18307602405548096,null,null,null,"","","",null,null,"",null,null,"","","",""]
[null,null,null,null,null,0.99140244722366333,null,null,null,"","","",null,null,"",null,null,"","","",""]
[null,null,null,null,null,0.47139143943786621,null,null,null,"","","",null,null,"",null,null,"","","",""]
[null,null,null,null,null,4.0196776390075684E-3,null,null,null,"","","",null,null,"",null,null,"","","",""]
[null,null,null,null,null,0.4258493185043335,null,null,null,"","","",null,null,"",null,null,"","","",""]
[null,null,null,null,null,0.28871732950210571,null,null,null,"","","",null,null,"",null,null,"","","",""]
[null,null,null,null,null,0.75254249572753906,null,null,null,"","","",null,null,"",null,null,"","","",""]
[null,null,null,null,null,0.89127939939498901,null,null,null,"","","",null,null,"",null,null,"","","",""]
[null,null,null,null,null,0.82193148136138916,null,null,null,"","","",null,null,"",null,null,"","","",""]
[null,null,null,null,null,0.17688685655593872,null,null,null,"","","",null,null,"",null,null,"","","",""]
[null,null,null,null,null,0.10878586769104004,null,null,null,"","","",null,null,"",null,null,"","","",""]
[null,null,null,null,null,1.0293424129486084E-2,null,null,null,"","","",null,null,"",null,null,"","","",""]
[null,null,null,null,null,0.15165698528289795,null,null,null,"","","",null,null,"",null,null,"","","",""]
[null,null,null,null,null,0.37740761041641235,null,null,null,"","","",null,null,"",null,null,"","","",""]
[null,null,null,null,null,0.18813180923461914,null,null,null,"","","",null,null,"",null,null,"","","",""]
[null,null,null,null,null,0.97953099012374878,null,null,null,"","","",null,null,"",null,null,"","","",""]
[null,null,null,null,null,0.87211811542510986,null,null,null,"","","",null,null,"",null,null,"","","",""]
[null,null,null,null,null,0.58150273561477661,null,null,null,"","","",null,null,"",null,null,"","","",""]
[null,null,null,null,null,0.72941088676452637,null,null,null,"","","",null,null,"",null,null,"","","",""]
[null,null,null,null,null,0.1450003981590271,null,null,null,"","","",null,null,"",null,null,"","","",""]
[null,null,null,null,null,0.2577899694442749,null,null,null,"","","",null,null,"",null,null,"","","",""]
[null,null,null,null,null,2.8246939182281494E-2,null,null,null,"","","",null,null,"",null,null,"","","",""]
[null,null,null,null,null,0.82789897918701172,null,null,null,"","","",null,null,"",null,null,"","","",""]
[null,null,null,null,null,0.78337401151657104,null,null,null,"","","",null,null,"",null,null,"","","",""]
[null,null,null,null,null,0.79115545749664307,null,null,null,"","","",null,null,"",null,null,"","","",""]
[null,null,null,null,null,0.332691490650177,null,null,null,"","","",null,null,"",null,null,"","","",""]
[null,null,null,null,null,0.4509422779083252,null,null,null,"","","",null,null,"",null,null,"","","",""]
[null,null,null,null,null,0.55511325597763062,null,null,null,"","","",null,null,"",null,null,"","","",""]
[null,null,null,null,null,0.80333030223846436,null,null,null,"","","",null,null,"",null,null,"","","",""]
[null,null,null,null,null,0.56398922204971313,null,null,null,"","","",null,null,"",null,null,"","","",""]
[null,null,null,null,null,0.2035822868347168,null,null,null,"","","",null,null,"",null,null,"","","",""]
[null,null,null,null,null,0.20759361982345581,null,null,null,"","","",null,null,"",null,null,"","","",""]
[null,null,null,null,null,0.36468803882598877,null,null,null,"","","",null,null,"",null,null,"","","",""]
[null,null,null,null,null,0.57351952791213989,null,null,null,"","","",null,null,"",null,null,"","","",""]
[null,null,null,null,null,0.34418082237243652,null,null,null,"","","",null,null,"",null,null,"","","",""]
[null,null,null,null,null,0.52822965383529663,null,null,null,{"$f":"IFERROR(VLOOKUP(H257,A:B,2,FALSE),\"\")","v":""},"","",null,null,"",null,null,"","","",""]
[null,null,null,null,null,0.42548501491546631,null,null,null,"",{"$f":"IF(J258=\"\",\"\",\"-\")","v":""},"",null,null,"",null,null,"","","",""]
[null,null,null,null,null,0.57301336526870728,null,null,null,"","","",null,null,"",null,null,"",{"$f":"IF(J259=\"\",\"\",(IF(R259=1,3,IF(R259=\"x\",1,0))))","v":""},{"$f":"IF(J259=\"\",\"\",IF(R259=2,3,IF(R259=\"x\",1,0)))","v":""},{"$f":"IF(R259=\"\",\"\",1)","v":""}]
[null,null,null,null,null,5.0045013427734375E-2,null,null,null,"","","",null,null,"",null,null,"","","",""]
[null,null,null,null,null,0.54759997129440308,null,null,null,"","","",null,null,"",null,null,"","","",""]
[null,null,null,null,null,0.20648539066314697,null,null,null,"","","",null,null,"",null,null,"","","",""]
[null,null,null,null,null,0.96267825365066528,null,null,null,"","","",null,null,"",null,null,"","","",""]
[null,null,null,null,null,0.93305230140686035,null,null,null,"","","",null,null,"",null,null,"","","",""]
[null,null,null,null,null,0.99257224798202515,null,null,null,"","","",null,null,"",null,null,"","","",""]
[null,null,null,null,null,0.83958613872528076,null,null,null,"","","",null,null,"",null,null,"","","",""]
[null,null,null,null,null,0.40932327508926392,null,null,null,"","","",null,null,"",null,null,"","","",""]
[null,null,null,null,null,0.80527544021606445,null,null,null,"","","",null,null,{"$f":"IF(J268=\"\",\"\",\"-\")","v":""},null,null,{"$f":"IF(N268=\"\",\"\",IF(N268>P268,1,IF(N268<P268,2,\"x\")))","v":""},"","",""]
[null,null,null,null,null,0.98942822217941284,null,null,null,"","","",null,null,"",null,null,"","","",""]
[null,null,null,null,null,0.25844204425811768,null,null,null,"","","",null,null,"",null,null,"","","",""]
[null,null,null,null,null,0.17448407411575317,null,null,null,"","","",null,null,"",null,null,"","","",""]
[null,null,null,null,null,0.69460749626159668,null,null,null,"","","",null,null,"",null,null,"","","",""]
[null,null,null,null,null,1.6988694667816162E-2,null,null,null,"","","",null,null,"",null,null,"","","",""]
[null,null,null,null,null,0.33909070491790771,null,null,null,"","","",null,null,"",null,null,"","","",""]
[null,null,null,null,null,0.69254785776138306,null,null,null,"","","",null,null,"",null,null,"","","",""]
[null,null,null,null,null,0.11038684844970703,null,null,null,"","","",null,null,"",null,null,"","","",""]
[null,null,null,null,null,0.10973852872848511,null,null,null,"","","",null,null,"",null,null,"","","",""]
[null,null,null,null,null,0.29057753086090088,null,null,null,"","","",null,null,"",null,null,"","","",""]
[null,null,null,null,null,0.39887839555740356,null,null,null,"","","",null,null,"",null,null,"","","",""]
[null,null,null,null,null,0.55902218818664551,null,null,null,"","","",null,null,"",null,null,"","","",""]
[null,null,null,null,null,0.31095165014266968,null,null,null,"","","",null,null,"",null,null,"","","",""]
[null,null,null,null,null,0.29558074474334717,null,null,null,"","",{"$f":"IFERROR(VLOOKUP(I282,A:B,2,FALSE),\"\")","v":""},null,null,"",null,null,"","","",""]
[null,null,null,null,null,0.8079410195350647,null,null,null,"","","",null,null,"",null,null,"","","",""]
[null,null,null,null,null,0.30961751937866211,null,null,null,"","","",null,null,"",null,null,"","","",""]
[null,null,null,null,null,0.37581604719161987,null,null,null,"","","",null,null,"",null,null,"","","",""]
[null,null,null,null,null,0.40103638172149658,null,null,null,"","","",null,null,"",null,null,"","","",""]
[null,null,null,null,null,0.84142762422561646,null,null,null,"","","",null,null,"",null,null,"","","",""]
[null,null,null,null,null,0.40959715843200684,null,null,null,"","","",null,null,"",null,null,"","","",""]
[null,null,null,null,null,0.72455877065658569,null,null,null,"","","",null,null,"",null,null,"","","",""]
[null,null,null,null,null,0.65876328945159912,null,null,null,"","","",null,null,"",null,null,"","","",""]
[null,null,null,null,null,0.40638166666030884,null,null,null,"","","",null,null,"",null,null,"","","",""]
[null,null,null,null,null,0.95033073425292969,null,null,null,"","","",null,null,"",null,null,"","","",""]
[null,null,null,null,null,0.64557093381881714,null,null,null,"","","",null,null,"",null,null,"","","",""]
[null,null,null,null,null,0.51608812808990479,null,null,null,"","","",null,null,"",null,null,"","","",""]
[null,null,null,null,null,0.22332316637039185,null,null,null,"","","",null,null,"",null,null,"","","",""]
[null,null,null,null,null,0.58275818824768066,null,null,null,"","","",null,null,"",null,null,"","","",""]
[null,null,null,null,null,0.74853271245956421,null,null,null,"","","",null,null,"",null,null,"","","",""]
[null,null,null,null,null,0.45647037029266357,null,null,null,"","","",null,null,"",null,null,"","","",""]
[null,null,null,null,null,0.90437370538711548,null,null,null,"","","",null,null,"",null,null,"","","",""]
[null,null,null,null,null,0.28301477432250977,null,null,null,"","","",null,null,"",null,null,"","","",""]
[null,null,null,null,null,0.6675383448600769,null,null,null,"","","",null,null,"",null,null,"","","",""]
[null,null,null,null,null,0.89012730121612549,null,null,null,"","","",null,null,"",null,null,"","","",""]
[null,null,null,null,null,0.28138142824172974,null,null,null,"","","",null,null,"",null,null,"","","",""]
[null,null,null,null,null,0.36805605888366699,null,null,null,"","","",null,null,"",null,null,"","","",""]
[null,null,null,null,null,1.4221131801605225E-2,null,null,null,"","","",null,null,"",null,null,"","","",""]
[null,null,null,null,null,0.29465901851654053,null,null,null,"","","",null,null,"",null,null,"","","",""]
[null,null,null,null,null,0.98404604196548462,null,null,null,"","","",null,null,"",null,null,"","","",""]
[null,null,null,null,null,0.76128292083740234,null,null,null,"","","",null,null,"",null,null,"","","",""]
[null,null,null,null,null,0.58087843656539917,null,null,null,"","","",null,null,"",null,null,"","","",""]
[null,null,null,null,null,0.60567343235015869,null,null,null,"","","",null,null,"",null,null,"","","",""]
[null,null,null,null,null,0.26804381608963013,null,null,null,"","","",null,null,"",null,null,"","","",""]
[null,null,null,null,null,0.50816655158996582,null,null,null,"","","",null,null,"",null,null,"","","",""]
[null,null,null,null,null,0.79359668493270874,null,null,null,"","","",null,null,"",null,null,"","","",""]
[null,null,null,null,null,0.85741126537322998,null,null,null,"","","",null,null,"",null,null,"","","",""]
[null,null,null,null,null,9.315258264541626E-2,null,null,null,"","","",null,null,"",null,null,"","","",""]
[null,null,null,null,null,0.54187345504760742,null,null,null,"","","",null,null,"",null,null,"","","",""]
[null,null,null,null,null,0.41537636518478394,null,null,null,"","","",null,null,"",null,null,"","","",""]
[null,null,null,null,null,7.3371052742004395E-2,null,null,null,"","","",null,null,"",null,null,"","","",""]
[null,null,null,null,null,0.45137673616409302,null,null,null,"","","",null,null,"",null,null,"","","",""]
[null,null,null,null,null,0.69889044761657715,null,null,null,"","","",null,null,"",null,null,"","","",""]
[null,null,null,null,null,0.49925702810287476,null,null,null,{"$f":"IFERROR(VLOOKUP(H321,A:B,2,FALSE),\"\")","v":""},"","",null,null,"",null,null,"","","",""]
[null,null,null,null,null,0.40693414211273193,null,null,null,"",{"$f":"IF(J322=\"\",\"\",\"-\")","v":""},"",null,null,"",null,null,"","","",""]
[null,null,null,null,null,0.9450722336769104,null,null,null,"","","",null,null,"",null,null,"",{"$f":"IF(J323=\"\",\"\",(IF(R323=1,3,IF(R323=\"x\",1,0))))","v":""},{"$f":"IF(J323=\"\",\"\",IF(R323=2,3,IF(R323=\"x\",1,0)))","v":""},{"$f":"IF(R323=\"\",\"\",1)","v":""}]
[null,null,null,null,null,0.984649658203125,null,null,null,"","","",null,null,"",null,null,"","","",""]
[null,null,null,null,null,0.5914422869682312,null,null,null,"","","",null,null,"",null,null,"","","",""]
[null,null,null,null,null,0.5319896936416626,null,null,null,"","","",null,null,"",null,null,"","","",""]
[null,null,null,null,null,0.61507159471511841,null,null,null,"","","",null,null,"",null,null,"","","",""]
[null,null,null,null,null,8.9153528213500977E-2,null,null,null,"","","",null,null,"",null,null,"","","",""]
[null,null,null,null,null,0.18442481756210327,null,null,null,"","","",null,null,"",null,null,"","","",""]
[null,null,null,null,null,0.28355967998504639,null,null,null,"","","",null,null,"",null,null,"","","",""]
[null,null,null,null,null,1.8808901309967041E-2,null,null,null,"","","",null,null,"",null,null,"","","",""]
[null,null,null,null,null,0.15259981155395508,null,null,null,"","","",null,null,{"$f":"IF(J332=\"\",\"\",\"-\")","v":""},null,null,{"$f":"IF(N332=\"\",\"\",IF(N332>P332,1,IF(N332<P332,2,\"x\")))","v":""},"","",""]
[null,null,null,null,null,0.42011135816574097,null,null,null,"","","",null,null,"",null,null,"","","",""]
[null,null,null,null,null,0.5484238862991333,null,null,null,"","","",null,null,"",null,null,"","","",""]
[null,null,null,null,null,0.5584447979927063,null,null,null,"","","",null,null,"",null,null,"","","",""]
[null,null,null,null,null,0.7810065746307373,null,null,null,"","","",null,null,"",null,null,"","","",""]
[null,null,null,null,null,4.2947709560394287E-2,null,null,null,"","","",null,null,"",null,null,"","","",""]
[null,null,null,null,null,0.40574491024017334,null,null,null,"","","",null,null,"",null,null,"","","",""]
[null,null,null,null,null,5.8991491794586182E-2,null,null,null,"","","",null,null,"",null,null,"","","",""]
[null,null,null,null,null,0.31183719635009766,null,null,null,"","","",null,null,"",null,null,"","","",""]
[null,null,null,null,null,0.60304373502731323,null,null,null,"","","",null,null,"",null,null,"","","",""]
[null,null,null,null,null,0.5176931619644165,null,null,null,"","","",null,null,"",null,null,"","","",""]
[null,null,null,null,null,0.59643775224685669,null,null,null,"","","",null,null,"",null,null,"","","",""]
[null,null,null,null,null,0.32962536811828613,null,null,null,"","","",null,null,"",null,null,"","","",""]
[null,null,null,null,null,0.9092983603477478,null,null,null,"","","",null,null,"",null,null,"","","",""]
[null,null,null,null,null,0.77007186412811279,null,null,null,"","",{"$f":"IFERROR(VLOOKUP(I346,A:B,2,FALSE),\"\")","v":""},null,null,"",null,null,"","","",""]
[null,null,null,null,null,0.57587391138076782,null,null,null,"","","",null,null,"",null,null,"","","",""]
[null,null,null,null,null,0.43160009384155273,null,null,null,"","","",null,null,"",null,null,"","","",""]
[null,null,null,null,null,0.732524573802948,null,null,null,"","","",null,null,"",null,null,"","","",""]
[null,null,null,null,null,0.16294205188751221,null,null,null,"","","",null,null,"",null,null,"","","",""]
[null,null,null,null,null,5.961686372756958E-2,null,null,null,"","","",null,null,"",null,null,"","","",""]
[null,null,null,null,null,0.24331068992614746,null,null,null,"","","",null,null,"",null,null,"","","",""]
[null,null,null,null,null,0.75857442617416382,null,null,null,"","","",null,null,"",null,null,"","","",""]
[null,null,null,null,null,0.95124757289886475,null,null,null,"","","",null,null,"",null,null,"","","",""]
[null,null,null,null,null,0.34533506631851196,null,null,null,"","","",null,null,"",null,null,"","","",""]
[null,null,null,null,null,0.68425178527832031,null,null,null,"","","",null,null,"",null,null,"","","",""]
[null,null,null,null,null,0.79146403074264526,null,null,null,"","","",null,null,"",null,null,"","","",""]
[null,null,null,null,null,3.544008731842041E-2,null,null,null,"","","",null,null,"",null,null,"","","",""]
[null,null,null,null,null,0.79417353868484497,null,null,null,"","","",null,null,"",null,null,"","","",""]
[null,null,null,null,null,0.48348832130432129,null,null,null,"","","",null,null,"",null,null,"","","",""]
[null,null,null,null,null,0.20649856328964233,null,null,null,"","","",null,null,"",null,null,"","","",""]
[null,null,null,null,null,0.6021040678024292,null,null,null,"","","",null,null,"",null,null,"","","",""]
[null,null,null,null,null,0.9088788628578186,null,null,null,"","","",null,null,"",null,null,"","","",""]
[null,null,null,null,null,0.94528055191040039,null,null,null,"","","",null,null,"",null,null,"","","",""]
[null,null,null,null,null,0.65339726209640503,null,null,null,"","","",null,null,"",null,null,"","","",""]
[null,null,null,null,null,1.4581799507141113E-2,null,null,null,"","","",null,null,"",null,null,"","","",""]
[null,null,null,null,null,0.66192418336868286,null,null,null,"","","",null,null,"",null,null,"","","",""]
[null,null,null,null,null,0.96470904350280762,null,null,null,"","","",null,null,"",null,null,"","","",""]
[null,null,null,null,null,9.4184279441833496E-3,null,null,null,"","","",null,null,"",null,null,"","","",""]
[null,null,null,null,null,0.95359838008880615,null,null,null,"","","",null,null,"",null,null,"","","",""]
[null,null,null,null,null,7.3634207248687744E-2,null,null,null,"","","",null,null,"",null,null,"","","",""]
[null,null,null,null,null,0.29329967498779297,null,null,null,"","","",null,null,"",null,null,"","","",""]
[null,null,null,null,null,0.58248442411422729,null,null,null,"","","",null,null,"",null,null,"","","",""]
[null,null,null,null,null,0.80788671970367432,null,null,null,"","","",null,null,"",null,null,"","","",""]
[null,null,null,null,null,4.0310204029083252E-2,null,null,null,"","","",null,null,"",null,null,"","","",""]
[null,null,null,null,null,5.4648637771606445E-2,null,null,null,"","","",null,null,"",null,null,"","","",""]
[null,null,null,null,null,0.56430667638778687,null,null,null,"","","",null,null,"",null,null,"","","",""]
[null,null,null,null,null,0.31481254100799561,null,null,null,"","","",null,null,"",null,null,"","","",""]
[null,null,null,null,null,0.41235500574111938,null,null,null,"","","",null,null,"",null,null,"","","",""]
[null,null,null,null,null,0.51004743576049805,null,null,null,"","","",null,null,"",null,null,"","","",""]
[null,null,null,null,null,0.73351067304611206,null,null,null,"","","",null,null,"",null,null,"","","",""]
[null,null,null,null,null,0.45099937915802002,null,null,null,"","","",null,null,"",null,null,"","","",""]
[null,null,null,null,null,0.32239800691604614,null,null,null,"","","",null,null,"",null,null,"","","",""]
[null,null,null,null,null,7.4107885360717773E-2,null,null,null,"","","",null,null,"",null,null,"","","",""]
[null,null,null,null,null,0.40876096487045288,null,null,null,{"$f":"IFERROR(VLOOKUP(H385,A:B,2,FALSE),\"\")","v":""},"","",null,null,"",null,null,"","","",""]
[null,null,null,null,null,0.57295358180999756,null,null,null,"",{"$f":"IF(J386=\"\",\"\",\"-\")","v":""},"",null,null,"",null,null,"","","",""]
[null,null,null,null,null,0.76342016458511353,null,null,null,"","","",null,null,"",null,null,"",{"$f":"IF(J387=\"\",\"\",(IF(R387=1,3,IF(R387=\"x\",1,0))))","v":""},{"$f":"IF(J387=\"\",\"\",IF(R387=2,3,IF(R387=\"x\",1,0)))","v":""},{"$f":"IF(R387=\"\",\"\",1)","v":""}]
[null,null,null,null,null,0.58038711547851563,null,null,null,"","","",null,null,"",null,null,"","","",""]
[null,null,null,null,null,0.65188616514205933,null,null,null,"","","",null,null,"",null,null,"","","",""]
[null,null,null,null,null,0.80768930912017822,null,null,null,"","","",null,null,"",null,null,"","","",""]
[null,null,null,null,null,0.41687899827957153,null,null,null,"","","",null,null,"",null,null,"","","",""]
[null,null,null,null,null,0.7970125675201416,null,null,null,"","","",null,null,"",null,null,"","","",""]
[null,null,null,null,null,0.7210039496421814,null,null,null,"","","",null,null,"",null,null,"","","",""]
[null,null,null,null,null,0.69335353374481201,null,null,null,"","","",null,null,"",null,null,"","","",""]
[null,null,null,null,null,0.73083359003067017,null,null,null,"","","",null,null,"",null,null,"","","",""]
[null,null,null,null,null,0.1923069953918457,null,null,null,"","","",null,null,{"$f":"IF(J396=\"\",\"\",\"-\")","v":""},null,null,{"$f":"IF(N396=\"\",\"\",IF(N396>P396,1,IF(N396<P396,2,\"x\")))","v":""},"","",""]
[null,null,null,null,null,0.77364605665206909,null,null,null,"","","",null,null,"",null,null,"","","",""]
[null,null,null,null,null,6.9851040840148926E-2,null,null,null,"","","",null,null,"",null,null,"","","",""]
[null,null,null,null,null,0.24806958436965942,null,null,null,"","","",null,null,"",null,null,"","","",""]
[null,null,null,null,null,0.95041346549987793,null,null,null,"","","",null,null,"",null,null,"","","",""]
[null,null,null,null,null,0.81988328695297241,null,null,null,"","","",null,null,"",null,null,"","","",""]
[null,null,null,null,null,0.21946942806243896,null,null,null,"","","",null,null,"",null,null,"","","",""]
[null,null,null,null,null,0.18422418832778931,null,null,null,"","","",null,null,"",null,null,"","","",""]
[null,null,null,null,null,0.23692035675048828,null,null,null,"","","",null,null,"",null,null,"","","",""]
[null,null,null,null,null,0.92545050382614136,null,null,null,"","","",null,null,"",null,null,"","","",""]
[null,null,null,null,null,0.25750410556793213,null,null,null,"","","",null,null,"",null,null,"","","",""]
[null,null,null,null,null,0.25591117143630981,null,null,null,"","","",null,null,"",null,null,"","","",""]
[null,null,null,null,null,0.71448636054992676,null,null,null,"","","",null,null,"",null,null,"","","",""]
[null,null,null,null,null,0.66487163305282593,null,null,null,"","","",null,null,"",null,null,"","","",""]
[null,null,null,null,null,0.77288329601287842,null,null,null,"","",{"$f":"IFERROR(VLOOKUP(I410,A:B,2,FALSE),\"\")","v":""},null,null,"",null,null,"","","",""]
[null,null,null,null,null,0.75884586572647095,null,null,null,"","","",null,null,"",null,null,"","","",""]
[null,null,null,null,null,0.30846548080444336,null,null,null,"","","",null,null,"",null,null,"","","",""]
[null,null,null,null,null,0.82458466291427612,null,null,null,"","","",null,null,"",null,null,"","","",""]
[null,null,null,null,null,0.71879303455352783,null,null,null,"","","",null,null,"",null,null,"","","",""]
[null,null,null,null,null,0.89597016572952271,null,null,null,"","","",null,null,"",null,null,"","","",""]
[null,null,null,null,null,0.22253203392028809,null,null,null,"","","",null,null,"",null,null,"","","",""]
[null,null,null,null,null,0.35606664419174194,null,null,null,"","","",null,null,"",null,null,"","","",""]
[null,null,null,null,null,0.55330216884613037,null,null,null,"","","",null,null,"",null,null,"","","",""]
[null,null,null,null,null,0.35557752847671509,null,null,null,"","","",null,null,"",null,null,"","","",""]
[null,null,null,null,null,0.20430564880371094,null,null,null,"","","",null,null,"",null,null,"","","",""]
[null,null,null,null,null,0.57895869016647339,null,null,null,"","","",null,null,"",null,null,"","","",""]
[null,null,null,null,null,null,null,null,null,"","","",null,null,"",null,null,"","","",""]
[null,null,null,null,null,null,null,null,null,"","","",null,null,"",null,null,"","","",""]
[null,null,null,null,null,null,null,null,null,"","","",null,null,"",null,null,"","","",""]
[null,null,null,null,null,null,null,null,null,"","","",null,null,"",null,null,"","","",""]
[null,null,null,null,null,null,null,null,null,"","","",null,null,"",null,null,"","","",""]
[null,null,null,null,null,null,null,null,null,"","","",null,null,"",null,null,"","","",""]
[null,null,null,null,null,null,null,null,null,"","","",null,null,"",null,null,"","","",""]
[null,null,null,null,null,null,null,null,null,"","","",null,null,"",null,null,"","","",""]
[null,null,null,null,null,null,null,null,null,"","","",null,null,"",null,null,"","","",""]
[null,null,null,null,null,null,null,null,null,"","","",null,null,"",null,null,"","","",""]
[null,null,null,null,null,null,null,null,null,"","","",null,null,"",null,null,"","","",""]
[null,null,null,null,null,null,null,null,null,"","","",null,null,"",null,null,"","","",""]
[null,null,null,null,null,null,null,null,null,"","","",null,null,"",null,null,"","","",""]
[null,null,null,null,null,null,null,null,null,"","","",null,null,"",null,null,"","","",""]
[null,null,null,null,null,null,null,null,null,"","","",null,null,"",null,null,"","","",""]
[null,null,null,null,null,null,null,null,null,"","","",null,null,"",null,null,"","","",""]
[null,null,null,null,null,null,null,null,null,"","","",null,null,"",null,null,"","","",""]
[null,null,null,null,null,null,null,null,null,"","","",null,null,"",null,null,"","","",""]
[null,null,null,null,null,null,null,null,null,"","","",null,null,"",null,null,"","","",""]
[null,null,null,null,null,null,null,null,null,"","","",null,null,"",null,null,"","","",""]
[null,null,null,null,null,null,null,null,null,"","","",null,null,"",null,null,"","","",""]
[null,null,null,null,null,null,null,null,null,"","","",null,null,"",null,null,"","","",""]
[null,null,null,null,null,null,null,null,null,"","","",null,null,"",null,null,"","","",""]
[null,null,null,null,null,null,null,null,null,"","","",null,null,"",null,null,"","","",""]
[null,null,null,null,null,null,null,null,null,"","","",null,null,"",null,null,"","","",""]
[null,null,null,null,null,null,null,null,null,"","","",null,null,"",null,null,"","","",""]
[null,null,null,null,null,null,null,null,null,"","","",null,null,"",null,null,"","","",""]
[null,null,null,null,null,null,null,null,null,{"$f":"IFERROR(VLOOKUP(H449,A:B,2,FALSE),\"\")","v":""},"","",null,null,"",null,null,"","","",""]
[null,null,null,null,null,null,null,null,null,"",{"$f":"IF(J450=\"\",\"\",\"-\")","v":""},"",null,null,"",null,null,"","","",""]
[null,null,null,null,null,null,null,null,null,"","","",null,null,"",null,null,"",{"$f":"IF(J451=\"\",\"\",(IF(R451=1,3,IF(R451=\"x\",1,0))))","v":""},{"$f":"IF(J451=\"\",\"\",IF(R451=2,3,IF(R451=\"x\",1,0)))","v":""},{"$f":"IF(R451=\"\",\"\",1)","v":""}]
[null,null,null,null,null,null,null,null,null,"","","",null,null,"",null,null,"","","",""]
[null,null,null,null,null,null,null,null,null,"","","",null,null,"",null,null,"","","",""]
[null,null,null,null,null,null,null,null,null,"","","",null,null,"",null,null,"","","",""]
[null,null,null,null,null,null,null,null,null,"","","",null,null,"",null,null,"","","",""]
[null,null,null,null,null,null,null,null,null,"","","",null,null,"",null,null,"","","",""]
[null,null,null,null,null,null,null,null,null,"","","",null,null,"",null,null,"","","",""]
[null,null,null,null,null,null,null,null,null,"","","",null,null,"",null,null,"","","",""]
[null,null,null,null,null,null,null,null,null,"","","",null,null,"",null,null,"","","",""]
[null,null,null,null,null,null,null,null,null,"","","",null,null,{"$f":"IF(J460=\"\",\"\",\"-\")","v":""},null,null,{"$f":"IF(N460=\"\",\"\",IF(N460>P460,1,IF(N460<P460,2,\"x\")))","v":""},"","",""]
[null,null,null,null,null,null,null,null,null,"","","",null,null,"",null,null,"","","",""]
[null,null,null,null,null,null,null,null,null,"","","",null,null,"",null,null,"","","",""]
[null,null,null,null,null,null,null,null,null,"","","",null,null,"",null,null,"","","",""]
[null,null,null,null,null,null,null,null,null,"","","",null,null,"",null,null,"","","",""]
[null,null,null,null,null,null,null,null,null,"","","",null,null,"",null,null,"","","",""]
[null,null,null,null,null,null,null,null,null,"","","",null,null,"",null,null,"","","",""]
[null,null,null,null,null,null,null,null,null,"","","",null,null,"",null,null,"","","",""]
[null,null,null,null,null,null,null,null,null,"","","",null,null,"",null,null,"","","",""]
[null,null,null,null,null,null,null,null,null,"","","",null,null,"",null,null,"","","",""]
[null,null,null,null,null,null,null,null,null,"","","",null,null,"",null,null,"","","",""]
[null,null,null,null,null,null,null,null,null,"","","",null,null,"",null,null,"","","",""]
[null,null,null,null,null,null,null,null,null,"","","",null,null,"",null,null,"","","",""]
[null,null,null,null,null,null,null,null,null,"","","",null,null,"",null,null,"","","",""]
[null,null,null,null,null,null,null,null,null,"","",{"$f":"IFERROR(VLOOKUP(I474,A:B,2,FALSE),\"\")","v":""},null,null,"",null,null,"","","",""]
[null,null,null,null,null,null,null,null,null,"","","",null,null,"",null,null,"","","",""]
[null,null,null,null,null,null,null,null,null,"","","",null,null,"",null,null,"","","",""]
[null,null,null,null,null,null,null,null,null,"","","",null,null,"",null,null,"","","",""]
[null,null,null,null,null,null,null,null,null,"","","",null,null,"",null,null,"","","",""]
[null,null,null,null,null,null,null,null,null,"","","",null,null,"",null,null,"","","",""]
[null,null,null,null,null,null,null,null,null,"","","",null,null,"",null,null,"","","",""]
[null,null,null,null,null,null,null,null,null,"","","",null,null,"",null,null,"","","",""]
[null,null,null,null,null,null,null,null,null,"","","",null,null,"",null,null,"","","",""]
[null,null,null,null,null,null,null,null,null,"","","",null,null,"",null,null,"","","",""]
[null,null,null,null,null,null,null,null,null,"","","",null,null,"",null,null,"","","",""]
[null,null,null,null,null,null,null,null,null,"","","",null,null,"",null,null,"","","",""]
[null,null,null,null,null,null,null,null,null,"","","",null,null,"",null,null,"","","",""]
[null,null,null,null,null,null,null,null,null,"","","",null,null,"",null,null,"","","",""]
[null,null,null,null,null,null,null,null,null,"","","",null,null,"",null,null,"","","",""]
[null,null,null,null,null,null,null,null,null,"","","",null,null,"",null,null,"","","",""]
[null,null,null,null,null,null,null,null,null,"","","",null,null,"",null,null,"","","",""]
[null,null,null,null,null,null,null,null,null,"","","",null,null,"",null,null,"","","",""]
[null,null,null,null,null,null,null,null,null,"","","",null,null,"",null,null,"","","",""]
[null,null,null,null,null,null,null,null,null,"","","",null,null,"",null,null,"","","",""]
[null,null,null,null,null,null,null,null,null,"","","",null,null,"",null,null,"","","",""]
[null,null,null,null,null,null,null,null,null,"","","",null,null,"",null,null,"","","",""]
[null,null,null,null,null,null,null,null,null,"","","",null,null,"",null,null,"","","",""]
[null,null,null,null,null,null,null,null,null,"","","",null,null,"",null,null,"","","",""]
[null,null,null,null,null,null,null,null,null,"","","",null,null,"",null,null,"","","",""]
[null,null,null,null,null,null,null,null,null,"","","",null,null,"",null,null,"","","",""]
[null,null,null,null,null,null,null,null,null,"","","",null,null,"",null,null,"","","",""]
[null,null,null,null,null,null,null,null,null,"","","",null,null,"",null,null,"","","",""]
[null,null,null,null,null,null,null,null,null,"","","",null,null,"",null,null,"","","",""]
[null,null,null,null,null,null,null,null,null,"","","",null,null,"",null,null,"","","",""]
[null,null,null,null,null,null,null,null,null,"","","",null,null,"",null,null,"","","",""]
[null,null,null,null,null,null,null,null,null,"","","",null,null,"",null,null,"","","",""]
[null,null,null,null,null,null,null,null,null,"","","",null,null,"",null,null,"","","",""]
[null,null,null,null,null,null,null,null,null,"","","",null,null,"",null,null,"","","",""]
[null,null,null,null,null,null,null,null,null,"","","",null,null,"",null,null,"","","",""]
[null,null,null,null,null,null,null,null,null,"","","",null,null,"",null,null,"","","",""]
[null,null,null,null,null,null,null,null,null,"","","",null,null,"",null,null,"","","",""]
[null,null,null,null,null,null,null,null,null,"","","",null,null,"",null,null,"","","",""]
[null,null,null,null,null,null,null,null,null,"","","",null,null,"",null,null,"","","",""]
[null,null,null,null,null,null,null,null,null,{"$f":"IFERROR(VLOOKUP(H513,A:B,2,FALSE),\"\")","v":""},"","",null,null,"",null,null,"","","",""]
[null,null,null,null,null,null,null,null,null,"",{"$f":"IF(J514=\"\",\"\",\"-\")","v":""},"",null,null,"",null,null,"","","",""]
[null,null,null,null,null,null,null,null,null,"","","",null,null,"",null,null,"",{"$f":"IF(J515=\"\",\"\",(IF(R515=1,3,IF(R515=\"x\",1,0))))","v":""},{"$f":"IF(J515=\"\",\"\",IF(R515=2,3,IF(R515=\"x\",1,0)))","v":""},{"$f":"IF(R515=\"\",\"\",1)","v":""}]
[null,null,null,null,null,null,null,null,null,"","","",null,null,"",null,null,"","","",""]
[null,null,null,null,null,null,null,null,null,"","","",null,null,"",null,null,"","","",""]
[null,null,null,null,null,null,null,null,null,"","","",null,null,"",null,null,"","","",""]
[null,null,null,null,null,null,null,null,null,"","","",null,null,"",null,null,"","","",""]
[null,null,null,null,null,null,null,null,null,"","","",null,null,"",null,null,"","","",""]
[null,null,null,null,null,null,null,null,null,"","","",null,null,"",null,null,"","","",""]
[null,null,null,null,null,null,null,null,null,"","","",null,null,"",null,null,"","","",""]
[null,null,null,null,null,null,null,null,null,"","","",null,null,"",null,null,"","","",""]
[null,null,null,null,null,null,null,null,null,"","","",null,null,{"$f":"IF(J524=\"\",\"\",\"-\")","v":""},null,null,{"$f":"IF(N524=\"\",\"\",IF(N524>P524,1,IF(N524<P524,2,\"x\")))","v":""},"","",""]
[null,null,null,null,null,null,null,null,null,"","","",null,null,"",null,null,"","","",""]
[null,null,null,null,null,null,null,null,null,"","","",null,null,"",null,null,"","","",""]
[null,null,null,null,null,null,null,null,null,"","","",null,null,"",null,null,"","","",""]
[null,null,null,null,null,null,null,null,null,"","","",null,null,"",null,null,"","","",""]
[null,null,null,null,null,null,null,null,null,"","","",null,null,"",null,null,"","","",""]
[null,null,null,null,null,null,null,null,null,"","","",null,null,"",null,null,"","","",""]
[null,null,null,null,null,null,null,null,null,"","","",null,null,"",null,null,"","","",""]
[null,null,null,null,null,null,null,null,null,"","","",null,null,"",null,null,"","","",""]
[null,null,null,null,null,null,null,null,null,"","","",null,null,"",null,null,"","","",""]
[null,null,null,null,null,null,null,null,null,"","","",null,null,"",null,null,"","","",""]
[null,null,null,null,null,null,null,null,null,"","","",null,null,"",null,null,"","","",""]
[null,null,null,null,null,null,null,null,null,"","","",null,null,"",null,null,"","","",""]
[null,null,null,null,null,null,null,null,null,"","","",null,null,"",null,null,"","","",""]
[null,null,null,null,null,null,null,null,null,"","",{"$f":"IFERROR(VLOOKUP(I538,A:B,2,FALSE),\"\")","v":""},null,null,"",null,null,"","","",""]
[null,null,null,null,null,null,null,null,null,"","","",null,null,"",null,null,"","","",""]
[null,null,null,null,null,null,null,null,null,"","","",null,null,"",null,null,"","","",""]
[null,null,null,null,null,null,null,null,null,"","","",null,null,"",null,null,"","","",""]
[null,null,null,null,null,null,null,null,null,"","","",null,null,"",null,null,"","","",""]
[null,null,null,null,null,null,null,null,null,"","","",null,null,"",null,null,"","","",""]
[null,null,null,null,null,null,null,null,null,"","","",null,null,"",null,null,"","","",""]
[null,null,null,null,null,null,null,null,null,"","","",null,null,"",null,null,"","","",""]
[null,null,null,null,null,null,null,null,null,"","","",null,null,"",null,null,"","","",""]
[null,null,null,null,null,null,null,null,null,"","","",null,null,"",null,null,"","","",""]
[null,null,null,null,null,null,null,null,null,"","","",null,null,"",null,null,"","","",""]
[null,null,null,null,null,null,null,null,null,"","","",null,null,"",null,null,"","","",""]
[null,null,null,null,null,null,null,null,null,"","","",null,null,"",null,null,"","","",""]
[null,null,null,null,null,null,null,null,null,"","","",null,null,"",null,null,"","","",""]
[null,null,null,null,null,null,null,null,null,"","","",null,null,"",null,null,"","","",""]
[null,null,null,null,null,null,null,null,null,"","","",null,null,"",null,null,"","","",""]
[null,null,null,null,null,null,null,null,null,"","","",null,null,"",null,null,"","","",""]
[null,null,null,null,null,null,null,null,null,"","","",null,null,"",null,null,"","","",""]
[null,null,null,null,null,null,null,null,null,"","","",null,null,"",null,null,"","","",""]
[null,null,null,null,null,null,null,null,null,"","","",null,null,"",null,null,"","","",""]
[null,null,null,null,null,null,null,null,null,"","","",null,null,"",null,null,"","","",""]
[null,null,null,null,null,null,null,null,null,"","","",null,null,"",null,null,"","","",""]
[null,null,null,null,null,null,null,null,null,"","","",null,null,"",null,null,"","","",""]
[null,null,null,null,null,null,null,null,null,"","","",null,null,"",null,null,"","","",""]
[null,null,null,null,null,null,null,null,null,"","","",null,null,"",null,null,"","","",""]
[null,null,null,null,null,null,null,null,null,"","","",null,null,"",null,null,"","","",""]
[null,null,null,null,null,null,null,null,null,"","","",null,null,"",null,null,"","","",""]
[null,null,null,null,null,null,null,null,null,"","","",null,null,"",null,null,"","","",""]
[null,null,null,null,null,null,null,null,null,"","","",null,null,"",null,null,"","","",""]
[null,null,null,null,null,null,null,null,null,"","","",null,null,"",null,null,"","","",""]
[null,null,null,null,null,null,null,null,null,"","","",null,null,"",null,null,"","","",""]
[null,null,null,null,null,null,null,null,null,"","","",null,null,"",null,null,"","","",""]
[null,null,null,null,null,null,null,null,null,"","","",null,null,"",null,null,"","","",""]
[null,null,null,null,null,null,null,null,null,"","","",null,null,"",null,null,"","","",""]
[null,null,null,null,null,null,null,null,null,"","","",null,null,"",null,null,"","","",""]
[null,null,null,null,null,null,null,null,null,"","","",null,null,"",null,null,"","","",""]
[null,null,null,null,null,null,null,null,null,"","","",null,null,"",null,null,"","","",""]
[null,null,null,null,null,null,null,null,null,"","","",null,null,"",null,null,"","","",""]
[null,null,null,null,null,null,null,null,null,"","","",null,null,"",null,null,"","","",""]
[null,null,null,null,null,null,null,null,null,{"$f":"IFERROR(VLOOKUP(H577,A:B,2,FALSE),\"\")","v":""},"","",null,null,"",null,null,"","","",""]
[null,null,null,null,null,null,null,null,null,"",{"$f":"IF(J578=\"\",\"\",\"-\")","v":""},"",null,null,"",null,null,"","","",""]
[null,null,null,null,null,null,null,null,null,"","","",null,null,"",null,null,"",{"$f":"IF(J579=\"\",\"\",(IF(R579=1,3,IF(R579=\"x\",1,0))))","v":""},{"$f":"IF(J579=\"\",\"\",IF(R579=2,3,IF(R579=\"x\",1,0)))","v":""},{"$f":"IF(R579=\"\",\"\",1)","v":""}]
[null,null,null,null,null,null,null,null,null,"","","",null,null,"",null,null,"","","",""]
[null,null,null,null,null,null,null,null,null,"","","",null,null,"",null,null,"","","",""]
[null,null,null,null,null,null,null,null,null,"","","",null,null,"",null,null,"","","",""]
[null,null,null,null,null,null,null,null,null,"","","",null,null,"",null,null,"","","",""]
[null,null,null,null,null,null,null,null,null,"","","",null,null,"",null,null,"","","",""]
[null,null,null,null,null,null,null,null,null,"","","",null,null,"",null,null,"","","",""]
[null,null,null,null,null,null,null,null,null,"","","",null,null,"",null,null,"","","",""]
[null,null,null,null,null,null,null,null,null,"","","",null,null,"",null,null,"","","",""]
[null,null,null,null,null,null,null,null,null,"","","",null,null,{"$f":"IF(J588=\"\",\"\",\"-\")","v":""},null,null,{"$f":"IF(N588=\"\",\"\",IF(N588>P588,1,IF(N588<P588,2,\"x\")))","v":""},"","",""]
[null,null,null,null,null,null,null,null,null,"","","",null,null,"",null,null,"","","",""]
[null,null,null,null,null,null,null,null,null,"","","",null,null,"",null,null,"","","",""]
[null,null,null,null,null,null,null,null,null,"","","",null,null,"",null,null,"","","",""]
[null,null,null,null,null,null,null,null,null,"","","",null,null,"",null,null,"","","",""]
[null,null,null,null,null,null,null,null,null,"","","",null,null,"",null,null,"","","",""]
[null,null,null,null,null,null,null,null,null,"","","",null,null,"",null,null,"","","",""]
[null,null,null,null,null,null,null,null,null,"","","",null,null,"",null,null,"","","",""]
[null,null,null,null,null,null,null,null,null,"","","",null,null,"",null,null,"","","",""]
[null,null,null,null,null,null,null,null,null,"","","",null,null,"",null,null,"","","",""]
[null,null,null,null,null,null,null,null,null,"","","",null,null,"",null,null,"","","",""]
[null,null,null,null,null,null,null,null,null,"","","",null,null,"",null,null,"","","",""]
[null,null,null,null,null,null,null,null,null,"","","",null,null,"",null,null,"","","",""]
[null,null,null,null,null,null,null,null,null,"","","",null,null,"",null,null,"","","",""]
[null,null,null,null,null,null,null,null,null,"","",{"$f":"IFERROR(VLOOKUP(I602,A:B,2,FALSE),\"\")","v":""},null,null,"",null,null,"","","",""]
[null,null,null,null,null,null,null,null,null,"","","",null,null,"",null,null,"","","",""]
[null,null,null,null,null,null,null,null,null,"","","",null,null,"",null,null,"","","",""]
[null,null,null,null,null,null,null,null,null,"","","",null,null,"",null,null,"","","",""]
[null,null,null,null,null,null,null,null,null,"","","",null,null,"",null,null,"","","",""]
[null,null,null,null,null,null,null,null,null,"","","",null,null,"",null,null,"","","",""]
[null,null,null,null,null,null,null,null,null,"","","",null,null,"",null,null,"","","",""]
[null,null,null,null,null,null,null,null,null,"","","",null,null,"",null,null,"","","",""]
[null,null,null,null,null,null,null,null,null,"","","",null,null,"",null,null,"","","",""]
[null,null,null,null,null,null,null,null,null,"","","",null,null,"",null,null,"","","",""]
[null,null,null,null,null,null,null,null,null,"","","",null,null,"",null,null,"","","",""]
[null,null,null,null,null,null,null,null,null,"","","",null,null,"",null,null,"","","",""]
[null,null,null,null,null,null,null,null,null,"","","",null,null,"",null,null,"","","",""]
[null,null,null,null,null,null,null,null,null,"","","",null,null,"",null,null,"","","",""]
[null,null,null,null,null,null,null,null,null,"","","",null,null,"",null,null,"","","",""]
[null,null,null,null,null,null,null,null,null,"","","",null,null,"",null,null,"","","",""]
[null,null,null,null,null,null,null,null,null,"","","",null,null,"",null,null,"","","",""]
[null,null,null,null,null,null,null,null,null,"","","",null,null,"",null,null,"","","",""]
[null,null,null,null,null,null,null,null,null,"","","",null,null,"",null,null,"","","",""]
[null,null,null,null,null,null,null,null,null,"","","",null,null,"",null,null,"","","",""]
[null,null,null,null,null,null,null,null,null,"","","",null,null,"",null,null,"","","",""]
[null,null,null,null,null,null,null,null,null,"","","",null,null,"",null,null,"","","",""]
[null,null,null,null,null,null,null,null,null,"","","",null,null,"",null,null,"","","",""]
[null,null,null,null,null,null,null,null,null,"","","",null,null,"",null,null,"","","",""]
[null,null,null,null,null,null,null,null,null,"","","",null,null,"",null,null,"","","",""]
[null,null,null,null,null,null,null,null,null,"","","",null,null,"",null,null,"","","",""]
[null,null,null,null,null,null,null,null,null,"","","",null,null,"",null,null,"","","",""]
[null,null,null,null,null,null,null,null,null,"","","",null,null,"",null,null,"","","",""]
[null,null,null,null,null,null,null,null,null,"","","",null,null,"",null,null,"","","",""]
[null,null,null,null,null,null,null,null,null,"","","",null,null,"",null,null,"","","",""]
[null,null,null,null,null,null,null,null,null,"","","",null,null,"",null,null,"","","",""]
[null,null,null,null,null,null,null,null,null,"","","",null,null,"",null,null,"","","",""]
[null,null,null,null,null,null,null,null,null,"","","",null,null,"",null,null,"","","",""]
[null,null,null,null,null,null,null,null,null,"","","",null,null,"",null,null,"","","",""]
[null,null,null,null,null,null,null,null,null,"","","",null,null,"",null,null,"","","",""]
[null,null,null,null,null,null,null,null,null,"","","",null,null,"",null,null,"","","",""]
[null,null,null,null,null,null,null,null,null,"","","",null,null,"",null,null,"","","",""]
[null,null,null,null,null,null,null,null,null,"","","",null,null,"",null,null,"","","",""]
[null,null,null,null,null,null,null,null,null,"","","",null,null,"",null,null,"","","",""]
[null,null,null,null,null,null,null,null,null,{"$f":"IFERROR(VLOOKUP(H641,A:B,2,FALSE),\"\")","v":""},"","",null,null,"",null,null,"","","",""]
[null,null,null,null,null,null,null,null,null,"",{"$f":"IF(J642=\"\",\"\",\"-\")","v":""},"",null,null,"",null,null,"","","",""]
[null,null,null,null,null,null,null,null,null,"","","",null,null,"",null,null,"",{"$f":"IF(J643=\"\",\"\",(IF(R643=1,3,IF(R643=\"x\",1,0))))","v":""},{"$f":"IF(J643=\"\",\"\",IF(R643=2,3,IF(R643=\"x\",1,0)))","v":""},{"$f":"IF(R643=\"\",\"\",1)","v":""}]
[null,null,null,null,null,null,null,null,null,"","","",null,null,"",null,null,"","","",""]
[null,null,null,null,null,null,null,null,null,"","","",null,null,"",null,null,"","","",""]
[null,null,null,null,null,null,null,null,null,"","","",null,null,"",null,null,"","","",""]
[null,null,null,null,null,null,null,null,null,"","","",null,null,"",null,null,"","","",""]
[null,null,null,null,null,null,null,null,null,"","","",null,null,"",null,null,"","","",""]
[null,null,null,null,null,null,null,null,null,"","","",null,null,"",null,null,"","","",""]
[null,null,null,null,null,null,null,null,null,"","","",null,null,"",null,null,"","","",""]
[null,null,null,null,null,null,null,null,null,"","","",null,null,"",null,null,"","","",""]
[null,null,null,null,null,null,null,null,null,"","","",null,null,{"$f":"IF(J652=\"\",\"\",\"-\")","v":""},null,null,{"$f":"IF(N652=\"\",\"\",IF(N652>P652,1,IF(N652<P652,2,\"x\")))","v":""},"","",""]
[null,null,null,null,null,null,null,null,null,"","","",null,null,"",null,null,"","","",""]
[null,null,null,null,null,null,null,null,null,"","","",null,null,"",null,null,"","","",""]
[null,null,null,null,null,null,null,null,null,"","","",null,null,"",null,null,"","","",""]
[null,null,null,null,null,null,null,null,null,"","","",null,null,"",null,null,"","","",""]
[null,null,null,null,null,null,null,null,null,"","","",null,null,"",null,null,"","","",""]
[null,null,null,null,null,null,null,null,null,"","","",null,null,"",null,null,"","","",""]
[null,null,null,null,null,null,null,null,null,"","","",null,null,"",null,null,"","","",""]
[null,null,null,null,null,null,null,null,null,"","","",null,null,"",null,null,"","","",""]
[null,null,null,null,null,null,null,null,null,"","","",null,null,"",null,null,"","","",""]
[null,null,null,null,null,null,null,null,null,"","","",null,null,"",null,null,"","","",""]
[null,null,null,null,null,null,null,null,null,"","","",null,null,"",null,null,"","","",""]
[null,null,null,null,null,null,null,null,null,"","","",null,null,"",null,null,"","","",""]
[null,null,null,null,null,null,null,null,null,"","","",null,null,"",null,null,"","","",""]
[null,null,null,null,null,null,null,null,null,"","",{"$f":"IFERROR(VLOOKUP(I666,A:B,2,FALSE),\"\")","v":""},null,null,"",null,null,"","","",""]
[null,null,null,null,null,null,null,null,null,"","","",null,null,"",null,null,"","","",""]
[null,null,null,null,null,null,null,null,null,"","","",null,null,"",null,null,"","","",""]
[null,null,null,null,null,null,null,null,null,"","","",null,null,"",null,null,"","","",""]
[null,null,null,null,null,null,null,null,null,"","","",null,null,"",null,null,"","","",""]
[null,null,null,null,null,null,null,null,null,"","","",null,null,"",null,null,"","","",""]
[null,null,null,null,null,null,null,null,null,"","","",null,null,"",null,null,"","","",""]
[null,null,null,null,null,null,null,null,null,"","","",null,null,"",null,null,"","","",""]
[null,null,null,null,null,null,null,null,null,"","","",null,null,"",null,null,"","","",""]
[null,null,null,null,null,null,null,null,null,"","","",null,null,"",null,null,"","","",""]
[null,null,null,null,null,null,null,null,null,"","","",null,null,"",null,null,"","","",""]
[null,null,null,null,null,null,null,null,null,"","","",null,null,"",null,null,"","","",""]
[null,null,null,null,null,null,null,null,null,"","","",null,null,"",null,null,"","","",""]
[null,null,null,null,null,null,null,null,null,"","","",null,null,"",null,null,"","","",""]
[null,null,null,null,null,null,null,null,null,"","","",null,null,"",null,null,"","","",""]
[null,null,null,null,null,null,null,null,null,"","","",null,null,"",null,null,"","","",""]
[null,null,null,null,null,null,null,null,null,"","","",null,null,"",null,null,"","","",""]
[null,null,null,null,null,null,null,null,null,"","","",null,null,"",null,null,"","","",""]
[null,null,null,null,null,null,null,null,null,"","","",null,null,"",null,null,"","","",""]
[null,null,null,null,null,null,null,null,null,"","","",null,null,"",null,null,"","","",""]
[null,null,null,null,null,null,null,null,null,"","","",null,null,"",null,null,"","","",""]
[null,null,null,null,null,null,null,null,null,"","","",null,null,"",null,null,"","","",""]
[null,null,null,null,null,null,null,null,null,"","","",null,null,"",null,null,"","","",""]
[null,null,null,null,null,null,null,null,null,"","","",null,null,"",null,null,"","","",""]
[null,null,null,null,null,null,null,null,null,"","","",null,null,"",null,null,"","","",""]
[null,null,null,null,null,null,null,null,null,"","","",null,null,"",null,null,"","","",""]
[null,null,null,null,null,null,null,null,null,"","","",null,null,"",null,null,"","","",""]
[null,null,null,null,null,null,null,null,null,"","","",null,null,"",null,null,"","","",""]
[null,null,null,null,null,null,null,null,null,"","","",null,null,"",null,null,"","","",""]
[null,null,null,null,null,null,null,null,null,"","","",null,null,"",null,null,"","","",""]
[null,null,null,null,null,null,null,null,null,"","","",null,null,"",null,null,"","","",""]
[null,null,null,null,null,null,null,null,null,"","","",null,null,"",null,null,"","","",""]
[null,null,null,null,null,null,null,null,null,"","","",null,null,"",null,null,"","","",""]
[null,null,null,null,null,null,null,null,null,"","","",null,null,"",null,null,"","","",""]
[null,null,null,null,null,null,null,null,null,"","","",null,null,"",null,null,"","","",""]
[null,null,null,null,null,null,null,null,null,"","","",null,null,"",null,null,"","","",""]
[null,null,null,null,null,null,null,null,null,"","","",null,null,"",null,null,"","","",""]
[null,null,null,null,null,null,null,null,null,"","","",null,null,"",null,null,"","","",""]
[null,null,null,null,null,null,null,null,null,"","","",null,null,"",null,null,"","","",""]
[null,null,null,null,null,null,null,null,null,{"$f":"IFERROR(VLOOKUP(H705,A:B,2,FALSE),\"\")","v":""},"","",null,null,"",null,null,"","","",""]
[null,null,null,null,null,null,null,null,null,"",{"$f":"IF(J706=\"\",\"\",\"-\")","v":""},"",null,null,"",null,null,"","","",""]
[null,null,null,null,null,null,null,null,null,"","","",null,null,"",null,null,"",{"$f":"IF(J707=\"\",\"\",(IF(R707=1,3,IF(R707=\"x\",1,0))))","v":""},{"$f":"IF(J707=\"\",\"\",IF(R707=2,3,IF(R707=\"x\",1,0)))","v":""},{"$f":"IF(R707=\"\",\"\",1)","v":""}]
[null,null,null,null,null,null,null,null,null,"","","",null,null,"",null,null,"","","",""]
[null,null,null,null,null,null,null,null,null,"","","",null,null,"",null,null,"","","",""]
[null,null,null,null,null,null,null,null,null,"","","",null,null,"",null,null,"","","",""]
[null,null,null,null,null,null,null,null,null,"","","",null,null,"",null,null,"","","",""]
[null,null,null,null,null,null,null,null,null,"","","",null,null,"",null,null,"","","",""]
[null,null,null,null,null,null,null,null,null,"","","",null,null,"",null,null,"","","",""]
[null,null,null,null,null,null,null,null,null,"","","",null,null,"",null,null,"","","",""]
[null,null,null,null,null,null,null,null,null,"","","",null,null,"",null,null,"","","",""]
[null,null,null,null,null,null,null,null,null,"","","",null,null,{"$f":"IF(J716=\"\",\"\",\"-\")","v":""},null,null,{"$f":"IF(N716=\"\",\"\",IF(N716>P716,1,IF(N716<P716,2,\"x\")))","v":""},"","",""]
[null,null,null,null,null,null,null,null,null,"","","",null,null,"",null,null,"","","",""]
[null,null,null,null,null,null,null,null,null,"","","",null,null,"",null,null,"","","",""]
[null,null,null,null,null,null,null,null,null,"","","",null,null,"",null,null,"","","",""]
[null,null,null,null,null,null,null,null,null,"","","",null,null,"",null,null,"","","",""]
[null,null,null,null,null,null,null,null,null,"","","",null,null,"",null,null,"","","",""]
[null,null,null,null,null,null,null,null,null,"","","",null,null,"",null,null,"","","",""]
[null,null,null,null,null,null,null,null,null,"","","",null,null,"",null,null,"","","",""]
[null,null,null,null,null,null,null,null,null,"","","",null,null,"",null,null,"","","",""]
[null,null,null,null,null,null,null,null,null,"","","",null,null,"",null,null,"","","",""]
[null,null,null,null,null,null,null,null,null,"","","",null,null,"",null,null,"","","",""]
[null,null,null,null,null,null,null,null,null,"","","",null,null,"",null,null,"","","",""]
[null,null,null,null,null,null,null,null,null,"","","",null,null,"",null,null,"","","",""]
[null,null,null,null,null,null,null,null,null,"","","",null,null,"",null,null,"","","",""]
[null,null,null,null,null,null,null,null,null,"","",{"$f":"IFERROR(VLOOKUP(I730,A:B,2,FALSE),\"\")","v":""},null,null,"",null,null,"","","",""]
[null,null,null,null,null,null,null,null,null,"","","",null,null,"",null,null,"","","",""]
[null,null,null,null,null,null,null,null,null,"","","",null,null,"",null,null,"","","",""]
[null,null,null,null,null,null,null,null,null,"","","",null,null,"",null,null,"","","",""]
[null,null,null,null,null,null,null,null,null,"","","",null,null,"",null,null,"","","",""]
[null,null,null,null,null,null,null,null,null,"","","",null,null,"",null,null,"","","",""]
[null,null,null,null,null,null,null,null,null,"","","",null,null,"",null,null,"","","",""]
[null,null,null,null,null,null,null,null,null,"","","",null,null,"",null,null,"","","",""]
[null,null,null,null,null,null,null,null,null,"","","",null,null,"",null,null,"","","",""]
[null,null,null,null,null,null,null,null,null,"","","",null,null,"",null,null,"","","",""]
[null,null,null,null,null,null,null,null,null,"","","",null,null,"",null,null,"","","",""]
[null,null,null,null,null,null,null,null,null,"","","",null,null,"",null,null,"","","",""]
[null,null,null,null,null,null,null,null,null,"","","",null,null,"",null,null,"","","",""]
[null,null,null,null,null,null,null,null,null,"","","",null,null,"",null,null,"","","",""]
[null,null,null,null,null,null,null,null,null,"","","",null,null,"",null,null,"","","",""]
[null,null,null,null,null,null,null,null,null,"","","",null,null,"",null,null,"","","",""]
[null,null,null,null,null,null,null,null,null,"","","",null,null,"",null,null,"","","",""]
[null,null,null,null,null,null,null,null,null,"","","",null,null,"",null,null,"","","",""]
[null,null,null,null,null,null,null,null,null,"","","",null,null,"",null,null,"","","",""]
[null,null,null,null,null,null,null,null,null,"","","",null,null,"",null,null,"","","",""]
[null,null,null,null,null,null,null,null,null,"","","",null,null,"",null,null,"","","",""]
[null,null,null,null,null,null,null,null,null,"","","",null,null,"",null,null,"","","",""]
[null,null,null,null,null,null,null,null,null,"","","",null,null,"",null,null,"","","",""]
[null,null,null,null,null,null,null,null,null,"","","",null,null,"",null,null,"","","",""]
[null,null,null,null,null,null,null,null,null,"","","",null,null,"",null,null,"","","",""]
[null,null,null,null,null,null,null,null,null,"","","",null,null,"",null,null,"","","",""]
[null,null,null,null,null,null,null,null,null,"","","",null,null,"",null,null,"","","",""]
[null,null,null,null,null,null,null,null,null,"","","",null,null,"",null,null,"","","",""]
[null,null,null,null,null,null,null,null,null,"","","",null,null,"",null,null,"","","",""]
[null,null,null,null,null,null,null,null,null,"","","",null,null,"",null,null,"","","",""]
[null,null,null,null,null,null,null,null,null,"","","",null,null,"",null,null,"","","",""]
[null,null,null,null,null,null,null,null,null,"","","",null,null,"",null,null,"","","",""]
[null,null,null,null,null,null,null,null,null,"","","",null,null,"",null,null,"","","",""]
[null,null,null,null,null,null,null,null,null,"","","",null,null,"",null,null,"","","",""]
[null,null,null,null,null,null,null,null,null,"","","",null,null,"",null,null,"","","",""]
[null,null,null,null,null,null,null,null,null,"","","",null,null,"",null,null,"","","",""]
[null,null,null,null,null,null,null,null,null,"","","",null,null,"",null,null,"","","",""]
[null,null,null,null,null,null,null,null,null,"","","",null,null,"",null,null,"","","",""]
[null,null,null,null,null,null,null,null,null,"","","",null,null,"",null,null,"","","",""]
[null,null,null,null,null,null,null,null,null,{"$f":"IFERROR(VLOOKUP(H769,A:B,2,FALSE),\"\")","v":""},"","",null,null,"",null,null,"","","",""]
[null,null,null,null,null,null,null,null,null,"",{"$f":"IF(J770=\"\",\"\",\"-\")","v":""},"",null,null,"",null,null,"","","",""]
[null,null,null,null,null,null,null,null,null,"","","",null,null,"",null,null,"",{"$f":"IF(J771=\"\",\"\",(IF(R771=1,3,IF(R771=\"x\",1,0))))","v":""},{"$f":"IF(J771=\"\",\"\",IF(R771=2,3,IF(R771=\"x\",1,0)))","v":""},{"$f":"IF(R771=\"\",\"\",1)","v":""}]
[null,null,null,null,null,null,null,null,null,"","","",null,null,"",null,null,"","","",""]
[null,null,null,null,null,null,null,null,null,"","","",null,null,"",null,null,"","","",""]
[null,null,null,null,null,null,null,null,null,"","","",null,null,"",null,null,"","","",""]
[null,null,null,null,null,null,null,null,null,"","","",null,null,"",null,null,"","","",""]
[null,null,null,null,null,null,null,null,null,"","","",null,null,"",null,null,"","","",""]
[null,null,null,null,null,null,null,null,null,"","","",null,null,"",null,null,"","","",""]
[null,null,null,null,null,null,null,null,null,"","","",null,null,"",null,null,"","","",""]
[null,null,null,null,null,null,null,null,null,"","","",null,null,"",null,null,"","","",""]
[null,null,null,null,null,null,null,null,null,"","","",null,null,{"$f":"IF(J780=\"\",\"\",\"-\")","v":""},null,null,{"$f":"IF(N780=\"\",\"\",IF(N780>P780,1,IF(N780<P780,2,\"x\")))","v":""},"","",""]
[null,null,null,null,null,null,null,null,null,"","","",null,null,"",null,null,"","","",""]
[null,null,null,null,null,null,null,null,null,"","","",null,null,"",null,null,"","","",""]
[null,null,null,null,null,null,null,null,null,"","","",null,null,"",null,null,"","","",""]
[null,null,null,null,null,null,null,null,null,"","","",null,null,"",null,null,"","","",""]
[null,null,null,null,null,null,null,null,null,"","","",null,null,"",null,null,"","","",""]
[null,null,null,null,null,null,null,null,null,"","","",null,null,"",null,null,"","","",""]
[null,null,null,null,null,null,null,null,null,"","","",null,null,"",null,null,"","","",""]
[null,null,null,null,null,null,null,null,null,"","","",null,null,"",null,null,"","","",""]
[null,null,null,null,null,null,null,null,null,"","","",null,null,"",null,null,"","","",""]
[null,null,null,null,null,null,null,null,null,"","","",null,null,"",null,null,"","","",""]
[null,null,null,null,null,null,null,null,null,"","","",null,null,"",null,null,"","","",""]
[null,null,null,null,null,null,null,null,null,"","","",null,null,"",null,null,"","","",""]
[null,null,null,null,null,null,null,null,null,"","","",null,null,"",null,null,"","","",""]
[null,null,null,null,null,null,null,null,null,"","",{"$f":"IFERROR(VLOOKUP(I794,A:B,2,FALSE),\"\")","v":""},null,null,"",null,null,"","","",""]
[null,null,null,null,null,null,null,null,null,"","","",null,null,"",null,null,"","","",""]
[null,null,null,null,null,null,null,null,null,"","","",null,null,"",null,null,"","","",""]
[null,null,null,null,null,null,null,null,null,"","","",null,null,"",null,null,"","","",""]
[null,null,null,null,null,null,null,null,null,"","","",null,null,"",null,null,"","","",""]
[null,null,null,null,null,null,null,null,null,"","","",null,null,"",null,null,"","","",""]
[null,null,null,null,null,null,null,null,null,"","","",null,null,"",null,null,"","","",""]
[null,null,null,null,null,null,null,null,null,"","","",null,null,"",null,null,"","","",""]
[null,null,null,null,null,null,null,null,null,"","","",null,null,"",null,null,"","","",""]
[null,null,null,null,null,null,null,null,null,"","","",null,null,"",null,null,"","","",""]
[null,null,null,null,null,null,null,null,null,"","","",null,null,"",null,null,"","","",""]
[null,null,null,null,null,null,null,null,null,"","","",null,null,"",null,null,"","","",""]
[null,null,null,null,null,null,null,null,null,"","","",null,null,"",null,null,"","","",""]
[null,null,null,null,null,null,null,null,null,"","","",null,null,"",null,null,"","","",""]
[null,null,null,null,null,null,null,null,null,"","","",null,null,"",null,null,"","","",""]
[null,null,null,null,null,null,null,null,null,"","","",null,null,"",null,null,"","","",""]
[null,null,null,null,null,null,null,null,null,"","","",null,null,"",null,null,"","","",""]
[null,null,null,null,null,null,null,null,null,"","","",null,null,"",null,null,"","","",""]
[null,null,null,null,null,null,null,null,null,"","","",null,null,"",null,null,"","","",""]
[null,null,null,null,null,null,null,null,null,"","","",null,null,"",null,null,"","","",""]
[null,null,null,null,null,null,null,null,null,"","","",null,null,"",null,null,"","","",""]
[null,null,null,null,null,null,null,null,null,"","","",null,null,"",null,null,"","","",""]
[null,null,null,null,null,null,null,null,null,"","","",null,null,"",null,null,"","","",""]
[null,null,null,null,null,null,null,null,null,"","","",null,null,"",null,null,"","","",""]
[null,null,null,null,null,null,null,null,null,"","","",null,null,"",null,null,"","","",""]
[null,null,null,null,null,null,null,null,null,"","","",null,null,"",null,null,"","","",""]
[null,null,null,null,null,null,null,null,null,"","","",null,null,"",null,null,"","","",""]
[null,null,null,null,null,null,null,null,null,"","","",null,null,"",null,null,"","","",""]
[null,null,null,null,null,null,null,null,null,"","","",null,null,"",null,null,"","","",""]
[null,null,null,null,null,null,null,null,null,"","","",null,null,"",null,null,"","","",""]
[null,null,null,null,null,null,null,null,null,"","","",null,null,"",null,null,"","","",""]
[null,null,null,null,null,null,null,null,null,"","","",null,null,"",null,null,"","","",""]
[null,null,null,null,null,null,null,null,null,"","","",null,null,"",null,null,"","","",""]
[null,null,null,null,null,null,null,null,null,"","","",null,null,"",null,null,"","","",""]
[null,null,null,null,null,null,null,null,null,"","","",null,null,"",null,null,"","","",""]
[null,null,null,null,null,null,null,null,null,"","","",null,null,"",null,null,"","","",""]
[null,null,null,null,null,null,null,null,null,"","","",null,null,"",null,null,"","","",""]
[null,null,null,null,null,null,null,null,null,"","","",null,null,"",null,null,"","","",""]
[null,null,null,null,null,null,null,null,null,"","","",null,null,"",null,null,"","","",""]
[null,null,null,null,null,null,null,null,null,{"$f":"IFERROR(VLOOKUP(H833,A:B,2,FALSE),\"\")","v":""},"","",null,null,"",null,null,"","","",""]
[null,null,null,null,null,null,null,null,null,"",{"$f":"IF(J834=\"\",\"\",\"-\")","v":""},"",null,null,"",null,null,"","","",""]
[null,null,null,null,null,null,null,null,null,"","","",null,null,"",null,null,"",{"$f":"IF(J835=\"\",\"\",(IF(R835=1,3,IF(R835=\"x\",1,0))))","v":""},{"$f":"IF(J835=\"\",\"\",IF(R835=2,3,IF(R835=\"x\",1,0)))","v":""},{"$f":"IF(R835=\"\",\"\",1)","v":""}]
[null,null,null,null,null,null,null,null,null,"","","",null,null,"",null,null,"","","",""]
[null,null,null,null,null,null,null,null,null,"","","",null,null,"",null,null,"","","",""]
[null,null,null,null,null,null,null,null,null,"","","",null,null,"",null,null,"","","",""]
[null,null,null,null,null,null,null,null,null,"","","",null,null,"",null,null,"","","",""]
[null,null,null,null,null,null,null,null,null,"","","",null,null,"",null,null,"","","",""]
[null,null,null,null,null,null,null,null,null,"","","",null,null,"",null,null,"","","",""]
[null,null,null,null,null,null,null,null,null,"","","",null,null,"",null,null,"","","",""]
[null,null,null,null,null,null,null,null,null,"","","",null,null,"",null,null,"","","",""]
[null,null,null,null,null,null,null,null,null,"","","",null,null,{"$f":"IF(J844=\"\",\"\",\"-\")","v":""},null,null,{"$f":"IF(N844=\"\",\"\",IF(N844>P844,1,IF(N844<P844,2,\"x\")))","v":""},"","",""]
[null,null,null,null,null,null,null,null,null,"","","",null,null,"",null,null,"","","",""]
[null,null,null,null,null,null,null,null,null,"","","",null,null,"",null,null,"","","",""]
[null,null,null,null,null,null,null,null,null,"","","",null,null,"",null,null,"","","",""]
[null,null,null,null,null,null,null,null,null,"","","",null,null,"",null,null,"","","",""]
[null,null,null,null,null,null,null,null,null,"","","",null,null,"",null,null,"","","",""]
[null,null,null,null,null,null,null,null,null,"","","",null,null,"",null,null,"","","",""]
[null,null,null,null,null,null,null,null,null,"","","",null,null,"",null,null,"","","",""]
[null,null,null,null,null,null,null,null,null,"","","",null,null,"",null,null,"","","",""]
[null,null,null,null,null,null,null,null,null,"","","",null,null,"",null,null,"","","",""]
[null,null,null,null,null,null,null,null,null,"","","",null,null,"",null,null,"","","",""]
[null,null,null,null,null,null,null,null,null,"","","",null,null,"",null,null,"","","",""]
[null,null,null,null,null,null,null,null,null,"","","",null,null,"",null,null,"","","",""]
[null,null,null,null,null,null,null,null,null,"","","",null,null,"",null,null,"","","",""]
[null,null,null,null,null,null,null,null,null,"","",{"$f":"IFERROR(VLOOKUP(I858,A:B,2,FALSE),\"\")","v":""},null,null,"",null,null,"","","",""]
[null,null,null,null,null,null,null,null,null,"","","",null,null,"",null,null,"","","",""]
[null,null,null,null,null,null,null,null,null,"","","",null,null,"",null,null,"","","",""]
[null,null,null,null,null,null,null,null,null,"","","",null,null,"",null,null,"","","",""]
[null,null,null,null,null,null,null,null,null,"","","",null,null,"",null,null,"","","",""]
[null,null,null,null,null,null,null,null,null,"","","",null,null,"",null,null,"","","",""]
[null,null,null,null,null,null,null,null,null,"","","",null,null,"",null,null,"","","",""]
[null,null,null,null,null,null,null,null,null,"","","",null,null,"",null,null,"","","",""]
[null,null,null,null,null,null,null,null,null,"","","",null,null,"",null,null,"","","",""]
[null,null,null,null,null,null,null,null,null,"","","",null,null,"",null,null,"","","",""]
[null,null,null,null,null,null,null,null,null,"","","",null,null,"",null,null,"","","",""]
[null,null,null,null,null,null,null,null,null,"","","",null,null,"",null,null,"","","",""]
[null,null,null,null,null,null,null,null,null,"","","",null,null,"",null,null,"","","",""]
[null,null,null,null,null,null,null,null,null,"","","",null,null,"",null,null,"","","",""]
[null,null,null,null,null,null,null,null,null,"","","",null,null,"",null,null,"","","",""]
[null,null,null,null,null,null,null,null,null,"","","",null,null,"",null,null,"","","",""]
[null,null,null,null,null,null,null,null,null,"","","",null,null,"",null,null,"","","",""]
[null,null,null,null,null,null,null,null,null,"","","",null,null,"",null,null,"","","",""]
[null,null,null,null,null,null,null,null,null,"","","",null,null,"",null,null,"","","",""]
[null,null,null,null,null,null,null,null,null,"","","",null,null,"",null,null,"","","",""]
[null,null,null,null,null,null,null,null,null,"","","",null,null,"",null,null,"","","",""]
[null,null,null,null,null,null,null,null,null,"","","",null,null,"",null,null,"","","",""]
[null,null,null,null,null,null,null,null,null,"","","",null,null,"",null,null,"","","",""]
[null,null,null,null,null,null,null,null,null,"","","",null,null,"",null,null,"","","",""]
[null,null,null,null,null,null,null,null,null,"","","",null,null,"",null,null,"","","",""]
[null,null,null,null,null,null,null,null,null,"","","",null,null,"",null,null,"","","",""]
[null,null,null,null,null,null,null,null,null,"","","",null,null,"",null,null,"","","",""]
[null,null,null,null,null,null,null,null,null,"","","",null,null,"",null,null,"","","",""]
[null,null,null,null,null,null,null,null,null,"","","",null,null,"",null,null,"","","",""]
[null,null,null,null,null,null,null,null,null,"","","",null,null,"",null,null,"","","",""]
[null,null,null,null,null,null,null,null,null,"","","",null,null,"",null,null,"","","",""]
[null,null,null,null,null,null,null,null,null,"","","",null,null,"",null,null,"","","",""]
[null,null,null,null,null,null,null,null,null,"","","",null,null,"",null,null,"","","",""]
[null,null,null,null,null,null,null,null,null,"","","",null,null,"",null,null,"","","",""]
[null,null,null,null,null,null,null,null,null,"","","",null,null,"",null,null,"","","",""]
[null,null,null,null,null,null,null,null,null,"","","",null,null,"",null,null,"","","",""]
[null,null,null,null,null,null,null,null,null,"","","",null,null,"",null,null,"","","",""]
[null,null,null,null,null,null,null,null,null,"","","",null,null,"",null,null,"","","",""]
[null,null,null,null,null,null,null,null,null,"","","",null,null,"",null,null,"","","",""]
[null,null,null,null,null,null,null,null,null,{"$f":"IFERROR(VLOOKUP(H897,A:B,2,FALSE),\"\")","v":""},"","",null,null,"",null,null,"","","",""]
[null,null,null,null,null,null,null,null,null,"",{"$f":"IF(J898=\"\",\"\",\"-\")","v":""},"",null,null,"",null,null,"","","",""]
[null,null,null,null,null,null,null,null,null,"","","",null,null,"",null,null,"",{"$f":"IF(J899=\"\",\"\",(IF(R899=1,3,IF(R899=\"x\",1,0))))","v":""},{"$f":"IF(J899=\"\",\"\",IF(R899=2,3,IF(R899=\"x\",1,0)))","v":""},{"$f":"IF(R899=\"\",\"\",1)","v":""}]
[null,null,null,null,null,null,null,null,null,"","","",null,null,"",null,null,"","","",""]
[null,null,null,null,null,null,null,null,null,"","","",null,null,"",null,null,"","","",""]
[null,null,null,null,null,null,null,null,null,"","","",null,null,"",null,null,"","","",""]
[null,null,null,null,null,null,null,null,null,"","","",null,null,"",null,null,"","","",""]
[null,null,null,null,null,null,null,null,null,"","","",null,null,"",null,null,"","","",""]
[null,null,null,null,null,null,null,null,null,"","","",null,null,"",null,null,"","","",""]
[null,null,null,null,null,null,null,null,null,"","","",null,null,"",null,null,"","","",""]
[null,null,null,null,null,null,null,null,null,"","","",null,null,"",null,null,"","","",""]
[null,null,null,null,null,null,null,null,null,"","","",null,null,{"$f":"IF(J908=\"\",\"\",\"-\")","v":""},null,null,{"$f":"IF(N908=\"\",\"\",IF(N908>P908,1,IF(N908<P908,2,\"x\")))","v":""},"","",""]
[null,null,null,null,null,null,null,null,null,"","","",null,null,"",null,null,"","","",""]
[null,null,null,null,null,null,null,null,null,"","","",null,null,"",null,null,"","","",""]
[null,null,null,null,null,null,null,null,null,"","","",null,null,"",null,null,"","","",""]
[null,null,null,null,null,null,null,null,null,"","","",null,null,"",null,null,"","","",""]
[null,null,null,null,null,null,null,null,null,"","","",null,null,"",null,null,"","","",""]
[null,null,null,null,null,null,null,null,null,"","","",null,null,"",null,null,"","","",""]
[null,null,null,null,null,null,null,null,null,"","","",null,null,"",null,null,"","","",""]
[null,null,null,null,null,null,null,null,null,"","","",null,null,"",null,null,"","","",""]
[null,null,null,null,null,null,null,null,null,"","","",null,null,"",null,null,"","","",""]
[null,null,null,null,null,null,null,null,null,"","","",null,null,"",null,null,"","","",""]
[null,null,null,null,null,null,null,null,null,"","","",null,null,"",null,null,"","","",""]
[null,null,null,null,null,null,null,null,null,"","","",null,null,"",null,null,"","","",""]
[null,null,null,null,null,null,null,null,null,"","","",null,null,"",null,null,"","","",""]
[null,null,null,null,null,null,null,null,null,"","",{"$f":"IFERROR(VLOOKUP(I922,A:B,2,FALSE),\"\")","v":""},null,null,"",null,null,"","","",""]
[null,null,null,null,null,null,null,null,null,"","","",null,null,"",null,null,"","","",""]
[null,null,null,null,null,null,null,null,null,"","","",null,null,"",null,null,"","","",""]
[null,null,null,null,null,null,null,null,null,"","","",null,null,"",null,null,"","","",""]
[null,null,null,null,null,null,null,null,null,"","","",null,null,"",null,null,"","","",""]
[null,null,null,null,null,null,null,null,null,"","","",null,null,"",null,null,"","","",""]
[null,null,null,null,null,null,null,null,null,"","","",null,null,"",null,null,"","","",""]
[null,null,null,null,null,null,null,null,null,"","","",null,null,"",null,null,"","","",""]
[null,null,null,null,null,null,null,null,null,"","","",null,null,"",null,null,"","","",""]
[null,null,null,null,null,null,null,null,null,"","","",null,null,"",null,null,"","","",""]
[null,null,null,null,null,null,null,null,null,"","","",null,null,"",null,null,"","","",""]
[null,null,null,null,null,null,null,null,null,"","","",null,null,"",null,null,"","","",""]
[null,null,null,null,null,null,null,null,null,"","","",null,null,"",null,null,"","","",""]
[null,null,null,null,null,null,null,null,null,"","","",null,null,"",null,null,"","","",""]
[null,null,null,null,null,null,null,null,null,"","","",null,null,"",null,null,"","","",""]
[null,null,null,null,null,null,null,null,null,"","","",null,null,"",null,null,"","","",""]
[null,null,null,null,null,null,null,null,null,"","","",null,null,"",null,null,"","","",""]
[null,null,null,null,null,null,null,null,null,"","","",null,null,"",null,null,"","","",""]
[null,null,null,null,null,null,null,null,null,"","","",null,null,"",null,null,"","","",""]
[null,null,null,null,null,null,null,null,null,"","","",null,null,"",null,null,"","","",""]
[null,null,null,null,null,null,null,null,null,"","","",null,null,"",null,null,"","","",""]
[null,null,null,null,null,null,null,null,null,"","","",null,null,"",null,null,"","","",""]
[null,null,null,null,null,null,null,null,null,"","","",null,null,"",null,null,"","","",""]
[null,null,null,null,null,null,null,null,null,"","","",null,null,"",null,null,"","","",""]
[null,null,null,null,null,null,null,null,null,"","","",null,null,"",null,null,"","","",""]
[null,null,null,null,null,null,null,null,null,"","","",null,null,"",null,null,"","","",""]
[null,null,null,null,null,null,null,null,null,"","","",null,null,"",null,null,"","","",""]
[null,null,null,null,null,null,null,null,null,"","","",null,null,"",null,null,"","","",""]
[null,null,null,null,null,null,null,null,null,"","","",null,null,"",null,null,"","","",""]
[null,null,null,null,null,null,null,null,null,"","","",null,null,"",null,null,"","","",""]
[null,null,null,null,null,null,null,null,null,"","","",null,null,"",null,null,"","","",""]
[null,null,null,null,null,null,null,null,null,"","","",null,null,"",null,null,"","","",""]
[null,null,null,null,null,null,null,null,null,"","","",null,null,"",null,null,"","","",""]
[null,null,null,null,null,null,null,null,null,"","","",null,null,"",null,null,"","","",""]
[null,null,null,null,null,null,null,null,null,"","","",null,null,"",null,null,"","","",""]
[null,null,null,null,null,null,null,null,null,"","","",null,null,"",null,null,"","","",""]
[null,null,null,null,null,null,null,null,null,"","","",null,null,"",null,null,"","","",""]
[null,null,null,null,null,null,null,null,null,"","","",null,null,"",null,null,"","","",""]
[null,null,null,null,null,null,null,null,null,"","","",null,null,"",null,null,"","","",""]
[null,null,null,null,null,null,null,null,null,{"$f":"IFERROR(VLOOKUP(H961,A:B,2,FALSE),\"\")","v":""},"","",null,null,"",null,null,"","","",""]
[null,null,null,null,null,null,null,null,null,"",{"$f":"IF(J962=\"\",\"\",\"-\")","v":""},"",null,null,"",null,null,"","","",""]
[null,null,null,null,null,null,null,null,null,"","","",null,null,"",null,null,"",{"$f":"IF(J963=\"\",\"\",(IF(R963=1,3,IF(R963=\"x\",1,0))))","v":""},{"$f":"IF(J963=\"\",\"\",IF(R963=2,3,IF(R963=\"x\",1,0)))","v":""},{"$f":"IF(R963=\"\",\"\",1)","v":""}]
[null,null,null,null,null,null,null,null,null,"","","",null,null,"",null,null,"","","",""]
[null,null,null,null,null,null,null,null,null,"","","",null,null,"",null,null,"","","",""]
[null,null,null,null,null,null,null,null,null,"","","",null,null,"",null,null,"","","",""]
[null,null,null,null,null,null,null,null,null,"","","",null,null,"",null,null,"","","",""]
[null,null,null,null,null,null,null,null,null,"","","",null,null,"",null,null,"","","",""]
[null,null,null,null,null,null,null,null,null,"","","",null,null,"",null,null,"","","",""]
[null,null,null,null,null,null,null,null,null,"","","",null,null,"",null,null,"","","",""]
[null,null,null,null,null,null,null,null,null,"","","",null,null,"",null,null,"","","",""]
[null,null,null,null,null,null,null,null,null,"","","",null,null,{"$f":"IF(J972=\"\",\"\",\"-\")","v":""},null,null,{"$f":"IF(N972=\"\",\"\",IF(N972>P972,1,IF(N972<P972,2,\"x\")))","v":""},"","",""]
[null,null,null,null,null,null,null,null,null,"","","",null,null,"",null,null,"","","",""]
[null,null,null,null,null,null,null,null,null,"","","",null,null,"",null,null,"","","",""]
[null,null,null,null,null,null,null,null,null,"","","",null,null,"",null,null,"","","",""]
[null,null,null,null,null,null,null,null,null,"","","",null,null,"",null,null,"","","",""]
[null,null,null,null,null,null,null,null,null,"","","",null,null,"",null,null,"","","",""]
[null,null,null,null,null,null,null,null,null,"","","",null,null,"",null,null,"","","",""]
[null,null,null,null,null,null,null,null,null,"","","",null,null,"",null,null,"","","",""]
[null,null,null,null,null,null,null,null,null,"","","",null,null,"",null,null,"","","",""]
[null,null,null,null,null,null,null,null,null,"","","",null,null,"",null,null,"","","",""]
[null,null,null,null,null,null,null,null,null,"","","",null,null,"",null,null,"","","",""]
[null,null,null,null,null,null,null,null,null,"","","",null,null,"",null,null,"","","",""]
[null,null,null,null,null,null,null,null,null,"","","",null,null,"",null,null,"","","",""]
[null,null,null,null,null,null,null,null,null,"","","",null,null,"",null,null,"","","",""]
[null,null,null,null,null,null,null,null,null,"","",{"$f":"IFERROR(VLOOKUP(I986,A:B,2,FALSE),\"\")","v":""},null,null,"",null,null,"","","",""]
[null,null,null,null,null,null,null,null,null,"","","",null,null,"",null,null,"","","",""]
[null,null,null,null,null,null,null,null,null,"","","",null,null,"",null,null,"","","",""]
[null,null,null,null,null,null,null,null,null,"","","",null,null,"",null,null,"","","",""]
[null,null,null,null,null,null,null,null,null,"","","",null,null,"",null,null,"","","",""]
[null,null,null,null,null,null,null,null,null,"","","",null,null,"",null,null,"","","",""]
[null,null,null,null,null,null,null,null,null,"","","",null,null,"",null,null,"","","",""]
[null,null,null,null,null,null,null,null,null,"","","",null,null,"",null,null,"","","",""]
[null,null,null,null,null,null,null,null,null,"","","",null,null,"",null,null,"","","",""]
[null,null,null,null,null,null,null,null,null,"","","",null,null,"",null,null,"","","",""]
[null,null,null,null,null,null,null,null,null,"","","",null,null,"",null,null,"","","",""]
[null,null,null,null,null,null,null,null,null,"","","",null,null,"",null,null,"","","",""]
[null,null,null,null,null,null,null,null,null,"","","",null,null,"",null,null,"","","",""]
[null,null,null,null,null,null,null,null,null,"","","",null,null,"",null,null,"","","",""]
[null,null,null,null,null,null,null,null,null,"","","",null,null,"",null,null,"","","",""]

{"sheet":"Sheet2","index":1,"n_rows":0,"n_cols":0,"rows_kept":0,"cut":false,"hidden":false,"merged":[]}

{"sheet":"Sheet3","index":2,"n_rows":0,"n_cols":0,"rows_kept":0,"cut":false,"hidden":false,"merged":[]}