{"text_format":"1","workbook":"xlsx","n_sheets":3,"sheets":["Komandna tabla","1.gradska liga","liste"],"not_rendered":{"charts":0,"images":6,"macros":1,"external_links":0,"defined_names":10,"comments":0,"pivot_tables":0},"unopened":[],"bounds":{"document_bytes":16777216,"sheet_cells":100000,"rows_first":2000,"rows_last":500,"rows_between":2000,"halvings":0,"cell_chars":16384,"cell_head_chars":4096},"cells_cut":0,"cells_raw":0,"read":"whole","date_system":"1900"}

{"sheet":"Komandna tabla","index":0,"n_rows":21,"n_cols":8,"rows_kept":21,"cut":false,"hidden":false,"merged":[[18,4,18,5],[13,8,13,9],[3,2,3,8],[13,4,13,5],[14,4,14,5],[15,4,15,5],[16,4,16,5],[17,4,17,5]]}
[]
[]
[]
[null,null,"FUDBALSKI SAVEZ GRADA KRAGUJEVCA\npregled licenciranih službenih lica za sezonu 2014 / 15 "]
[]
[]
[]
[null,null,"Šifra za unos sledećeg :",null,null,{"$f":"COUNTA(br.licence)+1","v":19}]
[null,null,null,null,null,null,null,"Prikaz podataka"]
[null,null,null,null,null,null,null,"Promena podataka"]
[]
[null,null,"Unesite broj službenog lica",null,null,"22"]
[]
[null,null,"Prezime",null,{"$f":"IFERROR(VLOOKUP(F12,'1.gradska liga'!B5:J500,2,0),\"Ne postojeći podatak\")","v":"Ne postojeći podatak"}]
[null,null,"Ime",null,{"$f":"IFERROR(VLOOKUP(F12,'1.gradska liga'!B5:J501,3,0),\"\")","v":""}]
[null,null,"Klub",null,{"$f":"IFERROR(VLOOKUP(F12,'1.gradska liga'!B5:J500,4,0),\"\")","v":""}]
[null,null,"Liga",null,{"$f":"IFERROR(VLOOKUP(F12,'1.gradska liga'!B5:J500,5,0),\"\")","v":""}]
[null,null,"Funkcija",null,{"$f":"IFERROR(VLOOKUP(F12,'1.gradska liga'!B5:J500,6,0),\"\")","v":""}]
[null,null,"Datum izdavanja ",null,{"$f":"IFERROR(VLOOKUP(F12,'1.gradska liga'!B5:J500,7,0),\"\")","v":""}]
[]
[null,null,"Unesite broj službenog lica",null,null,"222"]

{"sheet":"1.gradska liga","index":1,"n_rows":500,"n_cols":9,"rows_kept":500,"cut":false,"hidden":false,"merged":[[2,2,2,8]]}
[]
[]
[null,null,"FUDBALSKI SAVEZ GRADA KRAGUJEVCA\npregled licenciranih službenih lica za sezonu 2014 / 15 "]
[null,"br.licence","Prezime","Ime","Klub","Liga","funkcija","Izdata\n(datum)","iznos"]
[null,"1","Aksentijević","Radoslav","Šumadija 1934","2.gradska ","predstavnik kluba","2014-07-31",200]
[null,"2","Stepanović","Saša","Šumadija 1934","2.gradska ","komesar za bezbednost","2014-07-31",200]
[null,"3","Alempijević","Rade","Šumadija 1934","2.gradska ","fizioterapeut","2014-07-31",200]
[null,"4","Pavlović","Aleksandar","Šumadija 1934","2.gradska ","trener seniora","2014-07-31",200]
[null,"5","Varagić","Milomir","21.Oktobar","2.gradska ","predstavnik kluba","2014-08-04",200]
[null,"6","Zlatanović","Dejan","21.Oktobar","2.gradska ","komesar za bezbednost","2014-08-04",200]
[null,"7","Radovanović ","Miodrag","Sloga (D)","1.gradska","predstavnik kluba","2014-08-11",200]
[null,"8","Ivanović","Slavoljub","Sloga (D)","1.gradska","trener seniora","2014-08-11",200]
[null,"9","Andrović","Goran","Sloga (D)","1.gradska","predstavnik kluba","2014-08-11",200]
[null,"10","Marković","Milorad","Sloga (D)","1.gradska","komesar za bezbednost","2014-08-11",200]
[null,"11","Marković","Ljubiša","Kutlovo","2.gradska ","predstavnik kluba","2014-08-11",200]
[null,"12","Kocić","Dušan","Kutlovo","2.gradska ","komesar za bezbednost","2014-08-11",200]
[null,"13","Radovanović ","Vladan","Kutlovo","2.gradska ","trener seniora","2014-08-11",200]
[null,"14","Marković","Marija","Kutlovo","2.gradska ","fizioterapeut","2014-08-11",200]
[null,"15","Radovanović","Jovica","Kutlovo","2.gradska ","predstavnik kluba","2014-08-11",200]
[null,"16","Lekić","Živorad","Budućnost","1.gradska","predstavnik kluba","2014-08-12",200]
[null,"17","Pavlović","Zoran","Budućnost","1.gradska","komesar za bezbednost","2014-08-12",200]
[null,"18","Vasiljević","Nenad","Budućnost","1.gradska","trener seniora","2014-08-12",200]
[]
[null,null,"","","","","","",""]
[null,null,"","","","","","",""]
[null,null,"","","","","","",""]
[null,null,"","","","","","",""]
[null,null,"","","","","","",""]
[null,null,"","","","","","",""]
[null,null,"","","","","","",""]
[null,null,"","","","","","",""]
[null,null,"","","","","","",""]
[null,null,"","","","","","",""]
[null,null,"","","","","","",""]
[null,null,"","","","","","",""]
[null,null,"","","","","","",""]
[null,null,"","","","","","",""]
[null,null,"","","","","","",""]
[null,null,"","","","","","",""]
[null,null,"","","","","","",""]
[null,null,"","","","","","",""]
[null,null,"","","","","","",""]
[null,null,"","","","","","",""]
[null,null,"","","","","","",""]
[null,null,"","","","","","",""]
[null,null,"","","","","","",""]
[null,null,"","","","","","",""]
[null,null,"","","","","","",""]
[null,null,"","","","","","",""]
[null,null,"","","","","","",""]
[null,null,"","","","","","",""]
[null,null,"","","","","","",""]
[null,null,"","","","","","",""]
[null,null,"","","","","","",""]
[null,null,"","","","","","",""]
[null,null,"","","","","","",""]
[null,null,"","","","","","",""]
[null,null,"","","","","","",""]
[null,null,"","","","","","",""]
[null,null,"","","","","","",""]
[null,null,"","","","","","",""]
[null,null,"","","","","","",""]
[null,null,"","","","","","",""]
[null,null,"","","","","","",""]
[null,null,"","","","","","",""]
[null,null,"","","","","","",""]
[null,null,"","","","","","",""]
[null,null,"","","","","","",""]
[null,null,"","","","","","",""]
[null,null,"","","","","","",""]
[null,null,"","","","","","",""]
[null,null,"","","","","","",""]
[null,null,"","","","","","",""]
[null,null,"","","","","","",""]
[null,null,"","","","","","",""]
[null,null,"","","","","","",""]
[null,null,"","","","","","",""]
[null,null,"","","","","","",""]
[null,null,"","","","","","",""]
[null,null,"","","","","","",""]
[null,null,"","","","","","",""]
[null,null,"","","","","","",""]
[null,null,"","","","","","",""]
[null,null,"","","","","","",""]
[null,null,"","","","","","",""]
[null,null,"","","","","","",""]
[null,null,"","","","","","",""]
[null,null,"","","","","","",""]
[null,null,"","","","","","",""]
[null,null,"","","","","","",""]
[null,null,"","","","","","",""]
[null,null,"","","","","","",""]
[null,null,"","","","","","",""]
[null,null,"","","","","","",""]
[null,null,"","","","","","",""]
[null,null,"","","","","","",""]
[null,null,"","","","","","",""]
[null,null,"","","","","","",""]
[null,null,"","","","","","",""]
[null,null,"","","","","","",""]
[null,null,"","","","","","",""]
[null,null,"","","","","","",""]
[null,null,"","","","","","",""]
[null,null,"","","","","","",""]
[null,null,"","","","","","",""]
[null,null,"","","","","","",""]
[null,null,"","","","","","",""]
[null,null,"","","","","","",""]
[null,null,"","","","","","",""]
[null,null,"","","","","","",""]
[null,null,"","","","","","",""]
[null,null,"","","","","","",""]
[null,null,"","","","","","",""]
[null,null,"","","","","","",""]
[null,null,"","","","","","",""]
[null,null,"","","","","","",""]
[null,null,"","","","","","",""]
[null,null,"","","","","","",""]
[null,null,"","","","","","",""]
[null,null,"","","","","","",""]
[null,null,"","","","","","",""]
[null,null,"","","","","","",""]
[null,null,"","","","","","",""]
[null,null,"","","","","","",""]
[null,null,"","","","","","",""]
[null,null,"","","","","","",""]
[null,null,"","","","","","",""]
[null,null,"","","","","","",""]
[null,null,"","","","","","",""]
[null,null,"","","","","","",""]
[null,null,"","","","","","",""]
[null,null,"","","","","","",""]
[null,null,"","","","","","",""]
[null,null,"","","","","","",""]
[null,null,"","","","","","",""]
[null,null,"","","","","","",""]
[null,null,"","","","","","",""]
[null,null,"","","","","","",""]
[null,null,"","","","","","",""]
[null,null,"","","","","","",""]
[null,null,"","","","","","",""]
[null,null,"","","","","","",""]
[null,null,"","","","","","",""]
[null,null,"","","","","","",""]
[null,null,"","","","","","",""]
[null,null,"","","","","","",""]
[null,null,"","","","","","",""]
[null,null,"","","","","","",""]
[null,null,"","","","","","",""]
[null,null,"","","","","","",""]
[null,null,"","","","","","",""]
[null,null,"","","","","","",""]
[null,null,"","","","","","",""]
[null,null,"","","","","","",""]
[null,null,"","","","","","",""]
[null,null,"","","","","","",""]
[null,null,"","","","","","",""]
[null,null,"","","","","","",""]
[null,null,"","","","","","",""]
[null,null,"","","","","","",""]
[null,null,"","","","","","",""]
[null,null,"","","","","","",""]
[null,null,"","","","","","",""]
[null,null,"","","","","","",""]
[null,null,"","","","","","",""]
[null,null,"","","","","","",""]
[null,null,"","","","","","",""]
[null,null,"","","","","","",""]
[null,null,"","","","","","",""]
[null,null,"","","","","","",""]
[null,null,"","","","","","",""]
[null,null,"","","","","","",""]
[null,null,"","","","","","",""]
[null,null,"","","","","","",""]
[null,null,"","","","","","",""]
[null,null,"","","","","","",""]
[null,null,"","","","","","",""]
[null,null,"","","","","","",""]
[null,null,"","","","","","",""]
[null,null,"","","","","","",""]
[null,null,"","","","","","",""]
[null,null,"","","","","","",""]
[null,null,"","","","","","",""]
[null,null,"","","","","","",""]
[null,null,"","","","","","",""]
[null,null,"","","","","","",""]
[null,null,"","","","","","",""]
[null,null,"","","","","","",""]
[null,null,"","","","","","",""]
[null,null,"","","","","","",""]
[null,null,"","","","","","",""]
[null,null,"","","","","","",""]
[null,null,"","","","","","",""]
[null,null,"","","","","","",""]
[null,null,"","","","","","",""]
[null,null,"","","","","","",""]
[null,null,"","","","","","",""]
[null,null,"","","","","","",""]
[null,null,"","","","","","",""]
[null,null,"","","","","","",""]
[null,null,"","","","","","",""]
[null,null,"","","","","","",""]
[null,null,"","","","","","",""]
[null,null,"","","","","","",""]
[null,null,"","","","","","",""]
[null,null,"","","","","","",""]
[null,null,"","","","","","",""]
[null,null,"","","","","","",""]
[null,null,"","","","","","",""]
[null,null,"","","","","","",""]
[null,null,"","","","","","",""]
[null,null,"","","","","","",""]
[null,null,"","","","","","",""]
[null,null,"","","","","","",""]
[null,null,"","","","","","",""]
[null,null,"","","","","","",""]
[null,null,"","","","","","",""]
[null,null,"","","","","","",""]
[null,null,"","","","","","",""]
[null,null,"","","","","","",""]
[null,null,"","","","","","",""]
[null,null,"","","","","","",""]
[null,null,"","","","","","",""]
[null,null,"","","","","","",""]
[null,null,"","","","","","",""]
[null,null,"","","","","","",""]
[null,null,"","","","","","",""]
[null,null,"","","","","","",""]
[null,null,"","","","","","",""]
[null,null,"","","","","","",""]
[null,null,"","","","","","",""]
[null,null,"","","","","","",""]
[null,null,"","","","","","",""]
[null,null,"","","","","","",""]
[null,null,"","","","","","",""]
[null,null,"","","","","","",""]
[null,null,"","","","","","",""]
[null,null,"","","","","","",""]
[null,null,"","","","","","",""]
[null,null,"","","","","","",""]
[null,null,"","","","","","",""]
[null,null,"","","","","","",""]
[null,null,"","","","","","",""]
[null,null,"","","","","","",""]
[null,null,"","","","","","",""]
[null,null,"","","","","","",""]
[null,null,"","","","","","",""]
[null,null,"","","","","","",""]
[null,null,"","","","","","",""]
[null,null,"","","","","","",""]
[null,null,"","","","","","",""]
[null,null,"","","","","","",""]
[null,null,"","","","","","",""]
[null,null,"","","","","","",""]
[null,null,"","","","","","",""]
[null,null,"","","","","","",""]
[null,null,"","","","","","",""]
[null,null,"","","","","","",""]
[null,null,"","","","","","",""]
[null,null,"","","","","","",""]
[null,null,"","","","","","",""]
[null,null,"","","","","","",""]
[null,null,"","","","","","",""]
[null,null,"","","","","","",""]
[null,null,"","","","","","",""]
[null,null,"","","","","","",""]
[null,null,"","","","","","",""]
[null,null,"","","","","","",""]
[null,null,"","","","","","",""]
[null,null,"","","","","","",""]
[null,null,"","","","","","",""]
[null,null,"","","","","","",""]
[null,null,"","","","","","",""]
[null,null,"","","","","","",""]
[null,null,"","","","","","",""]
[null,null,"","","","","","",""]
[null,null,"","","","","","",""]
[null,null,"","","","","","",""]
[null,null,"","","","","","",""]
[null,null,"","","","","","",""]
[null,null,"","","","","","",""]
[null,null,"","","","","","",""]
[null,null,"","","","","","",""]
[null,null,"","","","","","",""]
[null,null,"","","","","","",""]
[null,null,"","","","","","",""]
[null,null,"","","","","","",""]
[null,null,"","","","","","",""]
[null,null,"","","","","","",""]
[null,null,"","","","","","",""]
[null,null,"","","","","","",""]
[null,null,"","","","","","",""]
[null,null,"","","","","","",""]
[null,null,"","","","","","",""]
[null,null,"","","","","","",""]
[null,null,"","","","","","",""]
[null,null,"","","","","","",""]
[null,null,"","","","","","",""]
[null,null,"","","","","","",""]
[null,null,"","","","","","",""]
[null,null,"","","","","","",""]
[null,null,"","","","","","",""]
[null,null,"","","","","","",""]
[null,null,"","","","","","",""]
[null,null,"","","","","","",""]
[null,null,"","","","","","",""]
[null,null,"","","","","","",""]
[null,null,"","","","","","",""]
[null,null,"","","","","","",""]
[null,null,"","","","","","",""]
[null,null,"","","","","","",""]
[null,null,"","","","","","",""]
[null,null,"","","","","","",""]
[null,null,"","","","","","",""]
[null,null,"","","","","","",""]
[null,null,"","","","","","",""]
[null,null,"","","","","","",""]
[null,null,"","","","","","",""]
[null,null,"","","","","","",""]
[null,null,"","","","","","",""]
[null,null,"","","","","","",""]
[null,null,"","","","","","",""]
[null,null,"","","","","","",""]
[null,null,"","","","","","",""]
[null,null,"","","","","","",""]
[null,null,"","","","","","",""]
[null,null,"","","","","","",""]
[null,null,"","","","","","",""]
[null,null,"","","","","","",""]
[null,null,"","","","","","",""]
[null,null,"","","","","","",""]
[null,null,"","","","","","",""]
[null,null,"","","","","","",""]
[null,null,"","","","","","",""]
[null,null,"","","","","","",""]
[null,null,"","","","","","",""]
[null,null,"","","","","","",""]
[null,null,"","","","","","",""]
[null,null,"","","","","","",""]
[null,null,"","","","","","",""]
[null,null,"","","","","","",""]
[null,null,"","","","","","",""]
[null,null,"","","","","","",""]
[null,null,"","","","","","",""]
[null,null,"","","","","","",""]
[null,null,"","","","","","",""]
[null,null,"","","","","","",""]
[null,null,"","","","","","",""]
[null,null,"","","","","","",""]
[null,null,"","","","","","",""]
[null,null,"","","","","","",""]
[null,null,"","","","","","",""]
[null,null,"","","","","","",""]
[null,null,"","","","","","",""]
[null,null,"","","","","","",""]
[null,null,"","","","","","",""]
[null,null,"","","","","","",""]
[null,null,"","","","","","",""]
[null,null,"","","","","","",""]
[null,null,"","","","","","",""]
[null,null,"","","","","","",""]
[null,null,"","","","","","",""]
[null,null,"","","","","","",""]
[null,null,"","","","","","",""]
[null,null,"","","","","","",""]
[null,null,"","","","","","",""]
[null,null,"","","","","","",""]
[null,null,"","","","","","",""]
[null,null,"","","","","","",""]
[null,null,"","","","","","",""]
[null,null,"","","","","","",""]
[null,null,"","","","","","",""]
[null,null,"","","","","","",""]
[null,null,"","","","","","",""]
[null,null,"","","","","","",""]
[null,null,"","","","","","",""]
[null,null,"","","","","","",""]
[null,null,"","","","","","",""]
[null,null,"","","","","","",""]
[null,null,"","","","","","",""]
[null,null,"","","","","","",""]
[null,null,"","","","","","",""]
[null,null,"","","","","","",""]
[null,null,"","","","","","",""]
[null,null,"","","","","","",""]
[null,null,"","","","","","",""]
[null,null,"","","","","","",""]
[null,null,"","","","","","",""]
[null,null,"","","","","","",""]
[null,null,"","","","","","",""]
[null,null,"","","","","","",""]
[null,null,"","","","","","",""]
[null,null,"","","","","","",""]
[null,null,"","","","","","",""]
[null,null,"","","","","","",""]
[null,null,"","","","","","",""]
[null,null,"","","","","","",""]
[null,null,"","","","","","",""]
[null,null,"","","","","","",""]
[null,null,"","","","","","",""]
{"$rows_left_out":101}
{"sheet":"liste","index":2,"n_rows":13,"n_cols":9,"rows_kept":13,"cut":false,"hidden":false,"merged":[[1,2,1,8]]}
[]
[null,"   1.gradska","FUDBALSKI SAVEZ GRADA KRAGUJEVCA\npregled licenciranih službenih lica za sezonu 2014 / 15 "]
[null,"br.licence","Prezime","Ime","Klub","Liga","funkcija","Izdata\n(datum)","iznos"]
[]
[null,null,null,null,null,"1.gradska","trener seniora"]
[null,null,null,null,null,"2.gradska","pomoćni trener seniora"]
[null,null,null,null,null,"3.gradska","trener petlića"]
[null,null,null,null,null,"mlađe.kat.","trener kadeta"]
[null,null,null,null,null,null,"komesar za bezbednost"]
[null,null,null,null,null,null,"zamenik komesara za bezb."]
[null,null,null,null,null,null,"predstavnik kluba"]
[null,null,null,null,null,null,"lekar ekipe"]
[null,null,null,null,null,null,"fizioterapeut"]