{"text_format":"1","workbook":"xlsx","n_sheets":4,"sheets":["plan","obrazacFormula","obrazacVBA","cal"],"not_rendered":{"charts":0,"images":0,"macros":1,"external_links":0,"defined_names":4,"comments":1,"pivot_tables":0},"unopened":[],"bounds":{"document_bytes":16777216,"sheet_cells":100000,"rows_first":2000,"rows_last":500,"rows_between":2000,"halvings":0,"cell_chars":16384,"cell_head_chars":4096},"cells_cut":0,"cells_raw":0,"read":"whole","date_system":"1900"}

{"sheet":"plan","index":0,"n_rows":13,"n_cols":8,"rows_kept":13,"cut":false,"hidden":false,"merged":[]}
["r.b.","ime i prezime","datum od","datum do","aktivnost",null,"aktivnost","boja"]
[1,"Marko Marković","2014-01-01","2014-01-10","tenis",null,"tenis"]
[2,"Pero Perić","2014-01-01","2014-01-05","fudbal",null,"fudbal"]
[3,"Kosta Nikolić","2014-01-01","2014-01-10","košarka",null,"košarka"]
[4,"Marko Marković","2014-01-13","2014-01-14","košarka"]
[5,"Pero Perić","2014-01-13","2014-01-15","fudbal"]
[6,"Marko Marković","2014-01-15","2014-01-17","tenis"]
[7,"Kosta Nikolić","2014-01-16","2014-01-17","fudbal"]
[8,"Nenad Jović","2014-01-17","2014-01-20","košarka"]
[9]
[10]
[11]
[null,null,null,null,"Datum do može biti i broj narednih dana"]

{"sheet":"obrazacFormula","index":1,"n_rows":18,"n_cols":52,"rows_kept":18,"cut":false,"hidden":false,"merged":[[1,0,3,0],[1,1,3,1],[1,2,3,2],[1,3,1,33],[1,34,1,51]]}
[]
["Red. br.","Prezime i ime","index","JANUAR",null,null,null,null,null,null,null,null,null,null,null,null,null,null,null,null,null,null,null,null,null,null,null,null,null,null,null,null,null,null,"FEBRUAR"]
[null,null,null,"2014-01-01",{"$f":"D3+1","v":"2014-01-02"},{"$f":"E3+1","v":"2014-01-03"},"2014-01-04","2014-01-05","2014-01-06","2014-01-07","2014-01-08","2014-01-09","2014-01-10","2014-01-11","2014-01-12","2014-01-13","2014-01-14","2014-01-15","2014-01-16","2014-01-17","2014-01-18","2014-01-19","2014-01-20","2014-01-21","2014-01-22","2014-01-23","2014-01-24","2014-01-25","2014-01-26","2014-01-27","2014-01-28","2014-01-29","2014-01-30","2014-01-31","2014-02-01","2014-02-02","2014-02-03","2014-02-04","2014-02-05","2014-02-06","2014-02-07","2014-02-08","2014-02-09","2014-02-10","2014-02-11","2014-02-12","2014-02-13","2014-02-14","2014-02-15","2014-02-16","2014-02-17","2014-02-18"]
[null,null,null,{"$f":"TEXT(D3,\"ddd\")","v":"sre"},{"$f":"TEXT(E3,\"ddd\")","v":"čet"},"pet","sub","ned","pon","uto","sre","čet","pet","sub","ned","pon","uto","sre","čet","pet","sub","ned","pon","uto","sre","čet","pet","sub","ned","pon","uto","sre","čet",{"$f":"TEXT(AH3,\"ddd\")","v":"pet"},{"$f":"TEXT(AI3,\"ddd\")","v":"sub"},"ned","pon","uto","sre","čet","pet","sub","ned","pon","uto","sre","čet","pet","sub","ned","pon","uto"]
["1","Marko Marković"]
["2","Pero Perić"]
["3","Kosta Nikolić"]
["4","Nenad Jović"]
["5"]
["6"]
["7"]
["8"]
["9"]
["10"]
[]
[]
[]
[null,null,null,{"$f":"LOOKUP(1,1/(($B5=plan!$B$2:$B$12)*(D$3>=plan!$C$2:$C$12)*(D$3<=plan!$D$2:$D$12)),plan!$E$2:$E$12)","v":"tenis"},{"$f":"LOOKUP(1,1/(($B5=plan!$B$2:$B$12)*(E$3>=plan!$C$2:$C$12)*(E$3<=plan!$D$2:$D$12)),plan!$E$2:$E$12)","v":"tenis"},{"$f":"LOOKUP(1,1/(($B5=plan!$B$2:$B$12)*(F$3>=plan!$C$2:$C$12)*(F$3<=plan!$D$2:$D$12)),plan!$E$2:$E$12)","v":"tenis"},{"$f":"LOOKUP(1,1/(($B5=plan!$B$2:$B$12)*(G$3>=plan!$C$2:$C$12)*(G$3<=plan!$D$2:$D$12)),plan!$E$2:$E$12)","v":"tenis"},{"$f":"LOOKUP(1,1/(($B5=plan!$B$2:$B$12)*(H$3>=plan!$C$2:$C$12)*(H$3<=plan!$D$2:$D$12)),plan!$E$2:$E$12)","v":"tenis"},{"$f":"LOOKUP(1,1/(($B5=plan!$B$2:$B$12)*(I$3>=plan!$C$2:$C$12)*(I$3<=plan!$D$2:$D$12)),plan!$E$2:$E$12)","v":"tenis"},{"$f":"LOOKUP(1,1/(($B5=plan!$B$2:$B$12)*(J$3>=plan!$C$2:$C$12)*(J$3<=plan!$D$2:$D$12)),plan!$E$2:$E$12)","v":"tenis"},{"$f":"LOOKUP(1,1/(($B5=plan!$B$2:$B$12)*(K$3>=plan!$C$2:$C$12)*(K$3<=plan!$D$2:$D$12)),plan!$E$2:$E$12)","v":"tenis"},{"$f":"LOOKUP(1,1/(($B5=plan!$B$2:$B$12)*(L$3>=plan!$C$2:$C$12)*(L$3<=plan!$D$2:$D$12)),plan!$E$2:$E$12)","v":"tenis"},{"$f":"LOOKUP(1,1/(($B5=plan!$B$2:$B$12)*(M$3>=plan!$C$2:$C$12)*(M$3<=plan!$D$2:$D$12)),plan!$E$2:$E$12)","v":"tenis"},{"$f":"LOOKUP(1,1/(($B5=plan!$B$2:$B$12)*(N$3>=plan!$C$2:$C$12)*(N$3<=plan!$D$2:$D$12)),plan!$E$2:$E$12)","v":{"$error":"#N/A"}},{"$f":"LOOKUP(1,1/(($B5=plan!$B$2:$B$12)*(O$3>=plan!$C$2:$C$12)*(O$3<=plan!$D$2:$D$12)),plan!$E$2:$E$12)","v":{"$error":"#N/A"}},{"$f":"LOOKUP(1,1/(($B5=plan!$B$2:$B$12)*(P$3>=plan!$C$2:$C$12)*(P$3<=plan!$D$2:$D$12)),plan!$E$2:$E$12)","v":"košarka"},{"$f":"LOOKUP(1,1/(($B5=plan!$B$2:$B$12)*(Q$3>=plan!$C$2:$C$12)*(Q$3<=plan!$D$2:$D$12)),plan!$E$2:$E$12)","v":"košarka"},{"$f":"LOOKUP(1,1/(($B5=plan!$B$2:$B$12)*(R$3>=plan!$C$2:$C$12)*(R$3<=plan!$D$2:$D$12)),plan!$E$2:$E$12)","v":"tenis"},{"$f":"LOOKUP(1,1/(($B5=plan!$B$2:$B$12)*(S$3>=plan!$C$2:$C$12)*(S$3<=plan!$D$2:$D$12)),plan!$E$2:$E$12)","v":"tenis"},{"$f":"LOOKUP(1,1/(($B5=plan!$B$2:$B$12)*(T$3>=plan!$C$2:$C$12)*(T$3<=plan!$D$2:$D$12)),plan!$E$2:$E$12)","v":"tenis"},{"$f":"LOOKUP(1,1/(($B5=plan!$B$2:$B$12)*(U$3>=plan!$C$2:$C$12)*(U$3<=plan!$D$2:$D$12)),plan!$E$2:$E$12)","v":{"$error":"#N/A"}},{"$f":"LOOKUP(1,1/(($B5=plan!$B$2:$B$12)*(V$3>=plan!$C$2:$C$12)*(V$3<=plan!$D$2:$D$12)),plan!$E$2:$E$12)","v":{"$error":"#N/A"}},{"$f":"LOOKUP(1,1/(($B5=plan!$B$2:$B$12)*(W$3>=plan!$C$2:$C$12)*(W$3<=plan!$D$2:$D$12)),plan!$E$2:$E$12)","v":{"$error":"#N/A"}},{"$f":"LOOKUP(1,1/(($B5=plan!$B$2:$B$12)*(X$3>=plan!$C$2:$C$12)*(X$3<=plan!$D$2:$D$12)),plan!$E$2:$E$12)","v":{"$error":"#N/A"}},{"$f":"LOOKUP(1,1/(($B5=plan!$B$2:$B$12)*(Y$3>=plan!$C$2:$C$12)*(Y$3<=plan!$D$2:$D$12)),plan!$E$2:$E$12)","v":{"$error":"#N/A"}},{"$f":"LOOKUP(1,1/(($B5=plan!$B$2:$B$12)*(Z$3>=plan!$C$2:$C$12)*(Z$3<=plan!$D$2:$D$12)),plan!$E$2:$E$12)","v":{"$error":"#N/A"}},{"$f":"LOOKUP(1,1/(($B5=plan!$B$2:$B$12)*(AA$3>=plan!$C$2:$C$12)*(AA$3<=plan!$D$2:$D$12)),plan!$E$2:$E$12)","v":{"$error":"#N/A"}},{"$f":"LOOKUP(1,1/(($B5=plan!$B$2:$B$12)*(AB$3>=plan!$C$2:$C$12)*(AB$3<=plan!$D$2:$D$12)),plan!$E$2:$E$12)","v":{"$error":"#N/A"}},{"$f":"LOOKUP(1,1/(($B5=plan!$B$2:$B$12)*(AC$3>=plan!$C$2:$C$12)*(AC$3<=plan!$D$2:$D$12)),plan!$E$2:$E$12)","v":{"$error":"#N/A"}},{"$f":"LOOKUP(1,1/(($B5=plan!$B$2:$B$12)*(AD$3>=plan!$C$2:$C$12)*(AD$3<=plan!$D$2:$D$12)),plan!$E$2:$E$12)","v":{"$error":"#N/A"}},{"$f":"LOOKUP(1,1/(($B5=plan!$B$2:$B$12)*(AE$3>=plan!$C$2:$C$12)*(AE$3<=plan!$D$2:$D$12)),plan!$E$2:$E$12)","v":{"$error":"#N/A"}},{"$f":"LOOKUP(1,1/(($B5=plan!$B$2:$B$12)*(AF$3>=plan!$C$2:$C$12)*(AF$3<=plan!$D$2:$D$12)),plan!$E$2:$E$12)","v":{"$error":"#N/A"}},{"$f":"LOOKUP(1,1/(($B5=plan!$B$2:$B$12)*(AG$3>=plan!$C$2:$C$12)*(AG$3<=plan!$D$2:$D$12)),plan!$E$2:$E$12)","v":{"$error":"#N/A"}},{"$f":"LOOKUP(1,1/(($B5=plan!$B$2:$B$12)*(AH$3>=plan!$C$2:$C$12)*(AH$3<=plan!$D$2:$D$12)),plan!$E$2:$E$12)","v":{"$error":"#N/A"}},{"$f":"LOOKUP(1,1/(($B5=plan!$B$2:$B$12)*(AI$3>=plan!$C$2:$C$12)*(AI$3<=plan!$D$2:$D$12)),plan!$E$2:$E$12)","v":{"$error":"#N/A"}},{"$f":"LOOKUP(1,1/(($B5=plan!$B$2:$B$12)*(AJ$3>=plan!$C$2:$C$12)*(AJ$3<=plan!$D$2:$D$12)),plan!$E$2:$E$12)","v":{"$error":"#N/A"}},{"$f":"LOOKUP(1,1/(($B5=plan!$B$2:$B$12)*(AK$3>=plan!$C$2:$C$12)*(AK$3<=plan!$D$2:$D$12)),plan!$E$2:$E$12)","v":{"$error":"#N/A"}},{"$f":"LOOKUP(1,1/(($B5=plan!$B$2:$B$12)*(AL$3>=plan!$C$2:$C$12)*(AL$3<=plan!$D$2:$D$12)),plan!$E$2:$E$12)","v":{"$error":"#N/A"}},{"$f":"LOOKUP(1,1/(($B5=plan!$B$2:$B$12)*(AM$3>=plan!$C$2:$C$12)*(AM$3<=plan!$D$2:$D$12)),plan!$E$2:$E$12)","v":{"$error":"#N/A"}},{"$f":"LOOKUP(1,1/(($B5=plan!$B$2:$B$12)*(AN$3>=plan!$C$2:$C$12)*(AN$3<=plan!$D$2:$D$12)),plan!$E$2:$E$12)","v":{"$error":"#N/A"}},{"$f":"LOOKUP(1,1/(($B5=plan!$B$2:$B$12)*(AO$3>=plan!$C$2:$C$12)*(AO$3<=plan!$D$2:$D$12)),plan!$E$2:$E$12)","v":{"$error":"#N/A"}},{"$f":"LOOKUP(1,1/(($B5=plan!$B$2:$B$12)*(AP$3>=plan!$C$2:$C$12)*(AP$3<=plan!$D$2:$D$12)),plan!$E$2:$E$12)","v":{"$error":"#N/A"}},{"$f":"LOOKUP(1,1/(($B5=plan!$B$2:$B$12)*(AQ$3>=plan!$C$2:$C$12)*(AQ$3<=plan!$D$2:$D$12)),plan!$E$2:$E$12)","v":{"$error":"#N/A"}},{"$f":"LOOKUP(1,1/(($B5=plan!$B$2:$B$12)*(AR$3>=plan!$C$2:$C$12)*(AR$3<=plan!$D$2:$D$12)),plan!$E$2:$E$12)","v":{"$error":"#N/A"}},{"$f":"LOOKUP(1,1/(($B5=plan!$B$2:$B$12)*(AS$3>=plan!$C$2:$C$12)*(AS$3<=plan!$D$2:$D$12)),plan!$E$2:$E$12)","v":{"$error":"#N/A"}},{"$f":"LOOKUP(1,1/(($B5=plan!$B$2:$B$12)*(AT$3>=plan!$C$2:$C$12)*(AT$3<=plan!$D$2:$D$12)),plan!$E$2:$E$12)","v":{"$error":"#N/A"}},{"$f":"LOOKUP(1,1/(($B5=plan!$B$2:$B$12)*(AU$3>=plan!$C$2:$C$12)*(AU$3<=plan!$D$2:$D$12)),plan!$E$2:$E$12)","v":{"$error":"#N/A"}},{"$f":"LOOKUP(1,1/(($B5=plan!$B$2:$B$12)*(AV$3>=plan!$C$2:$C$12)*(AV$3<=plan!$D$2:$D$12)),plan!$E$2:$E$12)","v":{"$error":"#N/A"}},{"$f":"LOOKUP(1,1/(($B5=plan!$B$2:$B$12)*(AW$3>=plan!$C$2:$C$12)*(AW$3<=plan!$D$2:$D$12)),plan!$E$2:$E$12)","v":{"$error":"#N/A"}},{"$f":"LOOKUP(1,1/(($B5=plan!$B$2:$B$12)*(AX$3>=plan!$C$2:$C$12)*(AX$3<=plan!$D$2:$D$12)),plan!$E$2:$E$12)","v":{"$error":"#N/A"}},{"$f":"LOOKUP(1,1/(($B5=plan!$B$2:$B$12)*(AY$3>=plan!$C$2:$C$12)*(AY$3<=plan!$D$2:$D$12)),plan!$E$2:$E$12)","v":{"$error":"#N/A"}},{"$f":"LOOKUP(1,1/(($B5=plan!$B$2:$B$12)*(AZ$3>=plan!$C$2:$C$12)*(AZ$3<=plan!$D$2:$D$12)),plan!$E$2:$E$12)","v":{"$error":"#N/A"}}]

{"sheet":"obrazacVBA","index":2,"n_rows":17,"n_cols":52,"rows_kept":17,"cut":false,"hidden":false,"merged":[[1,0,3,0],[1,1,3,1],[1,2,3,2],[1,3,1,33],[1,34,1,51]]}
[]
["Red. br.","Prezime i ime","index","JANUAR",null,null,null,null,null,null,null,null,null,null,null,null,null,null,null,null,null,null,null,null,null,null,null,null,null,null,null,null,null,null,"FEBRUAR"]
[null,null,null,"2014-01-01",{"$f":"D3+1","v":"2014-01-02"},{"$f":"E3+1","v":"2014-01-03"},"2014-01-04","2014-01-05","2014-01-06","2014-01-07","2014-01-08","2014-01-09","2014-01-10","2014-01-11","2014-01-12","2014-01-13","2014-01-14","2014-01-15","2014-01-16","2014-01-17","2014-01-18","2014-01-19","2014-01-20","2014-01-21","2014-01-22","2014-01-23","2014-01-24","2014-01-25","2014-01-26","2014-01-27","2014-01-28","2014-01-29","2014-01-30","2014-01-31",{"$f":"AH3+1","v":"2014-02-01"},"2014-02-02","2014-02-03","2014-02-04","2014-02-05","2014-02-06","2014-02-07","2014-02-08","2014-02-09","2014-02-10","2014-02-11","2014-02-12","2014-02-13","2014-02-14","2014-02-15","2014-02-16","2014-02-17","2014-02-18"]
[null,null,null,{"$f":"TEXT(D3,\"ddd\")","v":"sre"},{"$f":"TEXT(E3,\"ddd\")","v":"čet"},"pet","sub","ned","pon","uto","sre","čet","pet","sub","ned","pon","uto","sre","čet","pet","sub","ned","pon","uto","sre","čet","pet","sub","ned","pon","uto","sre","čet",{"$f":"TEXT(AH3,\"ddd\")","v":"pet"},{"$f":"TEXT(AI3,\"ddd\")","v":"sub"},"ned","pon","uto","sre","čet","pet","sub","ned","pon","uto","sre","čet","pet","sub","ned","pon","uto"]
["1","Marko Marković"]
["2","Pero Perić"]
["3","Kosta Nikolić"]
["4","Nenad Jović"]
["5"]
["6"]
["7"]
["8"]
["9"]
["10"]
[]
[]
[null,null,null,{"$f":"Aktivnost(B6,D3)","v":"fudbal"}]

{"sheet":"cal","index":3,"n_rows":27,"n_cols":29,"rows_kept":27,"cut":false,"hidden":false,"merged":[[1,29,14,29],[10,1,10,6],[10,8,10,13],[10,15,10,20],[10,22,10,27],[19,1,19,6],[19,8,19,13],[19,15,19,20],[19,22,19,27],[0,0,0,28],[1,1,1,6],[1,8,1,13],[1,15,1,20],[1,22,1,27]]}
[2014]
[null,"JANUAR",null,null,null,null,null,null,"FEBRUAR",null,null,null,null,null,null,"MART",null,null,null,null,null,null,"APRIL"]
["P",{"$f":"IF(WEEKDAY(\"01-01-\" & $A$1,2)=1,1,\"\")","v":""},{"$f":"B9+1","v":6},{"$f":"C9+1","v":13},{"$f":"D9+1","v":20},{"$f":"E9+1","v":27},{"$f":"IF(OR(F9=31,F9=\"\"),\"\",F9+1)","v":""},null,{"$f":"IF(WEEKDAY(\"01-02-\" & $A$1,2)=1,1,\"\")","v":""},{"$f":"I9+1","v":3},{"$f":"J9+1","v":10},{"$f":"K9+1","v":17},{"$f":"IF(L9<28,L9+1,IF(AND($A$1<>1900,$A$1/4=TRUNC($A$1/4)),29,\"\"))","v":24},null,null,{"$f":"IF(WEEKDAY(\"1-3-\" & $A$1,2)=1,1,\"\")","v":""},{"$f":"P9+1","v":3},{"$f":"Q9+1","v":10},{"$f":"R9+1","v":17},{"$f":"S9+1","v":24},{"$f":"IF(OR(T9=31,T9=\"\"),\"\",T9+1)","v":31},null,{"$f":"IF(WEEKDAY(\"1-4-\" & $A$1,2)=1,1,\"\")","v":""},{"$f":"W9+1","v":7},{"$f":"X9+1","v":14},{"$f":"Y9+1","v":21},{"$f":"Z9+1","v":28},{"$f":"IF(OR(AA9=30,AA9=\"\"),\"\",AA9+1)","v":""},"P"]
["U",{"$f":"IF(B3<>\"\",B3+1,IF(WEEKDAY(\"1-1-\" & $A$1,2)=2,1,\"\"))","v":""},{"$f":"C3+1","v":7},{"$f":"D3+1","v":14},{"$f":"E3+1","v":21},{"$f":"F3+1","v":28},{"$f":"IF(OR(G3=31,G3=\"\"),\"\",G3+1)","v":""},null,{"$f":"IF(I3<>\"\",I3+1,IF(WEEKDAY(\"1-2-\" & $A$1,2)=2,1,\"\"))","v":""},{"$f":"J3+1","v":4},11,18,{"$f":"IF(OR(M3=\"\",M3=29),\"\",IF(M3<28,M3+1,IF(AND($A$1<>1900,$A$1/4=TRUNC($A$1/4)),29,\"\")))","v":25},null,null,{"$f":"IF(P3<>\"\",P3+1,IF(WEEKDAY(\"1-3-\" & $A$1,2)=2,1,\"\"))","v":""},{"$f":"Q3+1","v":4},11,18,25,{"$f":"IF(OR(U3=31,U3=\"\"),\"\",U3+1)","v":""},null,{"$f":"IF(W3<>\"\",W3+1,IF(WEEKDAY(\"1-4-\" & $A$1,2)=2,1,\"\"))","v":1},{"$f":"X3+1","v":8},{"$f":"Y3+1","v":15},{"$f":"Z3+1","v":22},{"$f":"AA3+1","v":29},null,"U"]
["S",{"$f":"IF(B4<>\"\",B4+1,IF(WEEKDAY(\"1-1-\" & $A$1,2)=3,1,\"\"))","v":1},{"$f":"C4+1","v":8},15,22,29,null,null,{"$f":"IF(I4<>\"\",I4+1,IF(WEEKDAY(\"1-2-\" & $A$1,2)=3,1,\"\"))","v":""},5,12,19,26,null,null,{"$f":"IF(P4<>\"\",P4+1,IF(WEEKDAY(\"1-3-\" & $A$1,2)=3,1,\"\"))","v":""},5,12,19,26,null,null,{"$f":"IF(W4<>\"\",W4+1,IF(WEEKDAY(\"1-4-\" & $A$1,2)=3,1,\"\"))","v":2},{"$f":"X4+1","v":9},16,23,{"$f":"IF(AA4=30,\"\",AA4+1)","v":30},null,"S"]
["Č",{"$f":"IF(B5<>\"\",B5+1,IF(WEEKDAY(\"1-1-\" & $A$1,2)=4,1,\"\"))","v":2},9,16,23,{"$f":"IF(F5=31,\"\",F5+1)","v":30},null,null,{"$f":"IF(I5<>\"\",I5+1,IF(WEEKDAY(\"1-2-\" & $A$1,2)=4,1,\"\"))","v":""},6,13,20,27,null,null,{"$f":"IF(P5<>\"\",P5+1,IF(WEEKDAY(\"1-3-\" & $A$1,2)=4,1,\"\"))","v":""},6,13,20,{"$f":"IF(T5=31,\"\",T5+1)","v":27},null,null,{"$f":"IF(W5<>\"\",W5+1,IF(WEEKDAY(\"1-4-\" & $A$1,2)=4,1,\"\"))","v":3},10,17,24,{"$f":"IF(OR(AA5=30,AA5=\"\"),\"\",AA5+1)","v":""},null,"Č"]
["P",{"$f":"IF(B6<>\"\",B6+1,IF(WEEKDAY(\"1-1-\" & $A$1,2)=5,1,\"\"))","v":3},10,17,24,{"$f":"IF(OR(F6=31,F6=\"\"),\"\",F6+1)","v":31},null,null,{"$f":"IF(I6<>\"\",I6+1,IF(WEEKDAY(\"1-2-\" & $A$1,2)=5,1,\"\"))","v":""},7,14,21,28,null,null,{"$f":"IF(P6<>\"\",P6+1,IF(WEEKDAY(\"1-3-\" & $A$1,2)=5,1,\"\"))","v":""},7,14,21,{"$f":"IF(OR(T6=31,T6=\"\"),\"\",T6+1)","v":28},null,null,{"$f":"IF(W6<>\"\",W6+1,IF(WEEKDAY(\"1-4-\" & $A$1,2)=5,1,\"\"))","v":4},11,18,25,{"$f":"IF(OR(AA6=30,AA6=\"\"),\"\",AA6+1)","v":""},null,"P"]
["S",{"$f":"IF(B7<>\"\",B7+1,IF(WEEKDAY(\"1-1-\" & $A$1,2)=6,1,\"\"))","v":4},11,18,25,{"$f":"IF(OR(F7=31,F7=\"\"),\"\",F7+1)","v":""},null,null,{"$f":"IF(I7<>\"\",I7+1,IF(WEEKDAY(\"1-2-\" & $A$1,2)=6,1,\"\"))","v":1},8,15,22,"",null,null,{"$f":"IF(P7<>\"\",P7+1,IF(WEEKDAY(\"1-3-\" & $A$1,2)=6,1,\"\"))","v":1},8,15,22,{"$f":"IF(OR(T7=31,T7=\"\"),\"\",T7+1)","v":29},null,null,{"$f":"IF(W7<>\"\",W7+1,IF(WEEKDAY(\"1-4-\" & $A$1,2)=6,1,\"\"))","v":5},12,19,26,{"$f":"IF(OR(AA7=30,AA7=\"\"),\"\",AA7+1)","v":""},null,"S"]
["N",{"$f":"IF(B8<>\"\",B8+1,IF(WEEKDAY(\"1-1-\" & $A$1,2)=7,1,\"\"))","v":5},12,19,26,{"$f":"IF(OR(F8=31,F8=\"\"),\"\",F8+1)","v":""},null,null,{"$f":"IF(I8<>\"\",I8+1,IF(WEEKDAY(\"1-2-\" & $A$1,2)=7,1,\"\"))","v":2},9,16,23,"",null,null,{"$f":"IF(P8<>\"\",P8+1,IF(WEEKDAY(\"1-3-\" & $A$1,2)=7,1,\"\"))","v":2},9,16,23,{"$f":"IF(OR(T8=31,T8=\"\"),\"\",T8+1)","v":30},null,null,{"$f":"IF(W8<>\"\",W8+1,IF(WEEKDAY(\"1-4-\" & $A$1,2)=7,1,\"\"))","v":6},13,20,27,{"$f":"IF(OR(AA8=30,AA8=\"\"),\"\",AA8+1)","v":""},null,"N"]
[]
[null,"MAJ",null,null,null,null,null,null,"JUN",null,null,null,null,null,null,"JUL",null,null,null,null,null,null,"AVGUST"]
["P",{"$f":"IF(WEEKDAY(\"1-5-\" & $A$1,2)=1,1,\"\")","v":""},{"$f":"B18+1","v":5},{"$f":"C18+1","v":12},{"$f":"D18+1","v":19},{"$f":"E18+1","v":26},{"$f":"IF(OR(F18=31,F18=\"\"),\"\",F18+1)","v":""},null,{"$f":"IF(WEEKDAY(\"1-6-\" & $A$1,2)=1,1,\"\")","v":""},{"$f":"I18+1","v":2},{"$f":"J18+1","v":9},{"$f":"K18+1","v":16},{"$f":"L18+1","v":23},{"$f":"IF(OR(M18=30,M18=\"\"),\"\",M18+1)","v":30},null,{"$f":"IF(WEEKDAY(\"1-7-\" & $A$1,2)=1,1,\"\")","v":""},{"$f":"P18+1","v":7},{"$f":"Q18+1","v":14},{"$f":"R18+1","v":21},{"$f":"S18+1","v":28},{"$f":"IF(OR(T18=31,T18=\"\"),\"\",T18+1)","v":""},null,{"$f":"IF(WEEKDAY(\"1-8-\" & $A$1,2)=1,1,\"\")","v":""},{"$f":"W18+1","v":4},{"$f":"X18+1","v":11},{"$f":"Y18+1","v":18},{"$f":"Z18+1","v":25},{"$f":"IF(OR(AA18=31,AA18=\"\"),\"\",AA18+1)","v":""},"P"]
["U",{"$f":"IF(B12<>\"\",B12+1,IF(WEEKDAY(\"1-5-\" & $A$1,2)=2,1,\"\"))","v":""},{"$f":"C12+1","v":6},13,20,27,{"$f":"IF(OR(G12=31,G12=\"\"),\"\",G12+1)","v":""},null,{"$f":"IF(I12<>\"\",I12+1,IF(WEEKDAY(\"1-6-\" & $A$1,2)=2,1,\"\"))","v":""},{"$f":"J12+1","v":3},{"$f":"K12+1","v":10},{"$f":"L12+1","v":17},{"$f":"M12+1","v":24},null,null,{"$f":"IF(P12<>\"\",P12+1,IF(WEEKDAY(\"1-7-\" & $A$1,2)=2,1,\"\"))","v":1},{"$f":"Q12+1","v":8},15,22,29,{"$f":"IF(OR(U12=31,U12=\"\"),\"\",U12+1)","v":""},null,{"$f":"IF(W12<>\"\",W12+1,IF(WEEKDAY(\"1-8-\" & $A$1,2)=2,1,\"\"))","v":""},{"$f":"X12+1","v":5},12,19,26,{"$f":"IF(OR(AB12=31,AB12=\"\"),\"\",AB12+1)","v":""},"U"]
["S",{"$f":"IF(B13<>\"\",B13+1,IF(WEEKDAY(\"1-5-\" & $A$1,2)=3,1,\"\"))","v":""},7,14,21,28,null,null,{"$f":"IF(I13<>\"\",I13+1,IF(WEEKDAY(\"1-6-\" & $A$1,2)=3,1,\"\"))","v":""},{"$f":"J13+1","v":4},11,18,{"$f":"IF(M13=30,\"\",M13+1)","v":25},null,null,{"$f":"IF(P13<>\"\",P13+1,IF(WEEKDAY(\"1-7-\" & $A$1,2)=3,1,\"\"))","v":2},9,16,23,30,null,null,{"$f":"IF(W13<>\"\",W13+1,IF(WEEKDAY(\"1-8-\" & $A$1,2)=3,1,\"\"))","v":""},6,13,20,27,null,"S"]
["Č",{"$f":"IF(B14<>\"\",B14+1,IF(WEEKDAY(\"1-5-\" & $A$1,2)=4,1,\"\"))","v":1},8,15,22,{"$f":"IF(F14=31,\"\",F14+1)","v":29},null,null,{"$f":"IF(I14<>\"\",I14+1,IF(WEEKDAY(\"1-6-\" & $A$1,2)=4,1,\"\"))","v":""},5,12,19,{"$f":"IF(OR(M14=30,M14=\"\"),\"\",M14+1)","v":26},null,null,{"$f":"IF(P14<>\"\",P14+1,IF(WEEKDAY(\"1-7-\" & $A$1,2)=4,1,\"\"))","v":3},10,17,24,{"$f":"IF(T14=31,\"\",T14+1)","v":31},null,null,{"$f":"IF(W14<>\"\",W14+1,IF(WEEKDAY(\"1-8-\" & $A$1,2)=4,1,\"\"))","v":""},7,14,21,{"$f":"IF(AA14=31,\"\",AA14+1)","v":28},null,"Č"]
["P",{"$f":"IF(B15<>\"\",B15+1,IF(WEEKDAY(\"1-5-\" & $A$1,2)=5,1,\"\"))","v":2},9,16,23,{"$f":"IF(OR(F15=31,F15=\"\"),\"\",F15+1)","v":30},null,null,{"$f":"IF(I15<>\"\",I15+1,IF(WEEKDAY(\"1-6-\" & $A$1,2)=5,1,\"\"))","v":""},6,13,20,{"$f":"IF(OR(M15=30,M15=\"\"),\"\",M15+1)","v":27},null,null,{"$f":"IF(P15<>\"\",P15+1,IF(WEEKDAY(\"1-7-\" & $A$1,2)=5,1,\"\"))","v":4},11,18,25,{"$f":"IF(OR(T15=31,T15=\"\"),\"\",T15+1)","v":""},null,null,{"$f":"IF(W15<>\"\",W15+1,IF(WEEKDAY(\"1-8-\" & $A$1,2)=5,1,\"\"))","v":1},8,15,22,{"$f":"IF(OR(AA15=31,AA15=\"\"),\"\",AA15+1)","v":29},null,"P"]
["S",{"$f":"IF(B16<>\"\",B16+1,IF(WEEKDAY(\"1-5-\" & $A$1,2)=6,1,\"\"))","v":3},10,17,24,{"$f":"IF(OR(F16=31,F16=\"\"),\"\",F16+1)","v":31},null,null,{"$f":"IF(I16<>\"\",I16+1,IF(WEEKDAY(\"1-6-\" & $A$1,2)=6,1,\"\"))","v":""},7,14,21,{"$f":"IF(OR(M16=30,M16=\"\"),\"\",M16+1)","v":28},null,null,{"$f":"IF(P16<>\"\",P16+1,IF(WEEKDAY(\"1-7-\" & $A$1,2)=6,1,\"\"))","v":5},12,19,26,{"$f":"IF(OR(T16=31,T16=\"\"),\"\",T16+1)","v":""},null,null,{"$f":"IF(W16<>\"\",W16+1,IF(WEEKDAY(\"1-8-\" & $A$1,2)=6,1,\"\"))","v":2},9,16,23,{"$f":"IF(OR(AA16=31,AA16=\"\"),\"\",AA16+1)","v":30},null,"S"]
["N",{"$f":"IF(B17<>\"\",B17+1,IF(WEEKDAY(\"1-5-\" & $A$1,2)=7,1,\"\"))","v":4},11,18,25,{"$f":"IF(OR(F17=31,F17=\"\"),\"\",F17+1)","v":""},null,null,{"$f":"IF(I17<>\"\",I17+1,IF(WEEKDAY(\"1-6-\" & $A$1,2)=7,1,\"\"))","v":1},8,15,22,{"$f":"IF(OR(M17=30,M17=\"\"),\"\",M17+1)","v":29},null,null,{"$f":"IF(P17<>\"\",P17+1,IF(WEEKDAY(\"1-7-\" & $A$1,2)=7,1,\"\"))","v":6},13,20,27,{"$f":"IF(OR(T17=31,T17=\"\"),\"\",T17+1)","v":""},null,null,{"$f":"IF(W17<>\"\",W17+1,IF(WEEKDAY(\"1-8-\" & $A$1,2)=7,1,\"\"))","v":3},10,17,24,{"$f":"IF(OR(AA17=31,AA17=\"\"),\"\",AA17+1)","v":31},null,"N"]
[]
[null,"SEPTEMBAR",null,null,null,null,null,null,"OKTOBAR",null,null,null,null,null,null,"NOVEMBAR",null,null,null,null,null,null,"DECEMBAR"]
["P",{"$f":"IF(WEEKDAY(\"1-9-\" & $A$1,2)=1,1,\"\")","v":1},{"$f":"B27+1","v":8},{"$f":"C27+1","v":15},{"$f":"D27+1","v":22},{"$f":"E27+1","v":29},{"$f":"IF(OR(F27=30,F27=\"\"),\"\",F27+1)","v":""},null,{"$f":"IF(WEEKDAY(\"1-10-\" & $A$1,2)=1,1,\"\")","v":""},{"$f":"I27+1","v":6},{"$f":"J27+1","v":13},{"$f":"K27+1","v":20},{"$f":"L27+1","v":27},{"$f":"IF(OR(M27=31,M27=\"\"),\"\",M27+1)","v":""},null,{"$f":"IF(WEEKDAY(\"1-11-\" & $A$1,2)=1,1,\"\")","v":""},{"$f":"P27+1","v":3},{"$f":"Q27+1","v":10},{"$f":"R27+1","v":17},{"$f":"S27+1","v":24},{"$f":"IF(OR(T27=30,T27=\"\"),\"\",T27+1)","v":""},null,{"$f":"IF(WEEKDAY(\"1-12-\" & $A$1,2)=1,1,\"\")","v":1},{"$f":"W27+1","v":8},{"$f":"X27+1","v":15},{"$f":"Y27+1","v":22},{"$f":"Z27+1","v":29},{"$f":"IF(OR(AA27=31,AA27=\"\"),\"\",AA27+1)","v":""},"P"]
["U",{"$f":"IF(B21<>\"\",B21+1,IF(WEEKDAY(\"1-9-\" & $A$1,2)=2,1,\"\"))","v":2},{"$f":"C21+1","v":9},{"$f":"D21+1","v":16},{"$f":"E21+1","v":23},{"$f":"F21+1","v":30},null,null,{"$f":"IF(I21<>\"\",I21+1,IF(WEEKDAY(\"1-10-\" & $A$1,2)=2,1,\"\"))","v":""},{"$f":"J21+1","v":7},14,21,28,{"$f":"IF(OR(N21=31,N21=\"\"),\"\",N21+1)","v":""},null,{"$f":"IF(P21<>\"\",P21+1,IF(WEEKDAY(\"1-11-\" & $A$1,2)=2,1,\"\"))","v":""},{"$f":"Q21+1","v":4},{"$f":"R21+1","v":11},{"$f":"S21+1","v":18},{"$f":"T21+1","v":25},null,null,{"$f":"IF(W21<>\"\",W21+1,IF(WEEKDAY(\"1-12-\" & $A$1,2)=2,1,\"\"))","v":2},{"$f":"X21+1","v":9},16,23,30,{"$f":"IF(OR(AB21=31,AB21=\"\"),\"\",AB21+1)","v":""},"U"]
["S",{"$f":"IF(B22<>\"\",B22+1,IF(WEEKDAY(\"1-9-\" & $A$1,2)=3,1,\"\"))","v":3},{"$f":"C22+1","v":10},17,24,{"$f":"IF(F22=30,\"\",F22+1)","v":""},null,null,{"$f":"IF(I22<>\"\",I22+1,IF(WEEKDAY(\"1-10-\" & $A$1,2)=3,1,\"\"))","v":1},8,15,22,29,null,null,{"$f":"IF(P22<>\"\",P22+1,IF(WEEKDAY(\"1-11-\" & $A$1,2)=3,1,\"\"))","v":""},{"$f":"Q22+1","v":5},12,19,{"$f":"IF(T22=30,\"\",T22+1)","v":26},null,null,{"$f":"IF(W22<>\"\",W22+1,IF(WEEKDAY(\"1-12-\" & $A$1,2)=3,1,\"\"))","v":3},10,17,24,31,null,"S"]
["Č",{"$f":"IF(B23<>\"\",B23+1,IF(WEEKDAY(\"1-9-\" & $A$1,2)=4,1,\"\"))","v":4},11,18,25,{"$f":"IF(OR(F23=30,F23=\"\"),\"\",F23+1)","v":""},null,null,{"$f":"IF(I23<>\"\",I23+1,IF(WEEKDAY(\"1-10-\" & $A$1,2)=4,1,\"\"))","v":2},9,16,23,{"$f":"IF(M23=31,\"\",M23+1)","v":30},null,null,{"$f":"IF(P23<>\"\",P23+1,IF(WEEKDAY(\"1-11-\" & $A$1,2)=4,1,\"\"))","v":""},6,13,20,{"$f":"IF(OR(T23=30,T23=\"\"),\"\",T23+1)","v":27},null,null,{"$f":"IF(W23<>\"\",W23+1,IF(WEEKDAY(\"1-12-\" & $A$1,2)=4,1,\"\"))","v":4},11,18,25,{"$f":"IF(AA23=31,\"\",AA23+1)","v":""},null,"Č"]
["P",{"$f":"IF(B24<>\"\",B24+1,IF(WEEKDAY(\"1-9-\" & $A$1,2)=5,1,\"\"))","v":5},12,19,26,{"$f":"IF(OR(F24=30,F24=\"\"),\"\",F24+1)","v":""},null,null,{"$f":"IF(I24<>\"\",I24+1,IF(WEEKDAY(\"1-10-\" & $A$1,2)=5,1,\"\"))","v":3},10,17,24,{"$f":"IF(OR(M24=31,M24=\"\"),\"\",M24+1)","v":31},null,null,{"$f":"IF(P24<>\"\",P24+1,IF(WEEKDAY(\"1-11-\" & $A$1,2)=5,1,\"\"))","v":""},7,14,21,{"$f":"IF(OR(T24=30,T24=\"\"),\"\",T24+1)","v":28},null,null,{"$f":"IF(W24<>\"\",W24+1,IF(WEEKDAY(\"1-12-\" & $A$1,2)=5,1,\"\"))","v":5},12,19,26,{"$f":"IF(OR(AA24=31,AA24=\"\"),\"\",AA24+1)","v":""},null,"P"]
["S",{"$f":"IF(B25<>\"\",B25+1,IF(WEEKDAY(\"1-9-\" & $A$1,2)=6,1,\"\"))","v":6},13,20,27,{"$f":"IF(OR(F25=30,F25=\"\"),\"\",F25+1)","v":""},null,null,{"$f":"IF(I25<>\"\",I25+1,IF(WEEKDAY(\"1-10-\" & $A$1,2)=6,1,\"\"))","v":4},11,18,25,{"$f":"IF(OR(M25=31,M25=\"\"),\"\",M25+1)","v":""},null,null,{"$f":"IF(P25<>\"\",P25+1,IF(WEEKDAY(\"1-11-\" & $A$1,2)=6,1,\"\"))","v":1},8,15,22,{"$f":"IF(OR(T25=30,T25=\"\"),\"\",T25+1)","v":29},null,null,{"$f":"IF(W25<>\"\",W25+1,IF(WEEKDAY(\"1-12-\" & $A$1,2)=6,1,\"\"))","v":6},13,20,27,{"$f":"IF(OR(AA25=31,AA25=\"\"),\"\",AA25+1)","v":""},null,"S"]
["N",{"$f":"IF(B26<>\"\",B26+1,IF(WEEKDAY(\"1-9-\" & $A$1,2)=7,1,\"\"))","v":7},14,21,28,{"$f":"IF(OR(F26=30,F26=\"\"),\"\",F26+1)","v":""},null,null,{"$f":"IF(I26<>\"\",I26+1,IF(WEEKDAY(\"1-10-\" & $A$1,2)=7,1,\"\"))","v":5},12,19,26,{"$f":"IF(OR(M26=31,M26=\"\"),\"\",M26+1)","v":""},null,null,{"$f":"IF(P26<>\"\",P26+1,IF(WEEKDAY(\"1-11-\" & $A$1,2)=7,1,\"\"))","v":2},9,16,23,{"$f":"IF(OR(T26=30,T26=\"\"),\"\",T26+1)","v":30},null,null,{"$f":"IF(W26<>\"\",W26+1,IF(WEEKDAY(\"1-12-\" & $A$1,2)=7,1,\"\"))","v":7},14,21,28,{"$f":"IF(OR(AA26=31,AA26=\"\"),\"\",AA26+1)","v":""},null,"N"]