{"text_format":"1","workbook":"xlsx","n_sheets":6,"sheets":["faktura","artikli","kupci","baza","Podesavanja","pomoc"],"not_rendered":{"charts":0,"images":15,"macros":1,"external_links":0,"defined_names":12,"comments":1,"pivot_tables":0},"unopened":[],"bounds":{"document_bytes":16777216,"sheet_cells":100000,"rows_first":2000,"rows_last":500,"rows_between":2000,"halvings":0,"cell_chars":16384,"cell_head_chars":4096},"cells_cut":0,"cells_raw":0,"read":"whole","date_system":"1900"}

{"sheet":"faktura","index":0,"n_rows":49,"n_cols":9,"rows_kept":49,"cut":false,"hidden":false,"merged":[[10,10,11,10]]}
[]
[null,"Naziv:",{"$f":"Podesavanja!B2","v":"MOJA FIRMA"},null,null,null,"Tekući račun:",null,{"$f":"Podesavanja!B7","v":"12345654879"}]
[{"$f":"Podesavanja!B17","v":1},"Adresa",{"$f":"Podesavanja!B3","v":"Moja ulica bb"},null,null,null,"MB broj:",null,{"$f":"Podesavanja!B6","v":"98765432112"}]
[null,"Mjesto",{"$f":"Podesavanja!B4","v":"Moj Grad"},null,null,null,"Telefon:",null,{"$f":"Podesavanja!B7","v":"12345654879"}]
[null,"PDV br:",{"$f":"Podesavanja!B5","v":"123123123123"}]
[]
[]
[null,1]
[null,null,null,null,null,null,null,"Datum računa:"]
[null,"Naziv:",{"$f":"IF(B8>0,(VLOOKUP(B8,kupci!$A$2:$G$1000,2,)),)","v":"PROBNI KUPAC"}]
[null,"Adresa:",{"$f":"IF(B8>0,(VLOOKUP(B8,kupci!$A$2:$G$1000,4,)),)","v":"Gore Dole"},null,null,null,null,"Datum dospjeća:",{"$f":"I9+Podesavanja!B12","v":"1900-01-10"}]
[null,"Mjesto:",{"$f":"IF(B8>0,(VLOOKUP(B8,kupci!$A$2:$G$1000,5,)),)","v":"NEKI GRAD"}]
[null,"PDV br:",{"$f":"IF(B8>0,(VLOOKUP(B8,kupci!$A$2:$G$1000,3,)),)","v":"123456789"},null,null,null,null,"Način plaćanja:",{"$f":"Podesavanja!B13","v":"Virman"}]
[null,"Tel:",{"$f":"IF(B8>0,(VLOOKUP(B8,kupci!$A$2:$G$1000,6,)),)","v":"0038730256457"}]
[null,"Fax:",{"$f":"IF(B8>0,(VLOOKUP(B8,kupci!$A$2:$G$1000,7,)),)","v":"00387653154"},null,null,null,null,"Mjesto izdavanja:",{"$f":"Podesavanja!B4","v":"Moj Grad"}]
[]
[]
[]
[null,null,"Faktura br:",{"$f":"A3","v":1},"-",2012]
[null,null,null,null,null,null,"Broj fiskalnog računa"]
[]
[null,null,null,null,null,null,"PDV"]
[null,"R. br.","Naziv proizvoda / usluge","Šifra","Kol.",{"$f":"IF(Podesavanja!B14=1,\"Cijena bez PDV\",\"Cijena sa PDV\")","v":"Cijena bez PDV"},{"$f":"Podesavanja!B10","v":0.17},{"$f":"IF(Podesavanja!B14=1,\"Cijena sa PDV\",\"Cijena bez PDV\")","v":"Cijena sa PDV"},"Ukupan iznos"]
[]
[null,null,{"$f":"IF(D25=\"\",\"\",VLOOKUP(D25,artikli!$A$2:$C$65536,2,FALSE))","v":"Kruška"},22,1,{"$f":"IF(D25=\"\",0,VLOOKUP(D25,artikli!$A$2:$C$65536,3,FALSE))","v":180},{"$f":"IF(Podesavanja!B14=1,E25*F25*Podesavanja!B10,E25*F25*Podesavanja!B11)","v":30.6},{"$f":"IF(Podesavanja!B14=1,E25*F25+G25,IF(Podesavanja!B14=2,E25*F25-(E25*F25*Podesavanja!B11)))","v":210.6},{"$f":"IF(Podesavanja!B14=1,E25*F25+G25,IF(Podesavanja!B14=2,E25*F25))","v":210.6}]
[null,null,{"$f":"IF(D26=\"\",\"\",VLOOKUP(D26,artikli!$A$2:$C$65536,2,FALSE))","v":""},null,null,{"$f":"IF(D26=\"\",0,VLOOKUP(D26,artikli!$A$2:$C$65536,3,FALSE))","v":0},{"$f":"IF(Podesavanja!B14=1,E26*F26*Podesavanja!B10,E26*F26*Podesavanja!B11)","v":0},{"$f":"IF(Podesavanja!B14=1,E26*F26+G26,IF(Podesavanja!B14=2,E26*F26-(E26*F26*Podesavanja!B11)))","v":0},{"$f":"IF(Podesavanja!B14=1,E26*F26+G26,IF(Podesavanja!B14=2,E26*F26))","v":0}]
[null,null,{"$f":"IF(D27=\"\",\"\",VLOOKUP(D27,artikli!$A$2:$C$65536,2,FALSE))","v":""},null,null,{"$f":"IF(D27=\"\",0,VLOOKUP(D27,artikli!$A$2:$C$65536,3,FALSE))","v":0},{"$f":"IF(Podesavanja!B14=1,E27*F27*Podesavanja!B10,E27*F27*Podesavanja!B11)","v":0},{"$f":"IF(Podesavanja!B14=1,E27*F27+G27,IF(Podesavanja!B14=2,E27*F27-(E27*F27*Podesavanja!B11)))","v":0},{"$f":"IF(Podesavanja!B14=1,E27*F27+G27,IF(Podesavanja!B14=2,E27*F27))","v":0}]
[null,null,{"$f":"IF(D28=\"\",\"\",VLOOKUP(D28,artikli!$A$2:$C$65536,2,FALSE))","v":""},null,null,{"$f":"IF(D28=\"\",0,VLOOKUP(D28,artikli!$A$2:$C$65536,3,FALSE))","v":0},{"$f":"IF(Podesavanja!B14=1,E28*F28*Podesavanja!B10,E28*F28*Podesavanja!B11)","v":0},{"$f":"IF(Podesavanja!B14=1,E28*F28+G28,IF(Podesavanja!B14=2,E28*F28-(E28*F28*Podesavanja!B11)))","v":0},{"$f":"IF(Podesavanja!B14=1,E28*F28+G28,IF(Podesavanja!B14=2,E28*F28))","v":0}]
[null,null,{"$f":"IF(D29=\"\",\"\",VLOOKUP(D29,artikli!$A$2:$C$65536,2,FALSE))","v":""},null,null,{"$f":"IF(D29=\"\",0,VLOOKUP(D29,artikli!$A$2:$C$65536,3,FALSE))","v":0},{"$f":"IF(Podesavanja!B14=1,E29*F29*Podesavanja!B10,E29*F29*Podesavanja!B11)","v":0},{"$f":"IF(Podesavanja!B14=1,E29*F29+G29,IF(Podesavanja!B14=2,E29*F29-(E29*F29*Podesavanja!B11)))","v":0},{"$f":"IF(Podesavanja!B14=1,E29*F29+G29,IF(Podesavanja!B14=2,E29*F29))","v":0}]
[null,null,{"$f":"IF(D30=\"\",\"\",VLOOKUP(D30,artikli!$A$2:$C$65536,2,FALSE))","v":""},null,null,{"$f":"IF(D30=\"\",0,VLOOKUP(D30,artikli!$A$2:$C$65536,3,FALSE))","v":0},{"$f":"IF(Podesavanja!B14=1,E30*F30*Podesavanja!B10,E30*F30*Podesavanja!B11)","v":0},{"$f":"IF(Podesavanja!B14=1,E30*F30+G30,IF(Podesavanja!B14=2,E30*F30-(E30*F30*Podesavanja!B11)))","v":0},{"$f":"IF(Podesavanja!B14=1,E30*F30+G30,IF(Podesavanja!B14=2,E30*F30))","v":0}]
[null,null,{"$f":"IF(D31=\"\",\"\",VLOOKUP(D31,artikli!$A$2:$C$65536,2,FALSE))","v":""},null,null,{"$f":"IF(D31=\"\",0,VLOOKUP(D31,artikli!$A$2:$C$65536,3,FALSE))","v":0},{"$f":"IF(Podesavanja!B14=1,E31*F31*Podesavanja!B10,E31*F31*Podesavanja!B11)","v":0},{"$f":"IF(Podesavanja!B14=1,E31*F31+G31,IF(Podesavanja!B14=2,E31*F31-(E31*F31*Podesavanja!B11)))","v":0},{"$f":"IF(Podesavanja!B14=1,E31*F31+G31,IF(Podesavanja!B14=2,E31*F31))","v":0}]
[null,null,{"$f":"IF(D32=\"\",\"\",VLOOKUP(D32,artikli!$A$2:$C$65536,2,FALSE))","v":""},null,null,{"$f":"IF(D32=\"\",0,VLOOKUP(D32,artikli!$A$2:$C$65536,3,FALSE))","v":0},{"$f":"IF(Podesavanja!B14=1,E32*F32*Podesavanja!B10,E32*F32*Podesavanja!B11)","v":0},{"$f":"IF(Podesavanja!B14=1,E32*F32+G32,IF(Podesavanja!B14=2,E32*F32-(E32*F32*Podesavanja!B11)))","v":0},{"$f":"IF(Podesavanja!B14=1,E32*F32+G32,IF(Podesavanja!B14=2,E32*F32))","v":0}]
[null,null,{"$f":"IF(D33=\"\",\"\",VLOOKUP(D33,artikli!$A$2:$C$65536,2,FALSE))","v":""},null,null,{"$f":"IF(D33=\"\",0,VLOOKUP(D33,artikli!$A$2:$C$65536,3,FALSE))","v":0},{"$f":"IF(Podesavanja!B14=1,E33*F33*Podesavanja!B10,E33*F33*Podesavanja!B11)","v":0},{"$f":"IF(Podesavanja!B14=1,E33*F33+G33,IF(Podesavanja!B14=2,E33*F33-(E33*F33*Podesavanja!B11)))","v":0},{"$f":"IF(Podesavanja!B14=1,E33*F33+G33,IF(Podesavanja!B14=2,E33*F33))","v":0}]
[null,null,{"$f":"IF(D34=\"\",\"\",VLOOKUP(D34,artikli!$A$2:$C$65536,2,FALSE))","v":""},null,null,{"$f":"IF(D34=\"\",0,VLOOKUP(D34,artikli!$A$2:$C$65536,3,FALSE))","v":0},{"$f":"IF(Podesavanja!B14=1,E34*F34*Podesavanja!B10,E34*F34*Podesavanja!B11)","v":0},{"$f":"IF(Podesavanja!B14=1,E34*F34+G34,IF(Podesavanja!B14=2,E34*F34-(E34*F34*Podesavanja!B11)))","v":0},{"$f":"IF(Podesavanja!B14=1,E34*F34+G34,IF(Podesavanja!B14=2,E34*F34))","v":0}]
[null,null,{"$f":"IF(D35=\"\",\"\",VLOOKUP(D35,artikli!$A$2:$C$65536,2,FALSE))","v":""},null,null,{"$f":"IF(D35=\"\",0,VLOOKUP(D35,artikli!$A$2:$C$65536,3,FALSE))","v":0},{"$f":"IF(Podesavanja!B14=1,E35*F35*Podesavanja!B10,E35*F35*Podesavanja!B11)","v":0},{"$f":"IF(Podesavanja!B14=1,E35*F35+G35,IF(Podesavanja!B14=2,E35*F35-(E35*F35*Podesavanja!B11)))","v":0},{"$f":"IF(Podesavanja!B14=1,E35*F35+G35,IF(Podesavanja!B14=2,E35*F35))","v":0}]
[null,null,{"$f":"IF(D36=\"\",\"\",VLOOKUP(D36,artikli!$A$2:$C$65536,2,FALSE))","v":""},null,null,{"$f":"IF(D36=\"\",0,VLOOKUP(D36,artikli!$A$2:$C$65536,3,FALSE))","v":0},{"$f":"IF(Podesavanja!B14=1,E36*F36*Podesavanja!B10,E36*F36*Podesavanja!B11)","v":0},{"$f":"IF(Podesavanja!B14=1,E36*F36+G36,IF(Podesavanja!B14=2,E36*F36-(E36*F36*Podesavanja!B11)))","v":0},{"$f":"IF(Podesavanja!B14=1,E36*F36+G36,IF(Podesavanja!B14=2,E36*F36))","v":0}]
[null,null,{"$f":"IF(D37=\"\",\"\",VLOOKUP(D37,artikli!$A$2:$C$65536,2,FALSE))","v":""},null,null,{"$f":"IF(D37=\"\",0,VLOOKUP(D37,artikli!$A$2:$C$65536,3,FALSE))","v":0},{"$f":"IF(Podesavanja!B14=1,E37*F37*Podesavanja!B10,E37*F37*Podesavanja!B11)","v":0},{"$f":"IF(Podesavanja!B14=1,E37*F37+G37,IF(Podesavanja!B14=2,E37*F37-(E37*F37*Podesavanja!B11)))","v":0},{"$f":"IF(Podesavanja!B14=1,E37*F37+G37,IF(Podesavanja!B14=2,E37*F37))","v":0}]
[null,null,null,null,null,null,null,"Ukupno bez PDV",{"$f":"IF(Podesavanja!B14=1,E25*F25+E26*F26+E27*F27+E28*F28+E29*F29+E30*F30+E31*F31+E32*F32+E33*F33+E34*F34+E35*F35+E36*F36+E37*F37,IF(Podesavanja!B14=2,SUM(H25:H37)))","v":180}]
[null,null,null,null,null,null,"PDV",{"$f":"Podesavanja!B10","v":0.17},{"$f":"SUM(G25:G37)","v":30.6}]
[null,null,"Slovima:",null,null,null,null,"UKUPNO SA PDV ",{"$f":"I38+I39","v":210.6}]
[null,null,{"$f":"Slovima(I40)","v":"dvijestotinedeset KM i  60 pf. "}]
[]
[]
[null,"Poziv na broj za plaćanje:",null,null,null,null,null,{"$f":"RIGHT(E19,4)","v":"-"}]
[]
[]
[null,"Fakturirao:",null,null,"MP.",null,null,"Direktor:"]
[]
[null,".........................."]

{"sheet":"artikli","index":1,"n_rows":5,"n_cols":3,"rows_kept":5,"cut":false,"hidden":false,"merged":[]}
["Šifra","Naziv","Cena"]
[11,"Jabuka",100]
[22,"Kruška",180]
[33,"Šlijva",160]
[44,"Kajsija",200]

{"sheet":"kupci","index":2,"n_rows":1003,"n_cols":7,"rows_kept":1003,"cut":false,"hidden":false,"merged":[]}
["Rbr","Naziv","PDV BROJ","Adresa","Grad","Tel","Fax"]
[1,"PROBNI KUPAC","123456789","Gore Dole","NEKI GRAD","0038730256457","00387653154"]
[{"$f":"A2+1","v":2}]
[{"$f":"A3+1","v":3}]
[4]
[5]
[6]
[7]
[8]
[9]
[10]
[11]
[12]
[13]
[14]
[15]
[16]
[17]
[18]
[19]
[20]
[21]
[22]
[23]
[24]
[25]
[26]
[27]
[28]
[29]
[30]
[31]
[32]
[33]
[34]
[35]
[36]
[37]
[38]
[39]
[40]
[41]
[42]
[43]
[44]
[45]
[46]
[47]
[48]
[49]
[50]
[51]
[52]
[53]
[54]
[55]
[56]
[57]
[58]
[59]
[60]
[61]
[62]
[63]
[64]
[65]
[66]
[{"$f":"A67+1","v":67}]
[68]
[69]
[70]
[71]
[72]
[73]
[74]
[75]
[76]
[77]
[78]
[79]
[80]
[81]
[82]
[83]
[84]
[85]
[86]
[87]
[88]
[89]
[90]
[91]
[92]
[93]
[94]
[95]
[96]
[97]
[98]
[99]
[100]
[101]
[102]
[103]
[104]
[105]
[106]
[107]
[108]
[109]
[110]
[111]
[112]
[113]
[114]
[115]
[116]
[117]
[118]
[119]
[120]
[121]
[122]
[123]
[124]
[125]
[126]
[127]
[128]
[129]
[130]
[{"$f":"A131+1","v":131}]
[132]
[133]
[134]
[135]
[136]
[137]
[138]
[139]
[140]
[141]
[142]
[143]
[144]
[145]
[146]
[147]
[148]
[149]
[150]
[151]
[152]
[153]
[154]
[155]
[156]
[157]
[158]
[159]
[160]
[161]
[162]
[163]
[164]
[165]
[166]
[167]
[168]
[169]
[170]
[171]
[172]
[173]
[174]
[175]
[176]
[177]
[178]
[179]
[180]
[181]
[182]
[183]
[184]
[185]
[186]
[187]
[188]
[189]
[190]
[191]
[192]
[193]
[194]
[{"$f":"A195+1","v":195}]
[196]
[197]
[198]
[199]
[200]
[201]
[202]
[203]
[204]
[205]
[206]
[207]
[208]
[209]
[210]
[211]
[212]
[213]
[214]
[215]
[216]
[217]
[218]
[219]
[220]
[221]
[222]
[223]
[224]
[225]
[226]
[227]
[228]
[229]
[230]
[231]
[232]
[233]
[234]
[235]
[236]
[237]
[238]
[239]
[240]
[241]
[242]
[243]
[244]
[245]
[246]
[247]
[248]
[249]
[250]
[251]
[252]
[253]
[254]
[255]
[256]
[257]
[258]
[{"$f":"A259+1","v":259}]
[260]
[261]
[262]
[263]
[264]
[265]
[266]
[267]
[268]
[269]
[270]
[271]
[272]
[273]
[274]
[275]
[276]
[277]
[278]
[279]
[280]
[281]
[282]
[283]
[284]
[285]
[286]
[287]
[288]
[289]
[290]
[291]
[292]
[293]
[294]
[295]
[296]
[297]
[298]
[299]
[300]
[301]
[302]
[303]
[304]
[305]
[306]
[307]
[308]
[309]
[310]
[311]
[312]
[313]
[314]
[315]
[316]
[317]
[318]
[319]
[320]
[321]
[322]
[{"$f":"A323+1","v":323}]
[324]
[325]
[326]
[327]
[328]
[329]
[330]
[331]
[332]
[333]
[334]
[335]
[336]
[337]
[338]
[339]
[340]
[341]
[342]
[343]
[344]
[345]
[346]
[347]
[348]
[349]
[350]
[351]
[352]
[353]
[354]
[355]
[356]
[357]
[358]
[359]
[360]
[361]
[362]
[363]
[364]
[365]
[366]
[367]
[368]
[369]
[370]
[371]
[372]
[373]
[374]
[375]
[376]
[377]
[378]
[379]
[380]
[381]
[382]
[383]
[384]
[385]
[386]
[{"$f":"A387+1","v":387}]
[388]
[389]
[390]
[391]
[392]
[393]
[394]
[395]
[396]
[397]
[398]
[399]
[400]
[401]
[402]
[403]
[404]
[405]
[406]
[407]
[408]
[409]
[410]
[411]
[412]
[413]
[414]
[415]
[416]
[417]
[418]
[419]
[420]
[421]
[422]
[423]
[424]
[425]
[426]
[427]
[428]
[429]
[430]
[431]
[432]
[433]
[434]
[435]
[436]
[437]
[438]
[439]
[440]
[441]
[442]
[443]
[444]
[445]
[446]
[447]
[448]
[449]
[450]
[{"$f":"A451+1","v":451}]
[452]
[453]
[454]
[455]
[456]
[457]
[458]
[459]
[460]
[461]
[462]
[463]
[464]
[465]
[466]
[467]
[468]
[469]
[470]
[471]
[472]
[473]
[474]
[475]
[476]
[477]
[478]
[479]
[480]
[481]
[482]
[483]
[484]
[485]
[486]
[487]
[488]
[489]
[490]
[491]
[492]
[493]
[494]
[495]
[496]
[497]
[498]
[499]
[500]
[501]
[502]
[503]
[504]
[505]
[506]
[507]
[508]
[509]
[510]
[511]
[512]
[513]
[514]
[{"$f":"A515+1","v":515}]
[516]
[517]
[518]
[519]
[520]
[521]
[522]
[523]
[524]
[525]
[526]
[527]
[528]
[529]
[530]
[531]
[532]
[533]
[534]
[535]
[536]
[537]
[538]
[539]
[540]
[541]
[542]
[543]
[544]
[545]
[546]
[547]
[548]
[549]
[550]
[551]
[552]
[553]
[554]
[555]
[556]
[557]
[558]
[559]
[560]
[561]
[562]
[563]
[564]
[565]
[566]
[567]
[568]
[569]
[570]
[571]
[572]
[573]
[574]
[575]
[576]
[577]
[578]
[{"$f":"A579+1","v":579}]
[580]
[581]
[582]
[583]
[584]
[585]
[586]
[587]
[588]
[589]
[590]
[591]
[592]
[593]
[594]
[595]
[596]
[597]
[598]
[599]
[600]
[601]
[602]
[603]
[604]
[605]
[606]
[607]
[608]
[609]
[610]
[611]
[612]
[613]
[614]
[615]
[616]
[617]
[618]
[619]
[620]
[621]
[622]
[623]
[624]
[625]
[626]
[627]
[628]
[629]
[630]
[631]
[632]
[633]
[634]
[635]
[636]
[637]
[638]
[639]
[640]
[641]
[642]
[{"$f":"A643+1","v":643}]
[644]
[645]
[646]
[647]
[648]
[649]
[650]
[651]
[652]
[653]
[654]
[655]
[656]
[657]
[658]
[659]
[660]
[661]
[662]
[663]
[664]
[665]
[666]
[667]
[668]
[669]
[670]
[671]
[672]
[673]
[674]
[675]
[676]
[677]
[678]
[679]
[680]
[681]
[682]
[683]
[684]
[685]
[686]
[687]
[688]
[689]
[690]
[691]
[692]
[693]
[694]
[695]
[696]
[697]
[698]
[699]
[700]
[701]
[702]
[703]
[704]
[705]
[706]
[{"$f":"A707+1","v":707}]
[708]
[709]
[710]
[711]
[712]
[713]
[714]
[715]
[716]
[717]
[718]
[719]
[720]
[721]
[722]
[723]
[724]
[725]
[726]
[727]
[728]
[729]
[730]
[731]
[732]
[733]
[734]
[735]
[736]
[737]
[738]
[739]
[740]
[741]
[742]
[743]
[744]
[745]
[746]
[747]
[748]
[749]
[750]
[751]
[752]
[753]
[754]
[755]
[756]
[757]
[758]
[759]
[760]
[761]
[762]
[763]
[764]
[765]
[766]
[767]
[768]
[769]
[770]
[{"$f":"A771+1","v":771}]
[772]
[773]
[774]
[775]
[776]
[777]
[778]
[779]
[780]
[781]
[782]
[783]
[784]
[785]
[786]
[787]
[788]
[789]
[790]
[791]
[792]
[793]
[794]
[795]
[796]
[797]
[798]
[799]
[800]
[801]
[802]
[803]
[804]
[805]
[806]
[807]
[808]
[809]
[810]
[811]
[812]
[813]
[814]
[815]
[816]
[817]
[818]
[819]
[820]
[821]
[822]
[823]
[824]
[825]
[826]
[827]
[828]
[829]
[830]
[831]
[832]
[833]
[834]
[{"$f":"A835+1","v":835}]
[836]
[837]
[838]
[839]
[840]
[841]
[842]
[843]
[844]
[845]
[846]
[847]
[848]
[849]
[850]
[851]
[852]
[853]
[854]
[855]
[856]
[857]
[858]
[859]
[860]
[861]
[862]
[863]
[864]
[865]
[866]
[867]
[868]
[869]
[870]
[871]
[872]
[873]
[874]
[875]
[876]
[877]
[878]
[879]
[880]
[881]
[882]
[883]
[884]
[885]
[886]
[887]
[888]
[889]
[890]
[891]
[892]
[893]
[894]
[895]
[896]
[897]
[898]
[{"$f":"A899+1","v":899}]
[900]
[901]
[902]
[903]
[904]
[905]
[906]
[907]
[908]
[909]
[910]
[911]
[912]
[913]
[914]
[915]
[916]
[917]
[918]
[919]
[920]
[921]
[922]
[923]
[924]
[925]
[926]
[927]
[928]
[929]
[930]
[931]
[932]
[933]
[934]
[935]
[936]
[937]
[938]
[939]
[940]
[941]
[942]
[943]
[944]
[945]
[946]
[947]
[948]
[949]
[950]
[951]
[952]
[953]
[954]
[955]
[956]
[957]
[958]
[959]
[960]
[961]
[962]
[{"$f":"A963+1","v":963}]
[964]
[965]
[966]
[967]
[968]
[969]
[970]
[971]
[972]
[973]
[974]
[975]
[976]
[977]
[978]
[979]
[980]
[981]
[982]
[983]
[984]
[985]
[986]
[987]
[988]
[989]
[990]
[991]
[992]
[993]
[994]
[995]
[996]
[997]
[998]
[999]
[1000]
[1001]
[1002]

{"sheet":"baza","index":3,"n_rows":7,"n_cols":9,"rows_kept":7,"cut":false,"hidden":false,"merged":[]}
["Datum fakture","Broj fakture","Komitent","Ukupan iznos bez PDV","PDV","Ukupan iznos sa PDV",null,"REKAPITULACIJA PDV"]
[]
[null,null,null,null,null,null,null,"Ukupan iznos bez PDV",{"$f":"SUM(D2:D2000)","v":0}]
[]
[null,null,null,null,null,null,null,"PDV",{"$f":"SUM(E2:E2000)","v":0}]
[]
[null,null,null,null,null,null,null,"Ukupan iznos sa PDV",{"$f":"SUM(F2:F2000)","v":0}]

{"sheet":"Podesavanja","index":4,"n_rows":26,"n_cols":6,"rows_kept":26,"cut":false,"hidden":false,"merged":[]}
[null,"OSNOVNA PODEŠAVANJA ZA ISPRAVAN RAD PROGRAMA"]
["Naziv firme:","MOJA FIRMA"]
["Adresa:","Moja ulica bb"]
["Mjesto:","Moj Grad"]
["PDV:","123123123123"]
["Matični broj:","98765432112"]
["Tekući račun:","12345654879"]
["Tel/fax:","0038733256987"]
[null,"OBAVEZNA POPUNA PODATAKA "]
["Stopa PDV %",0.17,"UPIS STOPE PDV JE OBAVEZNA STAVKA."]
["Preračunata stopa PDV",0.14529900000000001,"UPIS PRERAČUNATE STOPE PDV,KADA JE U CIJENU USLUGE/ROBE URAČUNAT PDV."]
["Datum dospijeća:",10,"UPIS DATUMA DOSPIJEĆA RAČUNA OBAVEZNA STAVKA."]
["Način plačanja","Virman","Odabir vrste načina plačanja,odabir se vrši iz padajuće liste."]
["Odabir stope PDV",1,"Odabir PDV odabir se vrši iz padajuće liste,opcija 1-cijena usluge + PDV i opcija 2-PDV je uračunat u cijenu."]
[null,{"$f":"IF(B14=1,\"PROPISANA STOPA PDV\",\"PRERAČUNATA STOPA PDV\")","v":"PROPISANA STOPA PDV"}]
[]
["Početni broj fakture:",1,"Upis početnog broja fakture."]
[]
[]
[]
["Stupci i čelije koje su obojani ovom bojom na fakturi one se ne popunjavaju !!!!",null,null,"Program za Fakturisanje verzija 3.0.0"]
["automatska je popuna podataka!!!!!!",null,null,"program by Jasmin    info:jasko@inbox.com       tel:++387 61 240 653 "]
[null,null,null,null,null,"info: jasminj.info@gmail.com"]
["Čelije obojene ovom bojom na fakturi i na podešavanjima,tu imate opciju odabira pomoću padajuće liste."]
[]
["Fakture se štampaju crno-bijelo,ali vi to možete promijeniti u podešavanju štampe."]

{"sheet":"pomoc","index":5,"n_rows":46,"n_cols":3,"rows_kept":46,"cut":false,"hidden":false,"merged":[]}
[]
[]
[]
[]
[]
[]
[]
[]
[]
[]
[null,"DOBRO DOŠLI U PROGRAM ZA FAKTURISANJE Verzija 1.5.0"]
[]
[]
[null,"Za korištenje programa fakturisanje trebate uraditi par koraka i program će raditi funkcionalno."]
[null,"Program kopirati na Lokalni disk C, i program pokretati sa prečice na desktopu."]
[]
[]
[]
["1.","SNIMANJE FAKTURE"]
[null,"Ovo kontrolno  dugme snima fakturu sa svim elementima na lokalni disk C:"]
[null,"snima osnovne podatke o datumu fakture,komitentu,broju fakture itd u bazu"]
[null,"za brzi pregled izdatih faktura,i briše sve stavke za novu fakturu"]
["2.","KOMITENTI"]
[null,"Unosite komitente za bržu popunu podataka za fakturu odabirom šifre iz padajuće liste"]
["3.","PODEŠAVANJA"]
[null,"Osnovni podaci za ispravan rad programa."]
["4.","LOGO"]
[null,"Ova opcija omogučava da unesete svoj vlastiti LOGO firme.Dimenzije vašeg  Logo  moraju biti  Height (visina) = 80   i   Width(dužina) = 280 ."]
[]
["5.","IZBOR ŠTAMPAČA"]
[null,"Izbor štampača (printera) ako imate više instalisani štampaća (printera)"]
[null,"POGLEDAJ RAČUN"]
[null,"Sa ovom opcijom pregledate račun prije štampanja(printanja)"]
[null,"PRINTANJE"]
[null,"Printa fakturu na glavni štampač"]
["6.","BAZA FAKTURA"]
[null,"Ovdje imate pregled svih snimljeni faktura sa osnovnim elementima"]
[]
[]
[null,"SVE SNIMLJENE FAKTURE ĆE SE NALAZITI NA LOKALNOM DISKU C:, U MAPI FAKTURA,KOJE OTVARATE I ŠTAMPATE SA EXCELOVIM KOMANDNIM DUGMADIMA"]
[null,"KAD ZAVRŠITE SA PROGRAM ZA IZLAZ IZ PROGRAMA KORISTITE DUGME IZLAZ U PROGRAMU FAKTURA JER SPREMA SVE POSTAVKE."]
[]
[]
[]
[]
[null,null,"UGODAN RAD SA PROGRAMOM"]