{"text_format":"1","workbook":"xlsx","n_sheets":16,"sheets":["PLAN UNOSA","Podaci","Privremena baza","KUMULATIV","KUMULATIV 2","KUMULATIV 3","PRORAČUNI","PRORAČUN 2","PRORACUN 3","RAZRADA UKUPNO","RAZRADA KUPCI BG","RAZRADA KUPCI LA","RAZRADA KUPCI NI","RAZRADA GRUPA BG","RAZRADA GRUPA LA","RAZRADA GRUPA NI"],"not_rendered":{"charts":0,"images":0,"macros":1,"external_links":0,"defined_names":0,"comments":0,"pivot_tables":4},"unopened":[],"bounds":{"document_bytes":16777216,"sheet_cells":100000,"rows_first":2000,"rows_last":500,"rows_between":2000,"halvings":0,"cell_chars":16384,"cell_head_chars":4096},"cells_cut":0,"cells_raw":0,"read":"whole","date_system":"1900"}

{"sheet":"PLAN UNOSA","index":0,"n_rows":38,"n_cols":16,"rows_kept":38,"cut":false,"hidden":false,"merged":[]}
["ASORTIMAN","KC BEOGRAD",null,"KC LAJKOVAC",null,"KC NIŠ",null,"Izvoz Makedonija",null,"Izvoz Crna Gora",null,"Izvoz BIH - Majop",null,"Izvoz Bosna",null,"Delhaize"]
[]
["Pile GRILL - svj.",2085.8436998874445,null,816.50228129524407,null,900.41062398515805,null,0,null,443.00677863869282,null,308.02601089814817,null,1560,null,1069.4790868936693]
["Rasjek - svj.",2128.4880940289013,null,1009.5382715933578,null,630.93555403050311,null,0,null,1073.8377640627214,null,325.65611452269343,null,800.36674318289249,null,1852.9176147133005]
["Iznutrice svj.",210.12207866269944,null,93.534523475598945,null,129.47237767155363,null,0,null,73.709885657694969,null,0.1324244585185152,null,51.111111111111114,null,273.07664365795904]
["Pile GRILL - smrz.",466.66758704084822,null,318.66464352639548,null,497.79278713616469,null,0,null,0,null,0,null,0,null,0]
{"$rows_left_out":33}
{"sheet":"Podaci","index":1,"n_rows":34,"n_cols":5,"rows_kept":34,"cut":false,"hidden":false,"merged":[[30,0,30,1]]}
[]
["2013-08-01","PRVI DAN MESECA"]
["2013-08-08","TEKUĆI DAN"]
["2013-08-31","POSLEDNJI DAN MESECA"]
[]
["Lista praznika"]
{"$rows_left_out":29}
{"sheet":"Privremena baza","index":2,"n_rows":2108,"n_cols":13,"rows_kept":2108,"cut":false,"hidden":false,"merged":[]}
["PROIZVOD","SIFRA_REFERENTA","IME_PREZIME_REFERENTA","DOSTAVNO_MESTO","KP","UKUPNA_TEZINA","KC","GRUPA",null,"SIFRA_REFERENTA","KC","PROIZVOD","GRUPA"]
[1,"1","Lajkovac","FF",0,0,{"$f":"INDEX($J$1:$K$37, MATCH(B2,$J$1:$J$37,), MATCH(\"KC\",$J$1:$K$1,))","v":"Lajkovac"},{"$f":"INDEX($L$1:$M$161, MATCH(A2,$L$1:$L$161,), MATCH(\"GRUPA\",$L$1:$M$1,))","v":"1. Sveži proizvodi"},null,"807","Lajkovac",1,"1. Sveži proizvodi"]
[2,"1","Lajkovac","FF",0,0,{"$f":"INDEX($J$1:$K$37, MATCH(B3,$J$1:$J$37,), MATCH(\"KC\",$J$1:$K$1,))","v":"Lajkovac"},{"$f":"INDEX($L$1:$M$161, MATCH(A3,$L$1:$L$161,), MATCH(\"GRUPA\",$L$1:$M$1,))","v":"1. Sveži proizvodi"},null,"128","Beograd",2,"1. Sveži proizvodi"]
[3,"1","Lajkovac","FF",0,0,"Lajkovac","1. Sveži proizvodi",null,"131","Beograd",3,"1. Sveži proizvodi"]
[4,"1","Lajkovac","FF",0,0,"Lajkovac","1. Sveži proizvodi",null,"113","Lajkovac",4,"1. Sveži proizvodi"]
[5,"1","Lajkovac","FF",0,0,"Lajkovac","1. Sveži proizvodi",null,"114","Lajkovac",5,"1. Sveži proizvodi"]
{"$rows_left_out":2103}
{"sheet":"KUMULATIV","index":3,"n_rows":124,"n_cols":26,"rows_kept":124,"cut":false,"hidden":false,"merged":[]}
[null,null,null,null,"COPY ",null,null,null,null,null,null,null,null,"PASTE",null,null,null,null,null,null,null,null,"DNEVNI PLAN"]
[]
[null,null,null,null,"DNEVNA PRODAJA KUMULATIV",null,null,null,"PLAN KUMULATIV",null,null,null,null,"DNEVNA PRODAJA DO DANA",null,null,null,"PLAN",null,null,null,null,"DNEVNI PLAN"]
["KC","RB","PR/P","KUPAC","1. Sveži proizvodi","2. Smrznuti proizvodi","3. Prepađevine","Grand Total","1. Sveži proizvodi","2. Smrznuti proizvodi","3. Prepađevine","Grand Total",null,"1. Sveži proizvodi","2. Smrznuti proizvodi","3. Prepađevine","Grand Total","1. Sveži proizvodi","2. Smrznuti proizvodi","3. Prepađevine","Grand Total",null,"1. Sveži proizvodi","2. Smrznuti proizvodi","3. Prepađevine","Grand Total"]
[{"$f":"PRORAČUNI!A3","v":{"$error":"#REF!"}},1,"PR",{"$f":"PRORAČUNI!B3","v":{"$error":"#REF!"}},{"$f":"IFERROR(+N5+PRORAČUNI!L3,0)","v":14981.998999999998},{"$f":"IFERROR(+O5+PRORAČUNI!M3,0)","v":0},{"$f":"IFERROR(+P5+PRORAČUNI!N3,0)","v":281.80799999999999},{"$f":"IFERROR(+Q5+PRORAČUNI!O3,0)","v":15263.806999999999},{"$f":"IFERROR(+R5+PRORAČUNI!P3,0)","v":0},{"$f":"IFERROR(+S5+PRORAČUNI!Q3,0)","v":0},{"$f":"IFERROR(+T5+PRORAČUNI!R3,0)","v":0},{"$f":"IFERROR(+U5+PRORAČUNI!S3,0)","v":0},null,14981.998999999998,0,281.80799999999999,15263.806999999999,12423.969928926093,0,1764.1053367922643,14188.075265718358,null,{"$f":"$Z5*PRORAČUNI!H3","v":{"$error":"#REF!"}},{"$f":"$Z5*PRORAČUNI!I3","v":{"$error":"#REF!"}},{"$f":"$Z5*PRORAČUNI!J3","v":{"$error":"#REF!"}},{"$f":"'PLAN UNOSA'!$B$38*PRORAČUNI!K3","v":{"$error":"#REF!"}}]
[{"$f":"$A$5","v":{"$error":"#REF!"}},2,"PR",{"$f":"PRORAČUNI!B4","v":{"$error":"#REF!"}},{"$f":"IFERROR(+N6+PRORAČUNI!L4,0)","v":8777.5840000000007},{"$f":"IFERROR(+O6+PRORAČUNI!M4,0)","v":0},{"$f":"IFERROR(+P6+PRORAČUNI!N4,0)","v":1250.0730000000001},{"$f":"IFERROR(+Q6+PRORAČUNI!O4,0)","v":10027.657000000001},{"$f":"IFERROR(+R6+PRORAČUNI!P4,0)","v":0},{"$f":"IFERROR(+S6+PRORAČUNI!Q4,0)","v":0},{"$f":"IFERROR(+T6+PRORAČUNI!R4,0)","v":0},{"$f":"IFERROR(+U6+PRORAČUNI!S4,0)","v":0},null,8777.5840000000007,0,1250.0730000000001,10027.657000000001,7672.8424000071309,0,106.99447842357634,7779.8368784307067,null,{"$f":"$Z6*PRORAČUNI!H4","v":{"$error":"#REF!"}},{"$f":"$Z6*PRORAČUNI!I4","v":{"$error":"#REF!"}},{"$f":"$Z6*PRORAČUNI!J4","v":{"$error":"#REF!"}},{"$f":"'PLAN UNOSA'!$B$38*PRORAČUNI!K4","v":{"$error":"#REF!"}}]
{"$rows_left_out":119}
{"sheet":"KUMULATIV 2","index":4,"n_rows":258,"n_cols":6,"rows_kept":258,"cut":false,"hidden":false,"merged":[]}
[null,null,null,null,"PR/P"]
["KC","RB","KUPAC","Values","PR","P"]
["KC Beograd",1,"DELHAIZE SERBIA DOO","Sum of 1. Sveži proizvodi",16466.732999999997,14494.631583747108]
[null,null,null,"Sum of 2. Smrznuti proizvodi",0,0]
[null,null,null,"Sum of 3. Prepađevine",332.72899999999998,2058.1228929243084]
[null,null,null,"Sum of Grand Total",16799.462,16552.75447667142]
{"$rows_left_out":253}
{"sheet":"KUMULATIV 3","index":5,"n_rows":258,"n_cols":6,"rows_kept":258,"cut":false,"hidden":false,"merged":[]}
[null,null,null,null,"PR/P"]
["KC","Values","RB","KUPAC","PR","P"]
["KC Beograd","Sum of 1. Sveži proizvodi",1,"DELHAIZE SERBIA DOO",16466.732999999997,14494.631583747108]
[null,null,2,"IDEA DOO",10500.770000000002,8951.6494666749859]
[null,null,3,"MERCATOR S",3493.5020000000004,4961.429769043003]
[null,null,4,"ŠTRAND DOO",5020.0519999999997,4733.4799287609867]
{"$rows_left_out":253}
{"sheet":"PRORAČUNI","index":6,"n_rows":62,"n_cols":23,"rows_kept":62,"cut":false,"hidden":false,"merged":[]}
[null,null,null,"PROŠLA GODINA",null,null,{"$f":"D1","v":"PROŠLA GODINA"},"Index",null,null,"Index","DNEVNA PRODAJA",null,null,null,"DNEVNI PLAN",null,null,null,"INDEX"]
["KC","KUPAC",null,"1. Sveži proizvodi","2. Smrznuti proizvodi","3. Prepađevine","Grand Total","1. Sveži proizvodi","2. Smrznuti proizvodi","3. Prepađevine","Grand Total","1. Sveži proizvodi","2. Smrznuti proizvodi","3. Prepađevine","Grand Total","1. Sveži proizvodi","2. Smrznuti proizvodi","3. Prepađevine","Grand Total","1. Sveži proizvodi","2. Smrznuti proizvodi","3. Prepađevine","Grand Total"]
[{"$f":"#REF!","v":{"$error":"#REF!"}},{"$f":"#REF!","v":{"$error":"#REF!"}},{"$f":"#REF!","v":{"$error":"#REF!"}},{"$f":"#REF!","v":{"$error":"#REF!"}},{"$f":"#REF!","v":{"$error":"#REF!"}},{"$f":"#REF!","v":{"$error":"#REF!"}},{"$f":"#REF!","v":{"$error":"#REF!"}},{"$f":"D3/$G3","v":{"$error":"#REF!"}},{"$f":"E3/$G3","v":{"$error":"#REF!"}},{"$error":"#REF!"},{"$f":"G3/#REF!","v":{"$error":"#REF!"}},{"$f":"IFERROR(INDEX(#REF!,MATCH(PRORAČUNI!$C3,#REF!,),MATCH(\"1. Sveži proizvodi\",#REF!,)),0)","v":0},{"$f":"IFERROR(INDEX(#REF!,MATCH(PRORAČUNI!$C3,#REF!,),MATCH(\"2. Smrznuti proizvodi\",#REF!,)),0)","v":0},{"$f":"IFERROR(INDEX(#REF!,MATCH(PRORAČUNI!$C3,#REF!,),MATCH(\"3. Prepađevine\",#REF!,)),0)","v":0},{"$f":"SUM(L3:N3)","v":0},{"$f":"KUMULATIV!W5","v":{"$error":"#REF!"}},{"$f":"KUMULATIV!X5","v":{"$error":"#REF!"}},{"$f":"KUMULATIV!Y5","v":{"$error":"#REF!"}},{"$f":"KUMULATIV!Z5","v":{"$error":"#REF!"}},{"$f":"IFERROR(L3/P3,0)","v":0},{"$f":"IFERROR(M3/Q3,0)","v":0},0,0]
[null,{"$f":"#REF!","v":{"$error":"#REF!"}},{"$f":"#REF!","v":{"$error":"#REF!"}},{"$f":"#REF!","v":{"$error":"#REF!"}},{"$f":"#REF!","v":{"$error":"#REF!"}},{"$f":"#REF!","v":{"$error":"#REF!"}},{"$f":"#REF!","v":{"$error":"#REF!"}},{"$f":"D4/$G4","v":{"$error":"#REF!"}},{"$f":"E4/$G4","v":{"$error":"#REF!"}},{"$f":"F4/$G4","v":{"$error":"#REF!"}},{"$f":"G4/#REF!","v":{"$error":"#REF!"}},{"$f":"IFERROR(INDEX(#REF!,MATCH(PRORAČUNI!$C4,#REF!,),MATCH(\"1. Sveži proizvodi\",#REF!,)),0)","v":0},{"$f":"IFERROR(INDEX(#REF!,MATCH(PRORAČUNI!$C4,#REF!,),MATCH(\"2. Smrznuti proizvodi\",#REF!,)),0)","v":0},{"$f":"IFERROR(INDEX(#REF!,MATCH(PRORAČUNI!$C4,#REF!,),MATCH(\"3. Prepađevine\",#REF!,)),0)","v":0},{"$f":"SUM(L4:N4)","v":0},{"$f":"KUMULATIV!W6","v":{"$error":"#REF!"}},{"$f":"KUMULATIV!X6","v":{"$error":"#REF!"}},{"$f":"KUMULATIV!Y6","v":{"$error":"#REF!"}},{"$f":"KUMULATIV!Z6","v":{"$error":"#REF!"}},{"$f":"IFERROR(L4/P4,0)","v":0},{"$f":"IFERROR(M4/Q4,0)","v":0},{"$f":"IFERROR(N4/R4,0)","v":0},{"$f":"IFERROR(O4/S4,0)","v":0}]
[null,{"$f":"#REF!","v":{"$error":"#REF!"}},{"$f":"#REF!","v":{"$error":"#REF!"}},{"$f":"#REF!","v":{"$error":"#REF!"}},{"$f":"#REF!","v":{"$error":"#REF!"}},{"$f":"#REF!","v":{"$error":"#REF!"}},{"$f":"#REF!","v":{"$error":"#REF!"}},{"$error":"#REF!"},{"$error":"#REF!"},{"$error":"#REF!"},{"$f":"G5/#REF!","v":{"$error":"#REF!"}},{"$f":"IFERROR(INDEX(#REF!,MATCH(PRORAČUNI!$C5,#REF!,),MATCH(\"1. Sveži proizvodi\",#REF!,)),0)","v":0},{"$f":"IFERROR(INDEX(#REF!,MATCH(PRORAČUNI!$C5,#REF!,),MATCH(\"2. Smrznuti proizvodi\",#REF!,)),0)","v":0},{"$f":"IFERROR(INDEX(#REF!,MATCH(PRORAČUNI!$C5,#REF!,),MATCH(\"3. Prepađevine\",#REF!,)),0)","v":0},0,{"$f":"KUMULATIV!W7","v":{"$error":"#REF!"}},{"$f":"KUMULATIV!X7","v":{"$error":"#REF!"}},{"$f":"KUMULATIV!Y7","v":{"$error":"#REF!"}},{"$f":"KUMULATIV!Z7","v":{"$error":"#REF!"}},0,0,0,0]
[null,{"$f":"#REF!","v":{"$error":"#REF!"}},{"$f":"#REF!","v":{"$error":"#REF!"}},{"$f":"#REF!","v":{"$error":"#REF!"}},{"$f":"#REF!","v":{"$error":"#REF!"}},{"$f":"#REF!","v":{"$error":"#REF!"}},{"$f":"#REF!","v":{"$error":"#REF!"}},{"$error":"#REF!"},{"$error":"#REF!"},{"$error":"#REF!"},{"$f":"G6/#REF!","v":{"$error":"#REF!"}},{"$f":"IFERROR(INDEX(#REF!,MATCH(PRORAČUNI!$C6,#REF!,),MATCH(\"1. Sveži proizvodi\",#REF!,)),0)","v":0},{"$f":"IFERROR(INDEX(#REF!,MATCH(PRORAČUNI!$C6,#REF!,),MATCH(\"2. Smrznuti proizvodi\",#REF!,)),0)","v":0},{"$f":"IFERROR(INDEX(#REF!,MATCH(PRORAČUNI!$C6,#REF!,),MATCH(\"3. Prepađevine\",#REF!,)),0)","v":0},0,{"$f":"KUMULATIV!W8","v":{"$error":"#REF!"}},{"$f":"KUMULATIV!X8","v":{"$error":"#REF!"}},{"$f":"KUMULATIV!Y8","v":{"$error":"#REF!"}},{"$f":"KUMULATIV!Z8","v":{"$error":"#REF!"}},0,0,0,0]
{"$rows_left_out":57}
{"sheet":"PRORAČUN 2","index":7,"n_rows":90,"n_cols":6,"rows_kept":90,"cut":false,"hidden":false,"merged":[]}
[null,null,null,null,"PROD/PLAN"]
["KC","RB","KUPAC","Values","PRODAJA","PLAN"]
["KC Beograd",1,"DELHAIZE SERBIA DOO","Sum of 1. Sveži proizvodi",1484.7339999999999,2070.6616548210159]
[null,null,null,"Sum of 2. Smrznuti proizvodi",0,0]
[null,null,null,"Sum of 3. Prepađevine",50.921000000000006,294.01755613204404]
[null,null,null,"Sum of Grand Total",1535.655,2364.6792109530597]
{"$rows_left_out":85}
{"sheet":"PRORACUN 3","index":8,"n_rows":90,"n_cols":6,"rows_kept":90,"cut":false,"hidden":false,"merged":[]}
[null,null,null,null,"PROD/PLAN"]
["KC","Values","RB","KUPAC","PRODAJA","PLAN"]
["KC Beograd","Sum of 1. Sveži proizvodi",1,"DELHAIZE SERBIA DOO",1484.7339999999999,2070.6616548210159]
[null,null,2,"IDEA DOO",1723.1860000000013,1278.8070666678552]
[null,null,3,"MERCATOR S",493.58500000000009,708.7756812918575]
[null,null,4,"ŠTRAND DOO",678.83800000000008,676.21141839442669]
{"$rows_left_out":85}
{"sheet":"RAZRADA UKUPNO","index":9,"n_rows":73,"n_cols":11,"rows_kept":73,"cut":false,"hidden":false,"merged":[[2,3,2,4],[2,6,2,7],[0,1,0,8]]}
["VINDIJA",{"$f":"\"Dnevna prodaja od\"&TEXT(A4,\" dd.mm.\")& \" i kumulativ dnevnog plana i prodaje za 01.-\" &TEXT(A4,\" dd.mm.yyyy\")","v":"Dnevna prodaja od 08.08. i kumulativ dnevnog plana i prodaje za 01.- 08.08.2013"}]
[]
[null,{"$f":"Podaci!A2","v":"2013-08-01"},{"$f":"Podaci!A4","v":"2013-08-31"},"Izvještaj za ",null,null,{"$f":"PROPER(TEXT((Podaci!C33),\"MMMM\"))&\"/\"&PROPER(TEXT((Podaci!D33),\"MMMM\"))","v":"Kolovoz/Avgust"},null,null,null,{"$f":"Podaci!A7","v":"2013-01-01"}]
[{"$f":"Podaci!A3","v":"2013-08-08"},null,null,{"$f":"NETWORKDAYS(B3,A4,(K3:K12))","v":6},"dana +",null,{"$f":"NETWORKDAYS(B3,C3,(K3:K12))","v":22},"dana +",null,null,{"$f":"Podaci!A8","v":"2013-01-02"}]
["SRBIJA",null,null,{"$f":"SUM(ISNA(MATCH(ROW(INDIRECT(B3&\":\"&A4)),(R3:R12),0))*\n(WEEKDAY(ROW(INDIRECT(B3&\":\"&A4)))=7))","v":1},{"$f":"IF(OR(D5=2,D5=3,D5=4),\"subote\",\"subota\")","v":"subota"},null,{"$f":"SUM(ISNA(MATCH(ROW(INDIRECT(B3&\":\"&C3)),(K3:K12),0))*\n(WEEKDAY(ROW(INDIRECT(B3&\":\"&C3)))=7))","v":5},{"$f":"IF(OR(G5=2,G5=3,G5=4),\"subote\",\"subota\")","v":"subota"},null,null,{"$f":"Podaci!A9","v":"2013-01-07"}]
["KC BEOGRAD",null,null,null,null,null,null,null,null,null,{"$f":"Podaci!A10","v":"2013-05-06"}]
{"$rows_left_out":68}
{"sheet":"RAZRADA KUPCI BG","index":10,"n_rows":87,"n_cols":10,"rows_kept":87,"cut":false,"hidden":false,"merged":[[2,3,2,4],[2,6,2,7],[0,1,0,9]]}
[{"$f":"'RAZRADA UKUPNO'!A1","v":"VINDIJA"},{"$f":"'RAZRADA UKUPNO'!B1:I1","v":"Dnevna prodaja od 08.08. i kumulativ dnevnog plana i prodaje za 01.- 08.08.2013"}]
[]
[null,null,null,{"$f":"'RAZRADA UKUPNO'!D3:E3","v":"Izvještaj za "},null,null,{"$f":"'RAZRADA UKUPNO'!G3:H3","v":"Kolovoz/Avgust"}]
[null,null,null,{"$f":"'RAZRADA UKUPNO'!D4","v":6},{"$f":"'RAZRADA UKUPNO'!E4","v":"dana +"},null,{"$f":"'RAZRADA UKUPNO'!G4","v":22},{"$f":"'RAZRADA UKUPNO'!H4","v":"dana +"}]
["KC BEOGRAD",null,null,{"$f":"'RAZRADA UKUPNO'!D5","v":1},{"$f":"'RAZRADA UKUPNO'!E5","v":"subota"},null,{"$f":"'RAZRADA UKUPNO'!G5","v":5},{"$f":"'RAZRADA UKUPNO'!H5","v":"subota"}]
[]
{"$rows_left_out":82}
{"sheet":"RAZRADA KUPCI LA","index":11,"n_rows":87,"n_cols":10,"rows_kept":87,"cut":false,"hidden":false,"merged":[[2,3,2,4],[2,6,2,7],[0,1,0,8]]}
[{"$f":"'RAZRADA UKUPNO'!A1","v":"VINDIJA"},{"$f":"'RAZRADA UKUPNO'!B1:I1","v":"Dnevna prodaja od 08.08. i kumulativ dnevnog plana i prodaje za 01.- 08.08.2013"}]
[]
[null,null,null,{"$f":"'RAZRADA UKUPNO'!D3:E3","v":"Izvještaj za "},null,null,{"$f":"'RAZRADA UKUPNO'!G3:H3","v":"Kolovoz/Avgust"}]
[null,null,null,{"$f":"'RAZRADA UKUPNO'!D4","v":6},{"$f":"'RAZRADA UKUPNO'!E4","v":"dana +"},null,{"$f":"'RAZRADA UKUPNO'!G4","v":22},{"$f":"'RAZRADA UKUPNO'!H4","v":"dana +"}]
["KC LAJKOVAC",null,null,{"$f":"'RAZRADA UKUPNO'!D5","v":1},{"$f":"'RAZRADA UKUPNO'!E5","v":"subota"},null,{"$f":"'RAZRADA UKUPNO'!G5","v":5},{"$f":"'RAZRADA UKUPNO'!H5","v":"subota"}]
[]
{"$rows_left_out":82}
{"sheet":"RAZRADA KUPCI NI","index":12,"n_rows":87,"n_cols":10,"rows_kept":87,"cut":false,"hidden":false,"merged":[[2,3,2,4],[2,6,2,7],[0,1,0,8]]}
[{"$f":"'RAZRADA UKUPNO'!A1","v":"VINDIJA"},{"$f":"'RAZRADA UKUPNO'!B1:I1","v":"Dnevna prodaja od 08.08. i kumulativ dnevnog plana i prodaje za 01.- 08.08.2013"}]
[]
[null,null,null,{"$f":"'RAZRADA UKUPNO'!D3:E3","v":"Izvještaj za "},null,null,{"$f":"'RAZRADA UKUPNO'!G3:H3","v":"Kolovoz/Avgust"}]
[null,null,null,{"$f":"'RAZRADA UKUPNO'!D4","v":6},{"$f":"'RAZRADA UKUPNO'!E4","v":"dana +"},null,{"$f":"'RAZRADA UKUPNO'!G4","v":22},{"$f":"'RAZRADA UKUPNO'!H4","v":"dana +"}]
["KC NIŠ",null,null,{"$f":"'RAZRADA UKUPNO'!D5","v":1},{"$f":"'RAZRADA UKUPNO'!E5","v":"subota"},null,{"$f":"'RAZRADA UKUPNO'!G5","v":5},{"$f":"'RAZRADA UKUPNO'!H5","v":"subota"}]
[]
{"$rows_left_out":82}
{"sheet":"RAZRADA GRUPA BG","index":13,"n_rows":70,"n_cols":10,"rows_kept":70,"cut":false,"hidden":false,"merged":[[2,3,2,4],[2,6,2,7],[0,1,0,8]]}
[{"$f":"'RAZRADA UKUPNO'!A1","v":"VINDIJA"},{"$f":"'RAZRADA UKUPNO'!B1:I1","v":"Dnevna prodaja od 08.08. i kumulativ dnevnog plana i prodaje za 01.- 08.08.2013"}]
[]
[null,null,null,{"$f":"'RAZRADA UKUPNO'!D3:E3","v":"Izvještaj za "},null,null,{"$f":"'RAZRADA UKUPNO'!G3:H3","v":"Kolovoz/Avgust"}]
[null,null,null,{"$f":"'RAZRADA UKUPNO'!D4","v":6},{"$f":"'RAZRADA UKUPNO'!E4","v":"dana +"},null,{"$f":"'RAZRADA UKUPNO'!G4","v":22},{"$f":"'RAZRADA UKUPNO'!H4","v":"dana +"}]
["KC BEOGRAD",null,null,{"$f":"'RAZRADA UKUPNO'!D5","v":1},{"$f":"'RAZRADA UKUPNO'!E5","v":"subota"},null,{"$f":"'RAZRADA UKUPNO'!G5","v":5},{"$f":"'RAZRADA UKUPNO'!H5","v":"subota"}]
[]
{"$rows_left_out":65}
{"sheet":"RAZRADA GRUPA LA","index":14,"n_rows":70,"n_cols":10,"rows_kept":70,"cut":false,"hidden":false,"merged":[[2,3,2,4],[2,6,2,7],[0,1,0,8]]}
[{"$f":"'RAZRADA UKUPNO'!A1","v":"VINDIJA"},{"$f":"'RAZRADA UKUPNO'!B1:I1","v":"Dnevna prodaja od 08.08. i kumulativ dnevnog plana i prodaje za 01.- 08.08.2013"}]
[]
[null,null,null,{"$f":"'RAZRADA UKUPNO'!D3:E3","v":"Izvještaj za "},null,null,{"$f":"'RAZRADA UKUPNO'!G3:H3","v":"Kolovoz/Avgust"}]
[null,null,null,{"$f":"'RAZRADA UKUPNO'!D4","v":6},{"$f":"'RAZRADA UKUPNO'!E4","v":"dana +"},null,{"$f":"'RAZRADA UKUPNO'!G4","v":22},{"$f":"'RAZRADA UKUPNO'!H4","v":"dana +"}]
["KC LAJKOVAC",null,null,{"$f":"'RAZRADA UKUPNO'!D5","v":1},{"$f":"'RAZRADA UKUPNO'!E5","v":"subota"},null,{"$f":"'RAZRADA UKUPNO'!G5","v":5},{"$f":"'RAZRADA UKUPNO'!H5","v":"subota"}]
[]
{"$rows_left_out":65}
{"sheet":"RAZRADA GRUPA NI","index":15,"n_rows":70,"n_cols":10,"rows_kept":70,"cut":false,"hidden":false,"merged":[[2,3,2,4],[2,6,2,7],[0,1,0,8]]}
[{"$f":"'RAZRADA UKUPNO'!A1","v":"VINDIJA"},{"$f":"'RAZRADA UKUPNO'!B1:I1","v":"Dnevna prodaja od 08.08. i kumulativ dnevnog plana i prodaje za 01.- 08.08.2013"}]
[]
[null,null,null,{"$f":"'RAZRADA UKUPNO'!D3:E3","v":"Izvještaj za "},null,null,{"$f":"'RAZRADA UKUPNO'!G3:H3","v":"Kolovoz/Avgust"}]
[null,null,null,{"$f":"'RAZRADA UKUPNO'!D4","v":6},{"$f":"'RAZRADA UKUPNO'!E4","v":"dana +"},null,{"$f":"'RAZRADA UKUPNO'!G4","v":22},{"$f":"'RAZRADA UKUPNO'!H4","v":"dana +"}]
["KC NIŠ",null,null,{"$f":"'RAZRADA UKUPNO'!D5","v":1},{"$f":"'RAZRADA UKUPNO'!E5","v":"subota"},null,{"$f":"'RAZRADA UKUPNO'!G5","v":5},{"$f":"'RAZRADA UKUPNO'!H5","v":"subota"}]
[]
{"$rows_left_out":64}