{"text_format":"1","workbook":"xlsx","n_sheets":16,"sheets":["PLAN UNOSA","Podaci","Privremena baza","KUMULATIV","KUMULATIV 2","KUMULATIV 3","PRORAČUNI","PRORAČUN 2","PRORACUN 3","RAZRADA UKUPNO","RAZRADA KUPCI BG","RAZRADA KUPCI LA","RAZRADA KUPCI NI","RAZRADA GRUPA BG","RAZRADA GRUPA LA","RAZRADA GRUPA NI"],"not_rendered":{"charts":0,"images":0,"macros":1,"external_links":0,"defined_names":0,"comments":0,"pivot_tables":4},"unopened":[],"bounds":{"document_bytes":16777216,"sheet_cells":100000,"rows_first":2000,"rows_last":500,"rows_between":2000,"halvings":0,"cell_chars":16384,"cell_head_chars":4096},"cells_cut":0,"cells_raw":0,"read":"whole","date_system":"1900"}

{"sheet":"PLAN UNOSA","index":0,"n_rows":38,"n_cols":16,"rows_kept":38,"cut":false,"hidden":false,"merged":[]}
["ASORTIMAN","KC BEOGRAD",null,"KC LAJKOVAC",null,"KC NIŠ",null,"Izvoz Makedonija",null,"Izvoz Crna Gora",null,"Izvoz BIH - Majop",null,"Izvoz Bosna",null,"Delhaize"]
[]
["Pile GRILL - svj.",2085.8436998874445,null,816.50228129524407,null,900.41062398515805,null,0,null,443.00677863869282,null,308.02601089814817,null,1560,null,1069.4790868936693]
["Rasjek - svj.",2128.4880940289013,null,1009.5382715933578,null,630.93555403050311,null,0,null,1073.8377640627214,null,325.65611452269343,null,800.36674318289249,null,1852.9176147133005]
["Iznutrice svj.",210.12207866269944,null,93.534523475598945,null,129.47237767155363,null,0,null,73.709885657694969,null,0.1324244585185152,null,51.111111111111114,null,273.07664365795904]
["Pile GRILL - smrz.",466.66758704084822,null,318.66464352639548,null,497.79278713616469,null,0,null,0,null,0,null,0,null,0]
["Rasjek - smrz.",821.92470149579265,null,259.97121571552816,null,454.77859018192396,null,0,null,0,null,0,null,0,null,0]
["Iznutrice smrz.",38.049746027225559,null,15.249723013758775,null,65.567672529029252,null,0,null,0,null,0,null,0,null,0]
["Marinirani asortiman",49.620201495029768,null,6.3508495617254175,null,5.8481109794517545,null,0,null,2.0381642334837267,null,22.4158447851148,null,71.855479039329666,null,15.637765846182603]
["Prerađevine ",1481.4814814814815,null,818.51851851851848,null,1174.0740740740741,null,74.07407407407409,null,185.18518518518519,null,982.30185929629636,null,5466.1481481481478,null,92.592592592592581]
[null,null,null,null,null,null,null,0,null,0,null,0,null,0]
["Mliječni asortiman",120.38774183679016,null,85.693708975532331,null,115.23761601805812,null,null,null,null,null,null,null,null,null,0]
["Fermenti i deserti",57.646006592788247,null,54.250162640264477,null,130.84973350934189,null,0,null,0,null,0,null,0,null,0]
["Sirevi i namazi",10.472781614005335,null,11.094906162335134,null,19.663638947180605,null,0,null,0,null,0,null,0,null,0]
["Sokovi",14.107622726403784,null,16.89579145865865,null,9.7373265556783064,null,0,null,0,null,0,null,0,null,0]
[null,null,null,null,null,null,null,0,null,0,null,0,null,0]
["Svježe meso Cekin",0,null,0,null,0,null,null,null,null,null,null,null,null,null,0]
["Panirani proizvodi",24.065396860015646,null,18.60975982775977,null,10.586345534446805,null,0,null,0,null,0,null,0,null,0]
["Prerađevine Cekin",1.615463571425539,null,0.71893563516762526,null,1.0214988674809102,null,0,null,0,null,0,null,0,null,0]
["Marinirano",0,null,0,null,0,null,0,null,0,null,0,null,0,null,0]
["Prerađevine Vindon",6.3131915238205689,null,2.5764131834215167,null,2.3202419594245813,null,0,null,0,null,0,null,0,null,0]
["Svježe meso Vindon",0,null,0,null,0,null,0,null,0,null,0,null,0,null,0]
["Smrznuto meso Vindon",10.185083509420531,null,13.222539771482635,null,13.073858200578318,null,0,null,0,null,0,null,0,null,0]
[null,0,null,0,null,0,null,0,null,0,null,0,null,0,null,0]
["MESNI ASORTIMAN RH",null,null,null,null,null,null,0,null,0,null,0,null,0]
[]
[]
["ASORTIMAN","Beograd",null,"Lajkovac",null,"Niš"]
[]
["Pile GRILL - svj.",{"$f":"+B3+J3","v":2528.8504785261375},null,{"$f":"+D3+L3","v":1124.5282921933922},null,{"$f":"+F3+N3","v":2460.4106239851581}]
["Rasjek - svj.",{"$f":"+B4+J4","v":3202.3258580916226},null,1335.1943861160512,null,1431.3022972133956]
["Iznutrice svj.",283.83196432039438,null,93.666947934117459,null,180.58348878266474]
["Pile GRILL - smrz.",466.66758704084822,null,318.66464352639548,null,497.79278713616469]
["Rasjek - smrz.",821.92470149579265,null,259.97121571552816,null,454.77859018192396]
["Iznutrice smrz.",38.049746027225559,null,15.249723013758775,null,65.567672529029252]
["Marinirani asortiman",51.658365728513495,null,28.766694346840218,null,77.703590018781426]
["Prerađevine ",1666.6666666666667,null,1800.8203778148149,null,6640.2222222222217]
[null,{"$f":"SUM(B30:B37)","v":9059.9753678972011},null,{"$f":"SUM(D30:D37)","v":4976.8622806608983},null,{"$f":"SUM(F30:F37)","v":11808.36127206934}]

{"sheet":"Podaci","index":1,"n_rows":34,"n_cols":5,"rows_kept":34,"cut":false,"hidden":false,"merged":[[30,0,30,1]]}
[]
["2013-08-01","PRVI DAN MESECA"]
["2013-08-08","TEKUĆI DAN"]
["2013-08-31","POSLEDNJI DAN MESECA"]
[]
["Lista praznika"]
["2013-01-01","NOVA GODINA"]
["2013-01-02","NOVA GODINA"]
["2013-01-07","BOŽIĆ"]
["2013-05-06","USKRS"]
["2013-05-01","1.MAJ"]
[]
[]
[]
[]
[]
[]
[1,"SIJEČANJ","JANUAR","I"]
[2,"VELJAČA","FEBRUAR","II"]
[3,"OŽUJAK","MART","III"]
[4,"TRAVANJ","APRIL","IV"]
[5,"SVIBANJ","MAJ","V"]
[6,"LIPANJ","JUN","VI"]
[7,"SRPANJ","JUL","VII"]
[8,"KOLOVOZ","AVGUST","VIII"]
[9,"RUJAN","SEPTEMBAR","IX"]
[10,"LISTOPAD","OKTPBAR","X"]
[11,"STUDENI","NOVEMBAR","XI"]
[12,"PROSINAC","DECEMBAR","XII"]
[]
["Datum",null,{"$f":"A3","v":"2013-08-08"}]
["Dan:",{"$f":"DAY(A3)","v":8}]
["Mesec:",{"$f":"MONTH(A3)","v":8},{"$f":"VLOOKUP(B33,A18:B29,2)","v":"KOLOVOZ"},{"$f":"VLOOKUP(B33,A18:C29,3)","v":"AVGUST"},{"$f":"VLOOKUP(B33,A18:D29,4)","v":"VIII"}]
["Godina:",{"$f":"YEAR(A3)","v":2013}]

{"sheet":"Privremena baza","index":2,"n_rows":2108,"n_cols":13,"rows_kept":2108,"cut":false,"hidden":false,"merged":[]}
["PROIZVOD","SIFRA_REFERENTA","IME_PREZIME_REFERENTA","DOSTAVNO_MESTO","KP","UKUPNA_TEZINA","KC","GRUPA",null,"SIFRA_REFERENTA","KC","PROIZVOD","GRUPA"]
[1,"1","Lajkovac","FF",0,0,{"$f":"INDEX($J$1:$K$37, MATCH(B2,$J$1:$J$37,), MATCH(\"KC\",$J$1:$K$1,))","v":"Lajkovac"},{"$f":"INDEX($L$1:$M$161, MATCH(A2,$L$1:$L$161,), MATCH(\"GRUPA\",$L$1:$M$1,))","v":"1. Sveži proizvodi"},null,"807","Lajkovac",1,"1. Sveži proizvodi"]
[2,"1","Lajkovac","FF",0,0,{"$f":"INDEX($J$1:$K$37, MATCH(B3,$J$1:$J$37,), MATCH(\"KC\",$J$1:$K$1,))","v":"Lajkovac"},{"$f":"INDEX($L$1:$M$161, MATCH(A3,$L$1:$L$161,), MATCH(\"GRUPA\",$L$1:$M$1,))","v":"1. Sveži proizvodi"},null,"128","Beograd",2,"1. Sveži proizvodi"]
[3,"1","Lajkovac","FF",0,0,"Lajkovac","1. Sveži proizvodi",null,"131","Beograd",3,"1. Sveži proizvodi"]
[4,"1","Lajkovac","FF",0,0,"Lajkovac","1. Sveži proizvodi",null,"113","Lajkovac",4,"1. Sveži proizvodi"]
[5,"1","Lajkovac","FF",0,0,"Lajkovac","1. Sveži proizvodi",null,"114","Lajkovac",5,"1. Sveži proizvodi"]
[6,"1","Lajkovac","FF",0,0,"Lajkovac","1. Sveži proizvodi",null,"115","Lajkovac",6,"1. Sveži proizvodi"]
[7,"1","Lajkovac","FF",0,0,"Lajkovac","1. Sveži proizvodi",null,"126","Beograd",7,"1. Sveži proizvodi"]
[8,"1","Lajkovac","FF",0,0,"Lajkovac","1. Sveži proizvodi",null,"1","Lajkovac",8,"1. Sveži proizvodi"]
[9,"1","Lajkovac","FF",0,0,"Lajkovac","1. Sveži proizvodi",null,"2","Beograd",9,"1. Sveži proizvodi"]
[10,"1","Lajkovac","FF",0,0,"Lajkovac","1. Sveži proizvodi",null,"103","Lajkovac",10,"1. Sveži proizvodi"]
[11,"1","Lajkovac","FF",0,0,"Lajkovac","1. Sveži proizvodi",null,"0","Lajkovac",11,"1. Sveži proizvodi"]
[12,"1","Lajkovac","FF",0,0,"Lajkovac","1. Sveži proizvodi",null,"102","Beograd",12,"1. Sveži proizvodi"]
[13,"1","Lajkovac","FF",0,0,"Lajkovac","1. Sveži proizvodi",null,"141","Beograd",13,"1. Sveži proizvodi"]
[14,"1","Lajkovac","FF",0,0,"Lajkovac","1. Sveži proizvodi",null,"142","Beograd",14,"1. Sveži proizvodi"]
[15,"1","Lajkovac","FF",0,0,"Lajkovac","1. Sveži proizvodi",null,"151","Beograd",15,"1. Sveži proizvodi"]
[16,"1","Lajkovac","FF",0,0,"Lajkovac","1. Sveži proizvodi",null,"153","Lajkovac",16,"1. Sveži proizvodi"]
[17,"1","Lajkovac","FF",0,0,"Lajkovac","1. Sveži proizvodi",null,"154","Lajkovac",17,"1. Sveži proizvodi"]
[18,"1","Lajkovac","FF",0,0,"Lajkovac","1. Sveži proizvodi",null,"146","Niš",18,"1. Sveži proizvodi"]
[19,"1","Lajkovac","FF",0,0,"Lajkovac","1. Sveži proizvodi",null,"3","Niš",19,"1. Sveži proizvodi"]
[20,"1","Lajkovac","FF",0,0,"Lajkovac","1. Sveži proizvodi",null,"166","Niš",20,"1. Sveži proizvodi"]
[21,"1","Lajkovac","FF",0,0,"Lajkovac","1. Sveži proizvodi",null,"109","Lajkovac",21,"1. Sveži proizvodi"]
[22,"1","Lajkovac","FF",0,0,"Lajkovac","1. Sveži proizvodi",null,"4","Izvoz Crna Gora",22,"1. Sveži proizvodi"]
[23,"1","Lajkovac","FF",0,0,"Lajkovac","1. Sveži proizvodi",null,"178","Lajkovac",23,"1. Sveži proizvodi"]
[24,"1","Lajkovac","FF",0,0,"Lajkovac","1. Sveži proizvodi",null,"5","Lajkovac",24,"1. Sveži proizvodi"]
[25,"1","Lajkovac","FF",0,0,"Lajkovac","1. Sveži proizvodi",null,"182","Niš",25,"1. Sveži proizvodi"]
[26,"1","Lajkovac","FF",0,0,"Lajkovac","1. Sveži proizvodi",null,"195","Lajkovac",26,"1. Sveži proizvodi"]
[27,"1","Lajkovac","FF",0,0,"Lajkovac","1. Sveži proizvodi",null,"196","Lajkovac",27,"1. Sveži proizvodi"]
[28,"1","Lajkovac","FF",0,0,"Lajkovac","1. Sveži proizvodi",null,"193","Beograd",28,"1. Sveži proizvodi"]
[29,"1","Lajkovac","FF",0,0,"Lajkovac","1. Sveži proizvodi",null,"210","Beograd",29,"1. Sveži proizvodi"]
[30,"1","Lajkovac","FF",0,0,"Lajkovac","1. Sveži proizvodi",null,"209","Beograd",30,"1. Sveži proizvodi"]
[31,"1","Lajkovac","FF",0,0,"Lajkovac","1. Sveži proizvodi",null,"9","Izvoz Makedonija",31,"1. Sveži proizvodi"]
[32,"1","Lajkovac","FF",0,0,"Lajkovac","1. Sveži proizvodi",null,"212","Beograd",32,"1. Sveži proizvodi"]
[33,"1","Lajkovac","FF",0,0,"Lajkovac","1. Sveži proizvodi",null,"808","Lajkovac",33,"1. Sveži proizvodi"]
[34,"1","Lajkovac","FF",0,0,"Lajkovac","1. Sveži proizvodi",null,"10","Izvoz BIH",34,"1. Sveži proizvodi"]
[37,"1","Lajkovac","FF",0,0,"Lajkovac","1. Sveži proizvodi",null,"11","Izvoz BIH Majop",37,"1. Sveži proizvodi"]
[38,"1","Lajkovac","FF",0,0,"Lajkovac","1. Sveži proizvodi",null,"217","Beograd",38,"1. Sveži proizvodi"]
[39,"1","Lajkovac","FF",0,0,"Lajkovac","1. Sveži proizvodi",null,null,null,39,"1. Sveži proizvodi"]
[40,"1","Lajkovac","FF",0,0,"Lajkovac","1. Sveži proizvodi",null,null,null,40,"1. Sveži proizvodi"]
[41,"1","Lajkovac","FF",0,0,"Lajkovac","1. Sveži proizvodi",null,null,null,41,"1. Sveži proizvodi"]
[42,"1","Lajkovac","FF",0,0,"Lajkovac","1. Sveži proizvodi",null,null,null,42,"1. Sveži proizvodi"]
[43,"1","Lajkovac","FF",0,0,"Lajkovac","1. Sveži proizvodi",null,null,null,43,"1. Sveži proizvodi"]
[44,"1","Lajkovac","FF",0,0,"Lajkovac","1. Sveži proizvodi",null,null,null,44,"1. Sveži proizvodi"]
[45,"1","Lajkovac","FF",0,0,"Lajkovac","1. Sveži proizvodi",null,null,null,45,"1. Sveži proizvodi"]
[46,"1","Lajkovac","FF",0,0,"Lajkovac","1. Sveži proizvodi",null,null,null,46,"1. Sveži proizvodi"]
[47,"1","Lajkovac","FF",0,0,"Lajkovac","1. Sveži proizvodi",null,null,null,47,"1. Sveži proizvodi"]
[48,"1","Lajkovac","FF",0,0,"Lajkovac","1. Sveži proizvodi",null,null,null,48,"1. Sveži proizvodi"]
[49,"1","Lajkovac","FF",0,0,"Lajkovac","1. Sveži proizvodi",null,null,null,49,"1. Sveži proizvodi"]
[50,"1","Lajkovac","FF",0,0,"Lajkovac","1. Sveži proizvodi",null,null,null,50,"1. Sveži proizvodi"]
[51,"1","Lajkovac","FF",0,0,"Lajkovac","1. Sveži proizvodi",null,null,null,51,"1. Sveži proizvodi"]
[52,"1","Lajkovac","FF",0,0,"Lajkovac","1. Sveži proizvodi",null,null,null,52,"1. Sveži proizvodi"]
[53,"1","Lajkovac","FF",0,0,"Lajkovac","1. Sveži proizvodi",null,null,null,53,"1. Sveži proizvodi"]
[54,"1","Lajkovac","FF",0,0,"Lajkovac","1. Sveži proizvodi",null,null,null,54,"1. Sveži proizvodi"]
[55,"1","Lajkovac","FF",0,0,"Lajkovac","1. Sveži proizvodi",null,null,null,55,"1. Sveži proizvodi"]
[56,"1","Lajkovac","FF",0,0,"Lajkovac","1. Sveži proizvodi",null,null,null,56,"1. Sveži proizvodi"]
[57,"1","Lajkovac","FF",0,0,"Lajkovac","1. Sveži proizvodi",null,null,null,57,"1. Sveži proizvodi"]
[58,"1","Lajkovac","FF",0,0,"Lajkovac","1. Sveži proizvodi",null,null,null,58,"1. Sveži proizvodi"]
[59,"1","Lajkovac","FF",0,0,"Lajkovac","1. Sveži proizvodi",null,null,null,59,"1. Sveži proizvodi"]
[61,"1","Lajkovac","FF",0,0,"Lajkovac","1. Sveži proizvodi",null,null,null,61,"1. Sveži proizvodi"]
[62,"1","Lajkovac","FF",0,0,"Lajkovac","1. Sveži proizvodi",null,null,null,62,"1. Sveži proizvodi"]
[63,"1","Lajkovac","FF",0,0,"Lajkovac","1. Sveži proizvodi",null,null,null,63,"1. Sveži proizvodi"]
[64,"1","Lajkovac","FF",0,0,"Lajkovac","1. Sveži proizvodi",null,null,null,64,"1. Sveži proizvodi"]
[65,"1","Lajkovac","FF",0,0,"Lajkovac","1. Sveži proizvodi",null,null,null,65,"1. Sveži proizvodi"]
[66,"1","Lajkovac","FF",0,0,"Lajkovac","1. Sveži proizvodi",null,null,null,66,"1. Sveži proizvodi"]
[67,"1","Lajkovac","FF",0,0,"Lajkovac","1. Sveži proizvodi",null,null,null,67,"1. Sveži proizvodi"]
[68,"1","Lajkovac","FF",0,0,"Lajkovac","1. Sveži proizvodi",null,null,null,68,"1. Sveži proizvodi"]
[69,"1","Lajkovac","FF",0,0,{"$f":"INDEX($J$1:$K$37, MATCH(B67,$J$1:$J$37,), MATCH(\"KC\",$J$1:$K$1,))","v":"Lajkovac"},{"$f":"INDEX($L$1:$M$161, MATCH(A67,$L$1:$L$161,), MATCH(\"GRUPA\",$L$1:$M$1,))","v":"1. Sveži proizvodi"},null,null,null,69,"1. Sveži proizvodi"]
[71,"1","Lajkovac","FF",0,0,"Lajkovac","1. Sveži proizvodi",null,null,null,71,"1. Sveži proizvodi"]
[72,"1","Lajkovac","FF",0,0,"Lajkovac","1. Sveži proizvodi",null,null,null,72,"1. Sveži proizvodi"]
[73,"1","Lajkovac","FF",0,0,"Lajkovac","1. Sveži proizvodi",null,null,null,73,"1. Sveži proizvodi"]
[74,"1","Lajkovac","FF",0,0,"Lajkovac","1. Sveži proizvodi",null,null,null,74,"1. Sveži proizvodi"]
[75,"1","Lajkovac","FF",0,0,"Lajkovac","1. Sveži proizvodi",null,null,null,75,"1. Sveži proizvodi"]
[76,"1","Lajkovac","FF",0,0,"Lajkovac","1. Sveži proizvodi",null,null,null,76,"1. Sveži proizvodi"]
[77,"1","Lajkovac","FF",0,0,"Lajkovac","1. Sveži proizvodi",null,null,null,77,"1. Sveži proizvodi"]
[78,"1","Lajkovac","FF",0,0,"Lajkovac","1. Sveži proizvodi",null,null,null,78,"1. Sveži proizvodi"]
[80,"1","Lajkovac","FF",0,0,"Lajkovac","1. Sveži proizvodi",null,null,null,80,"1. Sveži proizvodi"]
[82,"1","Lajkovac","FF",0,0,"Lajkovac","1. Sveži proizvodi",null,null,null,82,"1. Sveži proizvodi"]
[89,"1","Lajkovac","FF",0,0,"Lajkovac","1. Sveži proizvodi",null,null,null,89,"1. Sveži proizvodi"]
[90,"1","Lajkovac","FF",0,0,"Lajkovac","1. Sveži proizvodi",null,null,null,90,"1. Sveži proizvodi"]
[92,"1","Lajkovac","FF",0,0,"Lajkovac","1. Sveži proizvodi",null,null,null,92,"1. Sveži proizvodi"]
[93,"1","Lajkovac","FF",0,0,"Lajkovac","1. Sveži proizvodi",null,null,null,93,"1. Sveži proizvodi"]
[94,"1","Lajkovac","FF",0,0,"Lajkovac","1. Sveži proizvodi",null,null,null,94,"1. Sveži proizvodi"]
[95,"1","Lajkovac","FF",0,0,"Lajkovac","1. Sveži proizvodi",null,null,null,95,"1. Sveži proizvodi"]
[96,"1","Lajkovac","FF",0,0,"Lajkovac","1. Sveži proizvodi",null,null,null,96,"1. Sveži proizvodi"]
[97,"1","Lajkovac","FF",0,0,"Lajkovac","1. Sveži proizvodi",null,null,null,97,"1. Sveži proizvodi"]
[98,"1","Lajkovac","FF",0,0,"Lajkovac","1. Sveži proizvodi",null,null,null,98,"1. Sveži proizvodi"]
[99,"1","Lajkovac","FF",0,0,"Lajkovac","1. Sveži proizvodi",null,null,null,99,"1. Sveži proizvodi"]
[151,"1","Lajkovac","FF",0,0,"Lajkovac","2. Smrznuti proizvodi",null,null,null,151,"2. Smrznuti proizvodi"]
[152,"1","Lajkovac","FF",0,0,"Lajkovac","2. Smrznuti proizvodi",null,null,null,152,"2. Smrznuti proizvodi"]
[153,"1","Lajkovac","FF",0,0,"Lajkovac","2. Smrznuti proizvodi",null,null,null,153,"2. Smrznuti proizvodi"]
[154,"1","Lajkovac","FF",0,0,"Lajkovac","2. Smrznuti proizvodi",null,null,null,154,"2. Smrznuti proizvodi"]
[155,"1","Lajkovac","FF",0,0,"Lajkovac","2. Smrznuti proizvodi",null,null,null,155,"2. Smrznuti proizvodi"]
[156,"1","Lajkovac","FF",0,0,"Lajkovac","2. Smrznuti proizvodi",null,null,null,156,"2. Smrznuti proizvodi"]
[157,"1","Lajkovac","FF",0,0,"Lajkovac","2. Smrznuti proizvodi",null,null,null,157,"2. Smrznuti proizvodi"]
[158,"1","Lajkovac","FF",0,0,"Lajkovac","2. Smrznuti proizvodi",null,null,null,158,"2. Smrznuti proizvodi"]
[159,"1","Lajkovac","FF",0,0,"Lajkovac","2. Smrznuti proizvodi",null,null,null,159,"2. Smrznuti proizvodi"]
[160,"1","Lajkovac","FF",0,0,"Lajkovac","2. Smrznuti proizvodi",null,null,null,160,"2. Smrznuti proizvodi"]
[161,"1","Lajkovac","FF",0,0,"Lajkovac","2. Smrznuti proizvodi",null,null,null,161,"2. Smrznuti proizvodi"]
[162,"1","Lajkovac","FF",0,0,"Lajkovac","2. Smrznuti proizvodi",null,null,null,162,"2. Smrznuti proizvodi"]
[163,"1","Lajkovac","FF",0,0,"Lajkovac","2. Smrznuti proizvodi",null,null,null,163,"2. Smrznuti proizvodi"]
[164,"1","Lajkovac","FF",0,0,"Lajkovac","2. Smrznuti proizvodi",null,null,null,164,"2. Smrznuti proizvodi"]
[165,"1","Lajkovac","FF",0,0,"Lajkovac","2. Smrznuti proizvodi",null,null,null,165,"2. Smrznuti proizvodi"]
[166,"1","Lajkovac","FF",0,0,"Lajkovac","2. Smrznuti proizvodi",null,null,null,166,"2. Smrznuti proizvodi"]
[171,"1","Lajkovac","FF",0,0,"Lajkovac","2. Smrznuti proizvodi",null,null,null,171,"2. Smrznuti proizvodi"]
[172,"1","Lajkovac","FF",0,0,"Lajkovac","2. Smrznuti proizvodi",null,null,null,172,"2. Smrznuti proizvodi"]
[301,"1","Lajkovac","FF",0,0,"Lajkovac","3. Prepađevine",null,null,null,301,"3. Prepađevine"]
[302,"1","Lajkovac","FF",0,0,"Lajkovac","3. Prepađevine",null,null,null,302,"3. Prepađevine"]
[303,"1","Lajkovac","FF",0,0,"Lajkovac","3. Prepađevine",null,null,null,303,"3. Prepađevine"]
[304,"1","Lajkovac","FF",0,0,"Lajkovac","3. Prepađevine",null,null,null,304,"3. Prepađevine"]
[305,"1","Lajkovac","FF",0,0,"Lajkovac","3. Prepađevine",null,null,null,305,"3. Prepađevine"]
[306,"1","Lajkovac","FF",0,0,"Lajkovac","3. Prepađevine",null,null,null,306,"3. Prepađevine"]
[307,"1","Lajkovac","FF",0,0,"Lajkovac","3. Prepađevine",null,null,null,307,"3. Prepađevine"]
[308,"1","Lajkovac","FF",0,0,"Lajkovac","3. Prepađevine",null,null,null,308,"3. Prepađevine"]
[309,"1","Lajkovac","FF",0,0,"Lajkovac","3. Prepađevine",null,null,null,309,"3. Prepađevine"]
[310,"1","Lajkovac","FF",0,0,"Lajkovac","3. Prepađevine",null,null,null,310,"3. Prepađevine"]
[311,"1","Lajkovac","FF",0,0,"Lajkovac","3. Prepađevine",null,null,null,311,"3. Prepađevine"]
[312,"1","Lajkovac","FF",0,0,"Lajkovac","3. Prepađevine",null,null,null,312,"3. Prepađevine"]
[313,"1","Lajkovac","FF",0,0,"Lajkovac","3. Prepađevine",null,null,null,313,"3. Prepađevine"]
[314,"1","Lajkovac","FF",0,0,"Lajkovac","3. Prepađevine",null,null,null,314,"3. Prepađevine"]
[315,"1","Lajkovac","FF",0,0,"Lajkovac","3. Prepađevine",null,null,null,315,"3. Prepađevine"]
[316,"1","Lajkovac","FF",0,0,"Lajkovac","3. Prepađevine",null,null,null,316,"3. Prepađevine"]
[317,"1","Lajkovac","FF",0,0,"Lajkovac","3. Prepađevine",null,null,null,317,"3. Prepađevine"]
[318,"1","Lajkovac","FF",0,0,"Lajkovac","3. Prepađevine",null,null,null,318,"3. Prepađevine"]
[319,"1","Lajkovac","FF",0,0,"Lajkovac","3. Prepađevine",null,null,null,319,"3. Prepađevine"]
[321,"1","Lajkovac","FF",0,0,"Lajkovac","3. Prepađevine",null,null,null,321,"3. Prepađevine"]
[322,"1","Lajkovac","FF",0,0,"Lajkovac","3. Prepađevine",null,null,null,322,"3. Prepađevine"]
[323,"1","Lajkovac","FF",0,0,"Lajkovac","3. Prepađevine",null,null,null,323,"3. Prepađevine"]
[324,"1","Lajkovac","FF",0,0,"Lajkovac","3. Prepađevine",null,null,null,324,"3. Prepađevine"]
[326,"1","Lajkovac","FF",0,0,"Lajkovac","3. Prepađevine",null,null,null,326,"3. Prepađevine"]
[327,"1","Lajkovac","FF",0,0,"Lajkovac","3. Prepađevine",null,null,null,327,"3. Prepađevine"]
[330,"1","Lajkovac","FF",0,0,{"$f":"INDEX($J$1:$K$37, MATCH(B131,$J$1:$J$37,), MATCH(\"KC\",$J$1:$K$1,))","v":"Lajkovac"},{"$f":"INDEX($L$1:$M$161, MATCH(A131,$L$1:$L$161,), MATCH(\"GRUPA\",$L$1:$M$1,))","v":"3. Prepađevine"},null,null,null,330,"3. Prepađevine"]
[335,"1","Lajkovac","FF",0,0,"Lajkovac","3. Prepađevine",null,null,null,335,"3. Prepađevine"]
[336,"1","Lajkovac","FF",0,0,"Lajkovac","3. Prepađevine",null,null,null,336,"3. Prepađevine"]
[337,"1","Lajkovac","FF",0,0,"Lajkovac","3. Prepađevine",null,null,null,337,"3. Prepađevine"]
[338,"1","Lajkovac","FF",0,0,"Lajkovac","3. Prepađevine",null,null,null,338,"3. Prepađevine"]
[339,"1","Lajkovac","FF",0,0,"Lajkovac","3. Prepađevine",null,null,null,339,"3. Prepađevine"]
[351,"1","Lajkovac","FF",0,0,"Lajkovac","3. Prepađevine",null,null,null,351,"3. Prepađevine"]
[352,"1","Lajkovac","FF",0,0,"Lajkovac","3. Prepađevine",null,null,null,352,"3. Prepađevine"]
[353,"1","Lajkovac","FF",0,0,"Lajkovac","3. Prepađevine",null,null,null,353,"3. Prepađevine"]
[354,"1","Lajkovac","FF",0,0,"Lajkovac","3. Prepađevine",null,null,null,354,"3. Prepađevine"]
[355,"1","Lajkovac","FF",0,0,"Lajkovac","3. Prepađevine",null,null,null,355,"3. Prepađevine"]
[356,"1","Lajkovac","FF",0,0,"Lajkovac","3. Prepađevine",null,null,null,356,"3. Prepađevine"]
[357,"1","Lajkovac","FF",0,0,"Lajkovac","3. Prepađevine",null,null,null,357,"3. Prepađevine"]
[360,"1","Lajkovac","FF",0,0,"Lajkovac","3. Prepađevine",null,null,null,360,"3. Prepađevine"]
[361,"1","Lajkovac","FF",0,0,"Lajkovac","3. Prepađevine",null,null,null,361,"3. Prepađevine"]
[362,"1","Lajkovac","FF",0,0,"Lajkovac","3. Prepađevine",null,null,null,362,"3. Prepađevine"]
[364,"1","Lajkovac","FF",0,0,"Lajkovac","3. Prepađevine",null,null,null,364,"3. Prepađevine"]
[365,"1","Lajkovac","FF",0,0,"Lajkovac","3. Prepađevine",null,null,null,365,"3. Prepađevine"]
[366,"1","Lajkovac","FF",0,0,"Lajkovac","3. Prepađevine",null,null,null,366,"3. Prepađevine"]
[367,"1","Lajkovac","FF",0,0,"Lajkovac","3. Prepađevine",null,null,null,367,"3. Prepađevine"]
[368,"1","Lajkovac","FF",0,0,"Lajkovac","3. Prepađevine",null,null,null,368,"3. Prepađevine"]
[369,"1","Lajkovac","FF",0,0,"Lajkovac","3. Prepađevine",null,null,null,369,"3. Prepađevine"]
[370,"1","Lajkovac","FF",0,0,"Lajkovac","3. Prepađevine",null,null,null,370,"3. Prepađevine"]
[371,"1","Lajkovac","FF",0,0,"Lajkovac","3. Prepađevine",null,null,null,371,"3. Prepađevine"]
[372,"1","Lajkovac","FF",0,0,"Lajkovac","3. Prepađevine",null,null,null,372,"3. Prepađevine"]
[373,"1","Lajkovac","FF",0,0,"Lajkovac","3. Prepađevine",null,null,null,373,"3. Prepađevine"]
[374,"1","Lajkovac","FF",0,0,"Lajkovac","3. Prepađevine",null,null,null,374,"3. Prepađevine"]
[375,"1","Lajkovac","FF",0,0,"Lajkovac","3. Prepađevine",null,null,null,375,"3. Prepađevine"]
[376,"1","Lajkovac","FF",0,0,"Lajkovac","3. Prepađevine",null,null,null,376,"3. Prepađevine"]
[377,"1","Lajkovac","FF",0,0,"Lajkovac","3. Prepađevine",null,null,null,377,"3. Prepađevine"]
[378,"1","Lajkovac","FF",0,0,"Lajkovac","3. Prepađevine",null,null,null,378,"3. Prepađevine"]
[401,"1","Lajkovac","FF",0,0,"Lajkovac",{"$error":"#N/A"}]
[802,"1","Lajkovac","FF",0,0,"Lajkovac",{"$error":"#N/A"}]
[2050,"1","Lajkovac","FF",0,0,"Lajkovac",{"$error":"#N/A"}]
[2065,"1","Lajkovac","FF",0,0,"Lajkovac",{"$error":"#N/A"}]
[2185,"1","Lajkovac","FF",0,0,"Lajkovac",{"$error":"#N/A"}]
[2320,"1","Lajkovac","FF",0,0,"Lajkovac",{"$error":"#N/A"}]
[2330,"1","Lajkovac","FF",0,0,"Lajkovac",{"$error":"#N/A"}]
[2335,"1","Lajkovac","FF",0,0,"Lajkovac",{"$error":"#N/A"}]
[2600,"1","Lajkovac","FF",0,0,"Lajkovac",{"$error":"#N/A"}]
[2660,"1","Lajkovac","FF",0,0,"Lajkovac",{"$error":"#N/A"}]
[3049,"1","Lajkovac","FF",0,0,"Lajkovac",{"$error":"#N/A"}]
[3051,"1","Lajkovac","FF",0,0,"Lajkovac",{"$error":"#N/A"}]
[3052,"1","Lajkovac","FF",0,0,"Lajkovac",{"$error":"#N/A"}]
[3054,"1","Lajkovac","FF",0,0,"Lajkovac",{"$error":"#N/A"}]
[3055,"1","Lajkovac","FF",0,0,"Lajkovac",{"$error":"#N/A"}]
[3062,"1","Lajkovac","FF",0,0,"Lajkovac",{"$error":"#N/A"}]
[3068,"1","Lajkovac","FF",0,0,"Lajkovac",{"$error":"#N/A"}]
[3087,"1","Lajkovac","FF",0,0,"Lajkovac",{"$error":"#N/A"}]
[3092,"1","Lajkovac","FF",0,0,"Lajkovac",{"$error":"#N/A"}]
[3127,"1","Lajkovac","FF",0,0,"Lajkovac",{"$error":"#N/A"}]
[3130,"1","Lajkovac","FF",0,0,"Lajkovac",{"$error":"#N/A"}]
[3135,"1","Lajkovac","FF",0,0,"Lajkovac",{"$error":"#N/A"}]
[3154,"1","Lajkovac","FF",0,0,"Lajkovac",{"$error":"#N/A"}]
[3162,"1","Lajkovac","FF",0,0,"Lajkovac",{"$error":"#N/A"}]
[3182,"1","Lajkovac","FF",0,0,"Lajkovac",{"$error":"#N/A"}]
[3195,"1","Lajkovac","FF",0,0,"Lajkovac",{"$error":"#N/A"}]
[3196,"1","Lajkovac","FF",0,0,"Lajkovac",{"$error":"#N/A"}]
[3225,"1","Lajkovac","FF",0,0,"Lajkovac",{"$error":"#N/A"}]
[3228,"1","Lajkovac","FF",0,0,"Lajkovac",{"$error":"#N/A"}]
[3358,"1","Lajkovac","FF",0,0,"Lajkovac",{"$error":"#N/A"}]
[3395,"1","Lajkovac","FF",0,0,"Lajkovac",{"$error":"#N/A"}]
[3550,"1","Lajkovac","FF",0,0,"Lajkovac",{"$error":"#N/A"}]
[3552,"1","Lajkovac","FF",0,0,"Lajkovac",{"$error":"#N/A"}]
[3645,"1","Lajkovac","FF",0,0,{"$f":"INDEX($J$1:$K$37, MATCH(B195,$J$1:$J$37,), MATCH(\"KC\",$J$1:$K$1,))","v":"Lajkovac"},{"$f":"INDEX($L$1:$M$161, MATCH(A195,$L$1:$L$161,), MATCH(\"GRUPA\",$L$1:$M$1,))","v":{"$error":"#N/A"}}]
[3648,"1","Lajkovac","FF",0,0,"Lajkovac",{"$error":"#N/A"}]
[4000,"1","Lajkovac","FF",0,0,"Lajkovac",{"$error":"#N/A"}]
[4008,"1","Lajkovac","FF",0,0,"Lajkovac",{"$error":"#N/A"}]
[4010,"1","Lajkovac","FF",0,0,"Lajkovac",{"$error":"#N/A"}]
[4018,"1","Lajkovac","FF",0,0,"Lajkovac",{"$error":"#N/A"}]
[4012,"1","Lajkovac","FF",0,0,"Lajkovac",{"$error":"#N/A"}]
[4015,"1","Lajkovac","FF",0,0,"Lajkovac",{"$error":"#N/A"}]
[4050,"1","Lajkovac","FF",0,0,"Lajkovac",{"$error":"#N/A"}]
[4060,"1","Lajkovac","FF",0,0,"Lajkovac",{"$error":"#N/A"}]
[4110,"1","Lajkovac","FF",0,0,"Lajkovac",{"$error":"#N/A"}]
[5190,"1","Lajkovac","FF",0,0,"Lajkovac",{"$error":"#N/A"}]
[5200,"1","Lajkovac","FF",0,0,"Lajkovac",{"$error":"#N/A"}]
[5221,"1","Lajkovac","FF",0,0,"Lajkovac",{"$error":"#N/A"}]
[5224,"1","Lajkovac","FF",0,0,"Lajkovac",{"$error":"#N/A"}]
[5240,"1","Lajkovac","FF",0,0,"Lajkovac",{"$error":"#N/A"}]
[5242,"1","Lajkovac","FF",0,0,"Lajkovac",{"$error":"#N/A"}]
[5243,"1","Lajkovac","FF",0,0,"Lajkovac",{"$error":"#N/A"}]
[5246,"1","Lajkovac","FF",0,0,"Lajkovac",{"$error":"#N/A"}]
[5248,"1","Lajkovac","FF",0,0,"Lajkovac",{"$error":"#N/A"}]
[5249,"1","Lajkovac","FF",0,0,"Lajkovac",{"$error":"#N/A"}]
[5251,"1","Lajkovac","FF",0,0,"Lajkovac",{"$error":"#N/A"}]
[5268,"1","Lajkovac","FF",0,0,"Lajkovac",{"$error":"#N/A"}]
[5270,"1","Lajkovac","FF",0,0,"Lajkovac",{"$error":"#N/A"}]
[5372,"1","Lajkovac","FF",0,0,"Lajkovac",{"$error":"#N/A"}]
[5373,"1","Lajkovac","FF",0,0,"Lajkovac",{"$error":"#N/A"}]
[5836,"1","Lajkovac","FF",0,0,"Lajkovac",{"$error":"#N/A"}]
[5920,"1","Lajkovac","FF",0,0,"Lajkovac",{"$error":"#N/A"}]
[5923,"1","Lajkovac","FF",0,0,"Lajkovac",{"$error":"#N/A"}]
[5924,"1","Lajkovac","FF",0,0,"Lajkovac",{"$error":"#N/A"}]
[5938,"1","Lajkovac","FF",0,0,"Lajkovac",{"$error":"#N/A"}]
[5939,"1","Lajkovac","FF",0,0,"Lajkovac",{"$error":"#N/A"}]
[5941,"1","Lajkovac","FF",0,0,"Lajkovac",{"$error":"#N/A"}]
[5944,"1","Lajkovac","FF",0,0,"Lajkovac",{"$error":"#N/A"}]
[7340,"1","Lajkovac","FF",0,0,"Lajkovac",{"$error":"#N/A"}]
[7348,"1","Lajkovac","FF",0,0,"Lajkovac",{"$error":"#N/A"}]
[7342,"1","Lajkovac","FF",0,0,"Lajkovac",{"$error":"#N/A"}]
[7347,"1","Lajkovac","FF",0,0,"Lajkovac",{"$error":"#N/A"}]
[7370,"1","Lajkovac","FF",0,0,"Lajkovac",{"$error":"#N/A"}]
[7371,"1","Lajkovac","FF",0,0,"Lajkovac",{"$error":"#N/A"}]
[7372,"1","Lajkovac","FF",0,0,"Lajkovac",{"$error":"#N/A"}]
[7373,"1","Lajkovac","FF",0,0,"Lajkovac",{"$error":"#N/A"}]
[7374,"1","Lajkovac","FF",0,0,"Lajkovac",{"$error":"#N/A"}]
[7376,"1","Lajkovac","FF",0,0,"Lajkovac",{"$error":"#N/A"}]
[7377,"1","Lajkovac","FF",0,0,"Lajkovac",{"$error":"#N/A"}]
[7378,"1","Lajkovac","FF",0,0,"Lajkovac",{"$error":"#N/A"}]
[7379,"1","Lajkovac","FF",0,0,"Lajkovac",{"$error":"#N/A"}]
[7380,"1","Lajkovac","FF",0,0,"Lajkovac",{"$error":"#N/A"}]
[7497,"1","Lajkovac","FF",0,0,"Lajkovac",{"$error":"#N/A"}]
[7498,"1","Lajkovac","FF",0,0,"Lajkovac",{"$error":"#N/A"}]
[7539,"1","Lajkovac","FF",0,0,"Lajkovac",{"$error":"#N/A"}]
[7540,"1","Lajkovac","FF",0,0,"Lajkovac",{"$error":"#N/A"}]
[7546,"1","Lajkovac","FF",0,0,"Lajkovac",{"$error":"#N/A"}]
[7888,"1","Lajkovac","FF",0,0,"Lajkovac",{"$error":"#N/A"}]
[12001,"1","Lajkovac","FF",0,0,"Lajkovac",{"$error":"#N/A"}]
[12002,"1","Lajkovac","FF",0,0,"Lajkovac",{"$error":"#N/A"}]
[12005,"1","Lajkovac","FF",0,0,"Lajkovac",{"$error":"#N/A"}]
[12027,"1","Lajkovac","FF",0,0,"Lajkovac",{"$error":"#N/A"}]
[12032,"1","Lajkovac","FF",0,0,"Lajkovac",{"$error":"#N/A"}]
[12034,"1","Lajkovac","FF",0,0,"Lajkovac",{"$error":"#N/A"}]
[12035,"1","Lajkovac","FF",0,0,"Lajkovac",{"$error":"#N/A"}]
[12047,"1","Lajkovac","FF",0,0,"Lajkovac",{"$error":"#N/A"}]
[12061,"1","Lajkovac","FF",0,0,"Lajkovac",{"$error":"#N/A"}]
[12075,"1","Lajkovac","FF",0,0,"Lajkovac",{"$error":"#N/A"}]
[12080,"1","Lajkovac","FF",0,0,{"$f":"INDEX($J$1:$K$37, MATCH(B259,$J$1:$J$37,), MATCH(\"KC\",$J$1:$K$1,))","v":"Lajkovac"},{"$f":"INDEX($L$1:$M$161, MATCH(A259,$L$1:$L$161,), MATCH(\"GRUPA\",$L$1:$M$1,))","v":{"$error":"#N/A"}}]
[12081,"1","Lajkovac","FF",0,0,"Lajkovac",{"$error":"#N/A"}]
[12500,"1","Lajkovac","FF",0,0,"Lajkovac",{"$error":"#N/A"}]
[12501,"1","Lajkovac","FF",0,0,"Lajkovac",{"$error":"#N/A"}]
[12503,"1","Lajkovac","FF",0,0,"Lajkovac",{"$error":"#N/A"}]
[12550,"1","Lajkovac","FF",0,0,"Lajkovac",{"$error":"#N/A"}]
[12831,"1","Lajkovac","FF",0,0,"Lajkovac",{"$error":"#N/A"}]
[12832,"1","Lajkovac","FF",0,0,"Lajkovac",{"$error":"#N/A"}]
[12833,"1","Lajkovac","FF",0,0,"Lajkovac",{"$error":"#N/A"}]
[12834,"1","Lajkovac","FF",0,0,"Lajkovac",{"$error":"#N/A"}]
[12841,"1","Lajkovac","FF",0,0,"Lajkovac",{"$error":"#N/A"}]
[12845,"1","Lajkovac","FF",0,0,"Lajkovac",{"$error":"#N/A"}]
[12851,"1","Lajkovac","FF",0,0,"Lajkovac",{"$error":"#N/A"}]
[12852,"1","Lajkovac","FF",0,0,"Lajkovac",{"$error":"#N/A"}]
[14057,"1","Lajkovac","FF",0,0,"Lajkovac",{"$error":"#N/A"}]
[14143,"1","Lajkovac","FF",0,0,"Lajkovac",{"$error":"#N/A"}]
[14144,"1","Lajkovac","FF",0,0,"Lajkovac",{"$error":"#N/A"}]
[14145,"1","Lajkovac","FF",0,0,"Lajkovac",{"$error":"#N/A"}]
[14146,"1","Lajkovac","FF",0,0,"Lajkovac",{"$error":"#N/A"}]
[14147,"1","Lajkovac","FF",0,0,"Lajkovac",{"$error":"#N/A"}]
[14150,"1","Lajkovac","FF",0,0,"Lajkovac",{"$error":"#N/A"}]
[14151,"1","Lajkovac","FF",0,0,"Lajkovac",{"$error":"#N/A"}]
[14152,"1","Lajkovac","FF",0,0,"Lajkovac",{"$error":"#N/A"}]
[14154,"1","Lajkovac","FF",0,0,"Lajkovac",{"$error":"#N/A"}]
[14156,"1","Lajkovac","FF",0,0,"Lajkovac",{"$error":"#N/A"}]
[14181,"1","Lajkovac","FF",0,0,"Lajkovac",{"$error":"#N/A"}]
[14182,"1","Lajkovac","FF",0,0,"Lajkovac",{"$error":"#N/A"}]
[14210,"1","Lajkovac","FF",0,0,"Lajkovac",{"$error":"#N/A"}]
[14211,"1","Lajkovac","FF",0,0,"Lajkovac",{"$error":"#N/A"}]
[14212,"1","Lajkovac","FF",0,0,"Lajkovac",{"$error":"#N/A"}]
[40252,"1","Lajkovac","FF",0,0,"Lajkovac",{"$error":"#N/A"}]
[40302,"1","Lajkovac","FF",0,0,"Lajkovac",{"$error":"#N/A"}]
[40402,"1","Lajkovac","FF",0,0,"Lajkovac",{"$error":"#N/A"}]
[40502,"1","Lajkovac","FF",0,0,"Lajkovac",{"$error":"#N/A"}]
[40700,"1","Lajkovac","FF",0,0,"Lajkovac",{"$error":"#N/A"}]
[40701,"1","Lajkovac","FF",0,0,"Lajkovac",{"$error":"#N/A"}]
[43217,"1","Lajkovac","FF",0,0,"Lajkovac",{"$error":"#N/A"}]
[43250,"1","Lajkovac","FF",0,0,"Lajkovac",{"$error":"#N/A"}]
[43400,"1","Lajkovac","FF",0,0,"Lajkovac",{"$error":"#N/A"}]
[43500,"1","Lajkovac","FF",0,0,"Lajkovac",{"$error":"#N/A"}]
[43900,"1","Lajkovac","FF",0,0,"Lajkovac",{"$error":"#N/A"}]
[43905,"1","Lajkovac","FF",0,0,"Lajkovac",{"$error":"#N/A"}]
[43906,"1","Lajkovac","FF",0,0,"Lajkovac",{"$error":"#N/A"}]
[43910,"1","Lajkovac","FF",0,0,"Lajkovac",{"$error":"#N/A"}]
[1,"2","Beograd","BB",0,0,"Beograd","1. Sveži proizvodi"]
[2,"2","Beograd","16312   810 - MAGACIN VILINE VODE",0,0,"Beograd","1. Sveži proizvodi"]
[3,"2","Beograd","BB",0,0,"Beograd","1. Sveži proizvodi"]
[4,"2","Beograd","BB",0,0,"Beograd","1. Sveži proizvodi"]
[5,"2","Beograd","BB",0,0,"Beograd","1. Sveži proizvodi"]
[6,"2","Beograd","BB",0,0,"Beograd","1. Sveži proizvodi"]
[7,"2","Beograd","BB",0,0,"Beograd","1. Sveži proizvodi"]
[8,"2","Beograd","BB",0,0,"Beograd","1. Sveži proizvodi"]
[9,"2","Beograd","BB",0,0,"Beograd","1. Sveži proizvodi"]
[10,"2","Beograd","BB",0,0,"Beograd","1. Sveži proizvodi"]
[11,"2","Beograd","BB",0,0,"Beograd","1. Sveži proizvodi"]
[12,"2","Beograd","BB",0,0,"Beograd","1. Sveži proizvodi"]
[13,"2","Beograd","BB",0,0,"Beograd","1. Sveži proizvodi"]
[14,"2","Beograd","BB",0,0,"Beograd","1. Sveži proizvodi"]
[15,"2","Beograd","BB",0,0,"Beograd","1. Sveži proizvodi"]
[16,"2","Beograd","BB",0,0,"Beograd","1. Sveži proizvodi"]
[17,"2","Beograd","BB",0,0,"Beograd","1. Sveži proizvodi"]
[18,"2","Beograd","BB",0,0,"Beograd","1. Sveži proizvodi"]
[19,"2","Beograd","BB",0,0,"Beograd","1. Sveži proizvodi"]
[20,"2","Beograd","BB",0,0,"Beograd","1. Sveži proizvodi"]
[21,"2","Beograd","BB",0,0,{"$f":"INDEX($J$1:$K$37, MATCH(B323,$J$1:$J$37,), MATCH(\"KC\",$J$1:$K$1,))","v":"Beograd"},{"$f":"INDEX($L$1:$M$161, MATCH(A323,$L$1:$L$161,), MATCH(\"GRUPA\",$L$1:$M$1,))","v":"1. Sveži proizvodi"}]
[22,"2","Beograd","BB",0,0,"Beograd","1. Sveži proizvodi"]
[23,"2","Beograd","BB",0,0,"Beograd","1. Sveži proizvodi"]
[24,"2","Beograd","BB",0,0,"Beograd","1. Sveži proizvodi"]
[25,"2","Beograd","BB",0,0,"Beograd","1. Sveži proizvodi"]
[26,"2","Beograd","BB",0,0,"Beograd","1. Sveži proizvodi"]
[27,"2","Beograd","BB",0,0,"Beograd","1. Sveži proizvodi"]
[28,"2","Beograd","BB",0,0,"Beograd","1. Sveži proizvodi"]
[29,"2","Beograd","BB",0,0,"Beograd","1. Sveži proizvodi"]
[30,"2","Beograd","BB",0,0,"Beograd","1. Sveži proizvodi"]
[31,"2","Beograd","BB",0,0,"Beograd","1. Sveži proizvodi"]
[32,"2","Beograd","BB",0,0,"Beograd","1. Sveži proizvodi"]
[33,"2","Beograd","BB",0,0,"Beograd","1. Sveži proizvodi"]
[34,"2","Beograd","BB",0,0,"Beograd","1. Sveži proizvodi"]
[37,"2","Beograd","BB",0,0,"Beograd","1. Sveži proizvodi"]
[38,"2","Beograd","BB",0,0,"Beograd","1. Sveži proizvodi"]
[39,"2","Beograd","BB",0,0,"Beograd","1. Sveži proizvodi"]
[40,"2","Beograd","BB",0,0,"Beograd","1. Sveži proizvodi"]
[41,"2","Beograd","BB",0,0,"Beograd","1. Sveži proizvodi"]
[42,"2","Beograd","BB",0,0,"Beograd","1. Sveži proizvodi"]
[43,"2","Beograd","BB",0,0,"Beograd","1. Sveži proizvodi"]
[44,"2","Beograd","BB",0,0,"Beograd","1. Sveži proizvodi"]
[45,"2","Beograd","BB",0,0,"Beograd","1. Sveži proizvodi"]
[46,"2","Beograd","BB",0,0,"Beograd","1. Sveži proizvodi"]
[47,"2","Beograd","BB",0,0,"Beograd","1. Sveži proizvodi"]
[48,"2","Beograd","BB",0,0,"Beograd","1. Sveži proizvodi"]
[49,"2","Beograd","BB",0,0,"Beograd","1. Sveži proizvodi"]
[50,"2","Beograd","BB",0,0,"Beograd","1. Sveži proizvodi"]
[51,"2","Beograd","BB",0,0,"Beograd","1. Sveži proizvodi"]
[52,"2","Beograd","BB",0,0,"Beograd","1. Sveži proizvodi"]
[53,"2","Beograd","BB",0,0,"Beograd","1. Sveži proizvodi"]
[54,"2","Beograd","BB",0,0,"Beograd","1. Sveži proizvodi"]
[55,"2","Beograd","BB",0,0,"Beograd","1. Sveži proizvodi"]
[56,"2","Beograd","BB",0,0,"Beograd","1. Sveži proizvodi"]
[57,"2","Beograd","BB",0,0,"Beograd","1. Sveži proizvodi"]
[58,"2","Beograd","BB",0,0,"Beograd","1. Sveži proizvodi"]
[59,"2","Beograd","BB",0,0,"Beograd","1. Sveži proizvodi"]
[61,"2","Beograd","BB",0,0,"Beograd","1. Sveži proizvodi"]
[62,"2","Beograd","BB",0,0,"Beograd","1. Sveži proizvodi"]
[63,"2","Beograd","BB",0,0,"Beograd","1. Sveži proizvodi"]
[64,"2","Beograd","BB",0,0,"Beograd","1. Sveži proizvodi"]
[65,"2","Beograd","BB",0,0,"Beograd","1. Sveži proizvodi"]
[66,"2","Beograd","BB",0,0,"Beograd","1. Sveži proizvodi"]
[67,"2","Beograd","BB",0,0,"Beograd","1. Sveži proizvodi"]
[68,"2","Beograd","BB",0,0,"Beograd","1. Sveži proizvodi"]
[69,"2","Beograd","BB",0,0,"Beograd","1. Sveži proizvodi"]
[71,"2","Beograd","BB",0,0,"Beograd","1. Sveži proizvodi"]
[72,"2","Beograd","BB",0,0,"Beograd","1. Sveži proizvodi"]
[73,"2","Beograd","BB",0,0,"Beograd","1. Sveži proizvodi"]
[74,"2","Beograd","BB",0,0,"Beograd","1. Sveži proizvodi"]
[75,"2","Beograd","BB",0,0,"Beograd","1. Sveži proizvodi"]
[76,"2","Beograd","BB",0,0,"Beograd","1. Sveži proizvodi"]
[77,"2","Beograd","BB",0,0,"Beograd","1. Sveži proizvodi"]
[78,"2","Beograd","BB",0,0,"Beograd","1. Sveži proizvodi"]
[80,"2","Beograd","BB",0,0,"Beograd","1. Sveži proizvodi"]
[82,"2","Beograd","BB",0,0,"Beograd","1. Sveži proizvodi"]
[89,"2","Beograd","BB",0,0,"Beograd","1. Sveži proizvodi"]
[90,"2","Beograd","BB",0,0,"Beograd","1. Sveži proizvodi"]
[92,"2","Beograd","BB",0,0,"Beograd","1. Sveži proizvodi"]
[93,"2","Beograd","BB",0,0,"Beograd","1. Sveži proizvodi"]
[94,"2","Beograd","BB",0,0,"Beograd","1. Sveži proizvodi"]
[95,"2","Beograd","BB",0,0,"Beograd","1. Sveži proizvodi"]
[96,"2","Beograd","BB",0,0,"Beograd","1. Sveži proizvodi"]
[97,"2","Beograd","BB",0,0,"Beograd","1. Sveži proizvodi"]
[98,"2","Beograd","BB",0,0,{"$f":"INDEX($J$1:$K$37, MATCH(B387,$J$1:$J$37,), MATCH(\"KC\",$J$1:$K$1,))","v":"Beograd"},{"$f":"INDEX($L$1:$M$161, MATCH(A387,$L$1:$L$161,), MATCH(\"GRUPA\",$L$1:$M$1,))","v":"1. Sveži proizvodi"}]
[99,"2","Beograd","BB",0,0,"Beograd","1. Sveži proizvodi"]
[151,"2","Beograd","BB",0,0,"Beograd","2. Smrznuti proizvodi"]
[152,"2","Beograd","BB",0,0,"Beograd","2. Smrznuti proizvodi"]
[153,"2","Beograd","BB",0,0,"Beograd","2. Smrznuti proizvodi"]
[154,"2","Beograd","BB",0,0,"Beograd","2. Smrznuti proizvodi"]
[155,"2","Beograd","BB",0,0,"Beograd","2. Smrznuti proizvodi"]
[156,"2","Beograd","BB",0,0,"Beograd","2. Smrznuti proizvodi"]
[157,"2","Beograd","BB",0,0,"Beograd","2. Smrznuti proizvodi"]
[158,"2","Beograd","BB",0,0,"Beograd","2. Smrznuti proizvodi"]
[159,"2","Beograd","BB",0,0,"Beograd","2. Smrznuti proizvodi"]
[160,"2","Beograd","BB",0,0,"Beograd","2. Smrznuti proizvodi"]
[161,"2","Beograd","BB",0,0,"Beograd","2. Smrznuti proizvodi"]
[162,"2","Beograd","BB",0,0,"Beograd","2. Smrznuti proizvodi"]
[163,"2","Beograd","BB",0,0,"Beograd","2. Smrznuti proizvodi"]
[164,"2","Beograd","BB",0,0,"Beograd","2. Smrznuti proizvodi"]
[165,"2","Beograd","BB",0,0,"Beograd","2. Smrznuti proizvodi"]
[166,"2","Beograd","BB",0,0,"Beograd","2. Smrznuti proizvodi"]
[171,"2","Beograd","BB",0,0,"Beograd","2. Smrznuti proizvodi"]
[172,"2","Beograd","BB",0,0,"Beograd","2. Smrznuti proizvodi"]
[301,"2","Beograd","BB",0,0,"Beograd","3. Prepađevine"]
[302,"2","Beograd","BB",0,0,"Beograd","3. Prepađevine"]
[303,"2","Beograd","BB",0,0,"Beograd","3. Prepađevine"]
[304,"2","Beograd","BB",0,0,"Beograd","3. Prepađevine"]
[305,"2","Beograd","BB",0,0,"Beograd","3. Prepađevine"]
[306,"2","Beograd","BB",0,0,"Beograd","3. Prepađevine"]
[307,"2","Beograd","BB",0,0,"Beograd","3. Prepađevine"]
[308,"2","Beograd","BB",0,0,"Beograd","3. Prepađevine"]
[309,"2","Beograd","BB",0,0,"Beograd","3. Prepađevine"]
[310,"2","Beograd","BB",0,0,"Beograd","3. Prepađevine"]
[311,"2","Beograd","BB",0,0,"Beograd","3. Prepađevine"]
[312,"2","Beograd","BB",0,0,"Beograd","3. Prepađevine"]
[313,"2","Beograd","BB",0,0,"Beograd","3. Prepađevine"]
[314,"2","Beograd","BB",0,0,"Beograd","3. Prepađevine"]
[315,"2","Beograd","BB",0,0,"Beograd","3. Prepađevine"]
[316,"2","Beograd","BB",0,0,"Beograd","3. Prepađevine"]
[317,"2","Beograd","BB",0,0,"Beograd","3. Prepađevine"]
[318,"2","Beograd","BB",0,0,"Beograd","3. Prepađevine"]
[319,"2","Beograd","BB",0,0,"Beograd","3. Prepađevine"]
[321,"2","Beograd","BB",0,0,"Beograd","3. Prepađevine"]
[322,"2","Beograd","BB",0,0,"Beograd","3. Prepađevine"]
[323,"2","Beograd","BB",0,0,"Beograd","3. Prepađevine"]
[324,"2","Beograd","BB",0,0,"Beograd","3. Prepađevine"]
[326,"2","Beograd","BB",0,0,"Beograd","3. Prepađevine"]
[327,"2","Beograd","BB",0,0,"Beograd","3. Prepađevine"]
[330,"2","Beograd","16313   824 - MAGACIN VILINE VODE",0,0,"Beograd","3. Prepađevine"]
[335,"2","Beograd","BB",0,0,"Beograd","3. Prepađevine"]
[336,"2","Beograd","BB",0,0,"Beograd","3. Prepađevine"]
[337,"2","Beograd","BB",0,0,"Beograd","3. Prepađevine"]
[338,"2","Beograd","BB",0,0,"Beograd","3. Prepađevine"]
[339,"2","Beograd","BB",0,0,"Beograd","3. Prepađevine"]
[351,"2","Beograd","BB",0,0,"Beograd","3. Prepađevine"]
[352,"2","Beograd","BB",0,0,"Beograd","3. Prepađevine"]
[353,"2","Beograd","BB",0,0,"Beograd","3. Prepađevine"]
[354,"2","Beograd","BB",0,0,"Beograd","3. Prepađevine"]
[355,"2","Beograd","BB",0,0,"Beograd","3. Prepađevine"]
[356,"2","Beograd","BB",0,0,"Beograd","3. Prepađevine"]
[357,"2","Beograd","BB",0,0,"Beograd","3. Prepađevine"]
[360,"2","Beograd","BB",0,0,"Beograd","3. Prepađevine"]
[361,"2","Beograd","BB",0,0,"Beograd","3. Prepađevine"]
[362,"2","Beograd","BB",0,0,"Beograd","3. Prepađevine"]
[364,"2","Beograd","BB",0,0,"Beograd","3. Prepađevine"]
[365,"2","Beograd","BB",0,0,"Beograd","3. Prepađevine"]
[366,"2","Beograd","BB",0,0,"Beograd","3. Prepađevine"]
[367,"2","Beograd","BB",0,0,{"$f":"INDEX($J$1:$K$37, MATCH(B451,$J$1:$J$37,), MATCH(\"KC\",$J$1:$K$1,))","v":"Beograd"},{"$f":"INDEX($L$1:$M$161, MATCH(A451,$L$1:$L$161,), MATCH(\"GRUPA\",$L$1:$M$1,))","v":"3. Prepađevine"}]
[368,"2","Beograd","BB",0,0,"Beograd","3. Prepađevine"]
[369,"2","Beograd","BB",0,0,"Beograd","3. Prepađevine"]
[370,"2","Beograd","BB",0,0,"Beograd","3. Prepađevine"]
[371,"2","Beograd","BB",0,0,"Beograd","3. Prepađevine"]
[372,"2","Beograd","BB",0,0,"Beograd","3. Prepađevine"]
[373,"2","Beograd","BB",0,0,"Beograd","3. Prepađevine"]
[374,"2","Beograd","BB",0,0,"Beograd","3. Prepađevine"]
[375,"2","Beograd","BB",0,0,"Beograd","3. Prepađevine"]
[376,"2","Beograd","BB",0,0,"Beograd","3. Prepađevine"]
[377,"2","Beograd","BB",0,0,"Beograd","3. Prepađevine"]
[378,"2","Beograd","BB",0,0,"Beograd","3. Prepađevine"]
[401,"2","Beograd","BB",0,0,"Beograd",{"$error":"#N/A"}]
[802,"2","Beograd","BB",0,0,"Beograd",{"$error":"#N/A"}]
[2050,"2","Beograd","BB",0,0,"Beograd",{"$error":"#N/A"}]
[2065,"2","Beograd","BB",0,0,"Beograd",{"$error":"#N/A"}]
[2185,"2","Beograd","BB",0,0,"Beograd",{"$error":"#N/A"}]
[2320,"2","Beograd","BB",0,0,"Beograd",{"$error":"#N/A"}]
[2330,"2","Beograd","BB",0,0,"Beograd",{"$error":"#N/A"}]
[2335,"2","Beograd","BB",0,0,"Beograd",{"$error":"#N/A"}]
[2600,"2","Beograd","BB",0,0,"Beograd",{"$error":"#N/A"}]
[2660,"2","Beograd","BB",0,0,"Beograd",{"$error":"#N/A"}]
[3049,"2","Beograd","BB",0,0,"Beograd",{"$error":"#N/A"}]
[3051,"2","Beograd","BB",0,0,"Beograd",{"$error":"#N/A"}]
[3052,"2","Beograd","BB",0,0,"Beograd",{"$error":"#N/A"}]
[3054,"2","Beograd","BB",0,0,"Beograd",{"$error":"#N/A"}]
[3055,"2","Beograd","BB",0,0,"Beograd",{"$error":"#N/A"}]
[3062,"2","Beograd","BB",0,0,"Beograd",{"$error":"#N/A"}]
[3068,"2","Beograd","BB",0,0,"Beograd",{"$error":"#N/A"}]
[3087,"2","Beograd","BB",0,0,"Beograd",{"$error":"#N/A"}]
[3092,"2","Beograd","BB",0,0,"Beograd",{"$error":"#N/A"}]
[3127,"2","Beograd","BB",0,0,"Beograd",{"$error":"#N/A"}]
[3130,"2","Beograd","BB",0,0,"Beograd",{"$error":"#N/A"}]
[3135,"2","Beograd","BB",0,0,"Beograd",{"$error":"#N/A"}]
[3154,"2","Beograd","BB",0,0,"Beograd",{"$error":"#N/A"}]
[3162,"2","Beograd","BB",0,0,"Beograd",{"$error":"#N/A"}]
[3182,"2","Beograd","BB",0,0,"Beograd",{"$error":"#N/A"}]
[3195,"2","Beograd","BB",0,0,"Beograd",{"$error":"#N/A"}]
[3196,"2","Beograd","BB",0,0,"Beograd",{"$error":"#N/A"}]
[3225,"2","Beograd","BB",0,0,"Beograd",{"$error":"#N/A"}]
[3228,"2","Beograd","BB",0,0,"Beograd",{"$error":"#N/A"}]
[3358,"2","Beograd","BB",0,0,"Beograd",{"$error":"#N/A"}]
[3395,"2","Beograd","BB",0,0,"Beograd",{"$error":"#N/A"}]
[3550,"2","Beograd","BB",0,0,"Beograd",{"$error":"#N/A"}]
[3552,"2","Beograd","BB",0,0,"Beograd",{"$error":"#N/A"}]
[3645,"2","Beograd","BB",0,0,"Beograd",{"$error":"#N/A"}]
[3648,"2","Beograd","BB",0,0,"Beograd",{"$error":"#N/A"}]
[4000,"2","Beograd","BB",0,0,"Beograd",{"$error":"#N/A"}]
[4008,"2","Beograd","BB",0,0,"Beograd",{"$error":"#N/A"}]
[4010,"2","Beograd","BB",0,0,"Beograd",{"$error":"#N/A"}]
[4018,"2","Beograd","BB",0,0,"Beograd",{"$error":"#N/A"}]
[4012,"2","Beograd","BB",0,0,"Beograd",{"$error":"#N/A"}]
[4015,"2","Beograd","BB",0,0,"Beograd",{"$error":"#N/A"}]
[4050,"2","Beograd","BB",0,0,"Beograd",{"$error":"#N/A"}]
[4060,"2","Beograd","BB",0,0,"Beograd",{"$error":"#N/A"}]
[4110,"2","Beograd","BB",0,0,"Beograd",{"$error":"#N/A"}]
[5190,"2","Beograd","BB",0,0,"Beograd",{"$error":"#N/A"}]
[5200,"2","Beograd","BB",0,0,"Beograd",{"$error":"#N/A"}]
[5221,"2","Beograd","BB",0,0,"Beograd",{"$error":"#N/A"}]
[5224,"2","Beograd","BB",0,0,"Beograd",{"$error":"#N/A"}]
[5240,"2","Beograd","BB",0,0,"Beograd",{"$error":"#N/A"}]
[5242,"2","Beograd","BB",0,0,"Beograd",{"$error":"#N/A"}]
[5243,"2","Beograd","BB",0,0,"Beograd",{"$error":"#N/A"}]
[5246,"2","Beograd","BB",0,0,"Beograd",{"$error":"#N/A"}]
[5248,"2","Beograd","BB",0,0,{"$f":"INDEX($J$1:$K$37, MATCH(B515,$J$1:$J$37,), MATCH(\"KC\",$J$1:$K$1,))","v":"Beograd"},{"$f":"INDEX($L$1:$M$161, MATCH(A515,$L$1:$L$161,), MATCH(\"GRUPA\",$L$1:$M$1,))","v":{"$error":"#N/A"}}]
[5249,"2","Beograd","BB",0,0,"Beograd",{"$error":"#N/A"}]
[5251,"2","Beograd","BB",0,0,"Beograd",{"$error":"#N/A"}]
[5268,"2","Beograd","BB",0,0,"Beograd",{"$error":"#N/A"}]
[5270,"2","Beograd","BB",0,0,"Beograd",{"$error":"#N/A"}]
[5372,"2","Beograd","BB",0,0,"Beograd",{"$error":"#N/A"}]
[5373,"2","Beograd","BB",0,0,"Beograd",{"$error":"#N/A"}]
[5836,"2","Beograd","BB",0,0,"Beograd",{"$error":"#N/A"}]
[5920,"2","Beograd","BB",0,0,"Beograd",{"$error":"#N/A"}]
[5923,"2","Beograd","BB",0,0,"Beograd",{"$error":"#N/A"}]
[5924,"2","Beograd","BB",0,0,"Beograd",{"$error":"#N/A"}]
[5938,"2","Beograd","BB",0,0,"Beograd",{"$error":"#N/A"}]
[5939,"2","Beograd","BB",0,0,"Beograd",{"$error":"#N/A"}]
[5941,"2","Beograd","BB",0,0,"Beograd",{"$error":"#N/A"}]
[5944,"2","Beograd","BB",0,0,"Beograd",{"$error":"#N/A"}]
[7340,"2","Beograd","BB",0,0,"Beograd",{"$error":"#N/A"}]
[7348,"2","Beograd","BB",0,0,"Beograd",{"$error":"#N/A"}]
[7342,"2","Beograd","BB",0,0,"Beograd",{"$error":"#N/A"}]
[7347,"2","Beograd","BB",0,0,"Beograd",{"$error":"#N/A"}]
[7370,"2","Beograd","BB",0,0,"Beograd",{"$error":"#N/A"}]
[7371,"2","Beograd","BB",0,0,"Beograd",{"$error":"#N/A"}]
[7372,"2","Beograd","BB",0,0,"Beograd",{"$error":"#N/A"}]
[7373,"2","Beograd","BB",0,0,"Beograd",{"$error":"#N/A"}]
[7374,"2","Beograd","BB",0,0,"Beograd",{"$error":"#N/A"}]
[7376,"2","Beograd","BB",0,0,"Beograd",{"$error":"#N/A"}]
[7377,"2","Beograd","BB",0,0,"Beograd",{"$error":"#N/A"}]
[7378,"2","Beograd","BB",0,0,"Beograd",{"$error":"#N/A"}]
[7379,"2","Beograd","BB",0,0,"Beograd",{"$error":"#N/A"}]
[7380,"2","Beograd","BB",0,0,"Beograd",{"$error":"#N/A"}]
[7497,"2","Beograd","BB",0,0,"Beograd",{"$error":"#N/A"}]
[7498,"2","Beograd","BB",0,0,"Beograd",{"$error":"#N/A"}]
[7539,"2","Beograd","BB",0,0,"Beograd",{"$error":"#N/A"}]
[7540,"2","Beograd","BB",0,0,"Beograd",{"$error":"#N/A"}]
[7546,"2","Beograd","BB",0,0,"Beograd",{"$error":"#N/A"}]
[7888,"2","Beograd","BB",0,0,"Beograd",{"$error":"#N/A"}]
[12001,"2","Beograd","BB",0,0,"Beograd",{"$error":"#N/A"}]
[12002,"2","Beograd","BB",0,0,"Beograd",{"$error":"#N/A"}]
[12005,"2","Beograd","BB",0,0,"Beograd",{"$error":"#N/A"}]
[12027,"2","Beograd","BB",0,0,"Beograd",{"$error":"#N/A"}]
[12032,"2","Beograd","BB",0,0,"Beograd",{"$error":"#N/A"}]
[12034,"2","Beograd","BB",0,0,"Beograd",{"$error":"#N/A"}]
[12035,"2","Beograd","BB",0,0,"Beograd",{"$error":"#N/A"}]
[12047,"2","Beograd","BB",0,0,"Beograd",{"$error":"#N/A"}]
[12061,"2","Beograd","BB",0,0,"Beograd",{"$error":"#N/A"}]
[12075,"2","Beograd","BB",0,0,"Beograd",{"$error":"#N/A"}]
[12080,"2","Beograd","BB",0,0,"Beograd",{"$error":"#N/A"}]
[12081,"2","Beograd","BB",0,0,"Beograd",{"$error":"#N/A"}]
[12500,"2","Beograd","BB",0,0,"Beograd",{"$error":"#N/A"}]
[12501,"2","Beograd","BB",0,0,"Beograd",{"$error":"#N/A"}]
[12503,"2","Beograd","BB",0,0,"Beograd",{"$error":"#N/A"}]
[12550,"2","Beograd","BB",0,0,"Beograd",{"$error":"#N/A"}]
[12831,"2","Beograd","BB",0,0,"Beograd",{"$error":"#N/A"}]
[12832,"2","Beograd","BB",0,0,"Beograd",{"$error":"#N/A"}]
[12833,"2","Beograd","BB",0,0,"Beograd",{"$error":"#N/A"}]
[12834,"2","Beograd","BB",0,0,"Beograd",{"$error":"#N/A"}]
[12841,"2","Beograd","BB",0,0,"Beograd",{"$error":"#N/A"}]
[12845,"2","Beograd","BB",0,0,"Beograd",{"$error":"#N/A"}]
[12851,"2","Beograd","BB",0,0,"Beograd",{"$error":"#N/A"}]
[12852,"2","Beograd","BB",0,0,"Beograd",{"$error":"#N/A"}]
[14057,"2","Beograd","BB",0,0,"Beograd",{"$error":"#N/A"}]
[14143,"2","Beograd","BB",0,0,"Beograd",{"$error":"#N/A"}]
[14144,"2","Beograd","BB",0,0,"Beograd",{"$error":"#N/A"}]
[14145,"2","Beograd","BB",0,0,"Beograd",{"$error":"#N/A"}]
[14146,"2","Beograd","BB",0,0,"Beograd",{"$error":"#N/A"}]
[14147,"2","Beograd","BB",0,0,{"$f":"INDEX($J$1:$K$37, MATCH(B579,$J$1:$J$37,), MATCH(\"KC\",$J$1:$K$1,))","v":"Beograd"},{"$f":"INDEX($L$1:$M$161, MATCH(A579,$L$1:$L$161,), MATCH(\"GRUPA\",$L$1:$M$1,))","v":{"$error":"#N/A"}}]
[14150,"2","Beograd","BB",0,0,"Beograd",{"$error":"#N/A"}]
[14151,"2","Beograd","BB",0,0,"Beograd",{"$error":"#N/A"}]
[14152,"2","Beograd","BB",0,0,"Beograd",{"$error":"#N/A"}]
[14154,"2","Beograd","BB",0,0,"Beograd",{"$error":"#N/A"}]
[14156,"2","Beograd","BB",0,0,"Beograd",{"$error":"#N/A"}]
[14181,"2","Beograd","BB",0,0,"Beograd",{"$error":"#N/A"}]
[14182,"2","Beograd","BB",0,0,"Beograd",{"$error":"#N/A"}]
[14210,"2","Beograd","BB",0,0,"Beograd",{"$error":"#N/A"}]
[14211,"2","Beograd","BB",0,0,"Beograd",{"$error":"#N/A"}]
[14212,"2","Beograd","BB",0,0,"Beograd",{"$error":"#N/A"}]
[40252,"2","Beograd","BB",0,0,"Beograd",{"$error":"#N/A"}]
[40302,"2","Beograd","BB",0,0,"Beograd",{"$error":"#N/A"}]
[40402,"2","Beograd","BB",0,0,"Beograd",{"$error":"#N/A"}]
[40502,"2","Beograd","BB",0,0,"Beograd",{"$error":"#N/A"}]
[40700,"2","Beograd","BB",0,0,"Beograd",{"$error":"#N/A"}]
[40701,"2","Beograd","BB",0,0,"Beograd",{"$error":"#N/A"}]
[43217,"2","Beograd","BB",0,0,"Beograd",{"$error":"#N/A"}]
[43250,"2","Beograd","BB",0,0,"Beograd",{"$error":"#N/A"}]
[43400,"2","Beograd","BB",0,0,"Beograd",{"$error":"#N/A"}]
[43500,"2","Beograd","BB",0,0,"Beograd",{"$error":"#N/A"}]
[43900,"2","Beograd","BB",0,0,"Beograd",{"$error":"#N/A"}]
[43905,"2","Beograd","BB",0,0,"Beograd",{"$error":"#N/A"}]
[43906,"2","Beograd","BB",0,0,"Beograd",{"$error":"#N/A"}]
[43910,"2","Beograd","BB",0,0,"Beograd",{"$error":"#N/A"}]
[1,"11","Izvoz BIH Majop","MJ",0,0,"Izvoz BIH Majop","1. Sveži proizvodi"]
[2,"11","Izvoz BIH Majop","MJ",0,0,"Izvoz BIH Majop","1. Sveži proizvodi"]
[3,"11","Izvoz BIH Majop","MJ",0,0,"Izvoz BIH Majop","1. Sveži proizvodi"]
[4,"11","Izvoz BIH Majop","MJ",0,0,"Izvoz BIH Majop","1. Sveži proizvodi"]
[5,"11","Izvoz BIH Majop","MJ",0,0,"Izvoz BIH Majop","1. Sveži proizvodi"]
[6,"11","Izvoz BIH Majop","MJ",0,0,"Izvoz BIH Majop","1. Sveži proizvodi"]
[7,"11","Izvoz BIH Majop","MJ",0,0,"Izvoz BIH Majop","1. Sveži proizvodi"]
[8,"11","Izvoz BIH Majop","MJ",0,0,"Izvoz BIH Majop","1. Sveži proizvodi"]
[9,"11","Izvoz BIH Majop","MJ",0,0,"Izvoz BIH Majop","1. Sveži proizvodi"]
[10,"11","Izvoz BIH Majop","MJ",0,0,"Izvoz BIH Majop","1. Sveži proizvodi"]
[11,"11","Izvoz BIH Majop","MJ",0,0,"Izvoz BIH Majop","1. Sveži proizvodi"]
[12,"11","Izvoz BIH Majop","MJ",0,0,"Izvoz BIH Majop","1. Sveži proizvodi"]
[13,"11","Izvoz BIH Majop","MJ",0,0,"Izvoz BIH Majop","1. Sveži proizvodi"]
[14,"11","Izvoz BIH Majop","MJ",0,0,"Izvoz BIH Majop","1. Sveži proizvodi"]
[15,"11","Izvoz BIH Majop","MJ",0,0,"Izvoz BIH Majop","1. Sveži proizvodi"]
[16,"11","Izvoz BIH Majop","MJ",0,0,"Izvoz BIH Majop","1. Sveži proizvodi"]
[17,"11","Izvoz BIH Majop","MJ",0,0,"Izvoz BIH Majop","1. Sveži proizvodi"]
[18,"11","Izvoz BIH Majop","MJ",0,0,"Izvoz BIH Majop","1. Sveži proizvodi"]
[19,"11","Izvoz BIH Majop","MJ",0,0,"Izvoz BIH Majop","1. Sveži proizvodi"]
[20,"11","Izvoz BIH Majop","MJ",0,0,"Izvoz BIH Majop","1. Sveži proizvodi"]
[21,"11","Izvoz BIH Majop","MJ",0,0,"Izvoz BIH Majop","1. Sveži proizvodi"]
[22,"11","Izvoz BIH Majop","MJ",0,0,"Izvoz BIH Majop","1. Sveži proizvodi"]
[23,"11","Izvoz BIH Majop","MJ",0,0,"Izvoz BIH Majop","1. Sveži proizvodi"]
[24,"11","Izvoz BIH Majop","MJ",0,0,"Izvoz BIH Majop","1. Sveži proizvodi"]
[25,"11","Izvoz BIH Majop","MJ",0,0,"Izvoz BIH Majop","1. Sveži proizvodi"]
[26,"11","Izvoz BIH Majop","MJ",0,0,"Izvoz BIH Majop","1. Sveži proizvodi"]
[27,"11","Izvoz BIH Majop","MJ",0,0,"Izvoz BIH Majop","1. Sveži proizvodi"]
[28,"11","Izvoz BIH Majop","MJ",0,0,"Izvoz BIH Majop","1. Sveži proizvodi"]
[29,"11","Izvoz BIH Majop","MJ",0,0,"Izvoz BIH Majop","1. Sveži proizvodi"]
[30,"11","Izvoz BIH Majop","MJ",0,0,"Izvoz BIH Majop","1. Sveži proizvodi"]
[31,"11","Izvoz BIH Majop","MJ",0,0,"Izvoz BIH Majop","1. Sveži proizvodi"]
[32,"11","Izvoz BIH Majop","MJ",0,0,"Izvoz BIH Majop","1. Sveži proizvodi"]
[33,"11","Izvoz BIH Majop","MJ",0,0,"Izvoz BIH Majop","1. Sveži proizvodi"]
[34,"11","Izvoz BIH Majop","MJ",0,0,"Izvoz BIH Majop","1. Sveži proizvodi"]
[37,"11","Izvoz BIH Majop","MJ",0,0,"Izvoz BIH Majop","1. Sveži proizvodi"]
[38,"11","Izvoz BIH Majop","MJ",0,0,"Izvoz BIH Majop","1. Sveži proizvodi"]
[39,"11","Izvoz BIH Majop","MJ",0,0,"Izvoz BIH Majop","1. Sveži proizvodi"]
[40,"11","Izvoz BIH Majop","MJ",0,0,"Izvoz BIH Majop","1. Sveži proizvodi"]
[41,"11","Izvoz BIH Majop","MJ",0,0,"Izvoz BIH Majop","1. Sveži proizvodi"]
[42,"11","Izvoz BIH Majop","MJ",0,0,{"$f":"INDEX($J$1:$K$37, MATCH(B643,$J$1:$J$37,), MATCH(\"KC\",$J$1:$K$1,))","v":"Izvoz BIH Majop"},{"$f":"INDEX($L$1:$M$161, MATCH(A643,$L$1:$L$161,), MATCH(\"GRUPA\",$L$1:$M$1,))","v":"1. Sveži proizvodi"}]
[43,"11","Izvoz BIH Majop","MJ",0,0,"Izvoz BIH Majop","1. Sveži proizvodi"]
[44,"11","Izvoz BIH Majop","MJ",0,0,"Izvoz BIH Majop","1. Sveži proizvodi"]
[45,"11","Izvoz BIH Majop","MJ",0,0,"Izvoz BIH Majop","1. Sveži proizvodi"]
[46,"11","Izvoz BIH Majop","MJ",0,0,"Izvoz BIH Majop","1. Sveži proizvodi"]
[47,"11","Izvoz BIH Majop","MJ",0,0,"Izvoz BIH Majop","1. Sveži proizvodi"]
[48,"11","Izvoz BIH Majop","MJ",0,0,"Izvoz BIH Majop","1. Sveži proizvodi"]
[49,"11","Izvoz BIH Majop","MJ",0,0,"Izvoz BIH Majop","1. Sveži proizvodi"]
[50,"11","Izvoz BIH Majop","MJ",0,0,"Izvoz BIH Majop","1. Sveži proizvodi"]
[51,"11","Izvoz BIH Majop","MJ",0,0,"Izvoz BIH Majop","1. Sveži proizvodi"]
[52,"11","Izvoz BIH Majop","MJ",0,0,"Izvoz BIH Majop","1. Sveži proizvodi"]
[53,"11","Izvoz BIH Majop","MJ",0,0,"Izvoz BIH Majop","1. Sveži proizvodi"]
[54,"11","Izvoz BIH Majop","MJ",0,0,"Izvoz BIH Majop","1. Sveži proizvodi"]
[55,"11","Izvoz BIH Majop","MJ",0,0,"Izvoz BIH Majop","1. Sveži proizvodi"]
[56,"11","Izvoz BIH Majop","MJ",0,0,"Izvoz BIH Majop","1. Sveži proizvodi"]
[57,"11","Izvoz BIH Majop","MJ",0,0,"Izvoz BIH Majop","1. Sveži proizvodi"]
[58,"11","Izvoz BIH Majop","MJ",0,0,"Izvoz BIH Majop","1. Sveži proizvodi"]
[59,"11","Izvoz BIH Majop","MJ",0,0,"Izvoz BIH Majop","1. Sveži proizvodi"]
[61,"11","Izvoz BIH Majop","MJ",0,0,"Izvoz BIH Majop","1. Sveži proizvodi"]
[62,"11","Izvoz BIH Majop","MJ",0,0,"Izvoz BIH Majop","1. Sveži proizvodi"]
[63,"11","Izvoz BIH Majop","MJ",0,0,"Izvoz BIH Majop","1. Sveži proizvodi"]
[64,"11","Izvoz BIH Majop","MJ",0,0,"Izvoz BIH Majop","1. Sveži proizvodi"]
[65,"11","Izvoz BIH Majop","MJ",0,0,"Izvoz BIH Majop","1. Sveži proizvodi"]
[66,"11","Izvoz BIH Majop","MJ",0,0,"Izvoz BIH Majop","1. Sveži proizvodi"]
[67,"11","Izvoz BIH Majop","MJ",0,0,"Izvoz BIH Majop","1. Sveži proizvodi"]
[68,"11","Izvoz BIH Majop","MJ",0,0,"Izvoz BIH Majop","1. Sveži proizvodi"]
[69,"11","Izvoz BIH Majop","MJ",0,0,"Izvoz BIH Majop","1. Sveži proizvodi"]
[71,"11","Izvoz BIH Majop","MJ",0,0,"Izvoz BIH Majop","1. Sveži proizvodi"]
[72,"11","Izvoz BIH Majop","MJ",0,0,"Izvoz BIH Majop","1. Sveži proizvodi"]
[73,"11","Izvoz BIH Majop","MJ",0,0,"Izvoz BIH Majop","1. Sveži proizvodi"]
[74,"11","Izvoz BIH Majop","MJ",0,0,"Izvoz BIH Majop","1. Sveži proizvodi"]
[75,"11","Izvoz BIH Majop","MJ",0,0,"Izvoz BIH Majop","1. Sveži proizvodi"]
[76,"11","Izvoz BIH Majop","MJ",0,0,"Izvoz BIH Majop","1. Sveži proizvodi"]
[77,"11","Izvoz BIH Majop","MJ",0,0,"Izvoz BIH Majop","1. Sveži proizvodi"]
[78,"11","Izvoz BIH Majop","MJ",0,0,"Izvoz BIH Majop","1. Sveži proizvodi"]
[80,"11","Izvoz BIH Majop","MJ",0,0,"Izvoz BIH Majop","1. Sveži proizvodi"]
[82,"11","Izvoz BIH Majop","MJ",0,0,"Izvoz BIH Majop","1. Sveži proizvodi"]
[89,"11","Izvoz BIH Majop","MJ",0,0,"Izvoz BIH Majop","1. Sveži proizvodi"]
[90,"11","Izvoz BIH Majop","MJ",0,0,"Izvoz BIH Majop","1. Sveži proizvodi"]
[92,"11","Izvoz BIH Majop","MJ",0,0,"Izvoz BIH Majop","1. Sveži proizvodi"]
[93,"11","Izvoz BIH Majop","MJ",0,0,"Izvoz BIH Majop","1. Sveži proizvodi"]
[94,"11","Izvoz BIH Majop","MJ",0,0,"Izvoz BIH Majop","1. Sveži proizvodi"]
[95,"11","Izvoz BIH Majop","MJ",0,0,"Izvoz BIH Majop","1. Sveži proizvodi"]
[96,"11","Izvoz BIH Majop","MJ",0,0,"Izvoz BIH Majop","1. Sveži proizvodi"]
[97,"11","Izvoz BIH Majop","MJ",0,0,"Izvoz BIH Majop","1. Sveži proizvodi"]
[98,"11","Izvoz BIH Majop","MJ",0,0,"Izvoz BIH Majop","1. Sveži proizvodi"]
[99,"11","Izvoz BIH Majop","MJ",0,0,"Izvoz BIH Majop","1. Sveži proizvodi"]
[151,"11","Izvoz BIH Majop","MJ",0,0,"Izvoz BIH Majop","2. Smrznuti proizvodi"]
[152,"11","Izvoz BIH Majop","MJ",0,0,"Izvoz BIH Majop","2. Smrznuti proizvodi"]
[153,"11","Izvoz BIH Majop","MJ",0,0,"Izvoz BIH Majop","2. Smrznuti proizvodi"]
[154,"11","Izvoz BIH Majop","MJ",0,0,"Izvoz BIH Majop","2. Smrznuti proizvodi"]
[155,"11","Izvoz BIH Majop","MJ",0,0,"Izvoz BIH Majop","2. Smrznuti proizvodi"]
[156,"11","Izvoz BIH Majop","MJ",0,0,"Izvoz BIH Majop","2. Smrznuti proizvodi"]
[157,"11","Izvoz BIH Majop","MJ",0,0,"Izvoz BIH Majop","2. Smrznuti proizvodi"]
[158,"11","Izvoz BIH Majop","MJ",0,0,"Izvoz BIH Majop","2. Smrznuti proizvodi"]
[159,"11","Izvoz BIH Majop","MJ",0,0,"Izvoz BIH Majop","2. Smrznuti proizvodi"]
[160,"11","Izvoz BIH Majop","MJ",0,0,"Izvoz BIH Majop","2. Smrznuti proizvodi"]
[161,"11","Izvoz BIH Majop","MJ",0,0,"Izvoz BIH Majop","2. Smrznuti proizvodi"]
[162,"11","Izvoz BIH Majop","MJ",0,0,"Izvoz BIH Majop","2. Smrznuti proizvodi"]
[163,"11","Izvoz BIH Majop","MJ",0,0,"Izvoz BIH Majop","2. Smrznuti proizvodi"]
[164,"11","Izvoz BIH Majop","MJ",0,0,"Izvoz BIH Majop","2. Smrznuti proizvodi"]
[165,"11","Izvoz BIH Majop","MJ",0,0,"Izvoz BIH Majop","2. Smrznuti proizvodi"]
[166,"11","Izvoz BIH Majop","MJ",0,0,"Izvoz BIH Majop","2. Smrznuti proizvodi"]
[171,"11","Izvoz BIH Majop","MJ",0,0,"Izvoz BIH Majop","2. Smrznuti proizvodi"]
[172,"11","Izvoz BIH Majop","MJ",0,0,{"$f":"INDEX($J$1:$K$37, MATCH(B707,$J$1:$J$37,), MATCH(\"KC\",$J$1:$K$1,))","v":"Izvoz BIH Majop"},{"$f":"INDEX($L$1:$M$161, MATCH(A707,$L$1:$L$161,), MATCH(\"GRUPA\",$L$1:$M$1,))","v":"2. Smrznuti proizvodi"}]
[301,"11","Izvoz BIH Majop","MJ",0,0,"Izvoz BIH Majop","3. Prepađevine"]
[302,"11","Izvoz BIH Majop","MJ",0,0,"Izvoz BIH Majop","3. Prepađevine"]
[303,"11","Izvoz BIH Majop","MJ",0,0,"Izvoz BIH Majop","3. Prepađevine"]
[304,"11","Izvoz BIH Majop","MJ",0,0,"Izvoz BIH Majop","3. Prepađevine"]
[305,"11","Izvoz BIH Majop","MJ",0,0,"Izvoz BIH Majop","3. Prepađevine"]
[306,"11","Izvoz BIH Majop","MJ",0,0,"Izvoz BIH Majop","3. Prepađevine"]
[307,"11","Izvoz BIH Majop","MJ",0,0,"Izvoz BIH Majop","3. Prepađevine"]
[308,"11","Izvoz BIH Majop","MJ",0,0,"Izvoz BIH Majop","3. Prepađevine"]
[309,"11","Izvoz BIH Majop","MJ",0,0,"Izvoz BIH Majop","3. Prepađevine"]
[310,"11","Izvoz BIH Majop","MJ",0,0,"Izvoz BIH Majop","3. Prepađevine"]
[311,"11","Izvoz BIH Majop","MJ",0,0,"Izvoz BIH Majop","3. Prepađevine"]
[312,"11","Izvoz BIH Majop","MJ",0,0,"Izvoz BIH Majop","3. Prepađevine"]
[313,"11","Izvoz BIH Majop","MJ",0,0,"Izvoz BIH Majop","3. Prepađevine"]
[314,"11","Izvoz BIH Majop","MJ",0,0,"Izvoz BIH Majop","3. Prepađevine"]
[315,"11","Izvoz BIH Majop","MJ",0,0,"Izvoz BIH Majop","3. Prepađevine"]
[316,"11","Izvoz BIH Majop","MJ",0,0,"Izvoz BIH Majop","3. Prepađevine"]
[317,"11","Izvoz BIH Majop","MJ",0,0,"Izvoz BIH Majop","3. Prepađevine"]
[318,"11","Izvoz BIH Majop","MJ",0,0,"Izvoz BIH Majop","3. Prepađevine"]
[319,"11","Izvoz BIH Majop","MJ",0,0,"Izvoz BIH Majop","3. Prepađevine"]
[321,"11","Izvoz BIH Majop","MJ",0,0,"Izvoz BIH Majop","3. Prepađevine"]
[322,"11","Izvoz BIH Majop","MJ",0,0,"Izvoz BIH Majop","3. Prepađevine"]
[323,"11","Izvoz BIH Majop","MJ",0,0,"Izvoz BIH Majop","3. Prepađevine"]
[324,"11","Izvoz BIH Majop","MJ",0,0,"Izvoz BIH Majop","3. Prepađevine"]
[326,"11","Izvoz BIH Majop","MJ",0,0,"Izvoz BIH Majop","3. Prepađevine"]
[327,"11","Izvoz BIH Majop","MJ",0,0,"Izvoz BIH Majop","3. Prepađevine"]
[330,"11","Izvoz BIH Majop","MJ",0,0,"Izvoz BIH Majop","3. Prepađevine"]
[335,"11","Izvoz BIH Majop","MJ",0,0,"Izvoz BIH Majop","3. Prepađevine"]
[336,"11","Izvoz BIH Majop","MJ",0,0,"Izvoz BIH Majop","3. Prepađevine"]
[337,"11","Izvoz BIH Majop","MJ",0,0,"Izvoz BIH Majop","3. Prepađevine"]
[338,"11","Izvoz BIH Majop","MJ",0,0,"Izvoz BIH Majop","3. Prepađevine"]
[339,"11","Izvoz BIH Majop","MJ",0,0,"Izvoz BIH Majop","3. Prepađevine"]
[351,"11","Izvoz BIH Majop","MJ",0,0,"Izvoz BIH Majop","3. Prepađevine"]
[352,"11","Izvoz BIH Majop","MJ",0,0,"Izvoz BIH Majop","3. Prepađevine"]
[353,"11","Izvoz BIH Majop","MJ",0,0,"Izvoz BIH Majop","3. Prepađevine"]
[354,"11","Izvoz BIH Majop","MJ",0,0,"Izvoz BIH Majop","3. Prepađevine"]
[355,"11","Izvoz BIH Majop","MJ",0,0,"Izvoz BIH Majop","3. Prepađevine"]
[356,"11","Izvoz BIH Majop","MJ",0,0,"Izvoz BIH Majop","3. Prepađevine"]
[357,"11","Izvoz BIH Majop","MJ",0,0,"Izvoz BIH Majop","3. Prepađevine"]
[360,"11","Izvoz BIH Majop","MJ",0,0,"Izvoz BIH Majop","3. Prepađevine"]
[361,"11","Izvoz BIH Majop","MJ",0,0,"Izvoz BIH Majop","3. Prepađevine"]
[362,"11","Izvoz BIH Majop","MJ",0,0,"Izvoz BIH Majop","3. Prepađevine"]
[364,"11","Izvoz BIH Majop","MJ",0,0,"Izvoz BIH Majop","3. Prepađevine"]
[365,"11","Izvoz BIH Majop","MJ",0,0,"Izvoz BIH Majop","3. Prepađevine"]
[366,"11","Izvoz BIH Majop","MJ",0,0,"Izvoz BIH Majop","3. Prepađevine"]
[367,"11","Izvoz BIH Majop","MJ",0,0,"Izvoz BIH Majop","3. Prepađevine"]
[368,"11","Izvoz BIH Majop","MJ",0,0,"Izvoz BIH Majop","3. Prepađevine"]
[369,"11","Izvoz BIH Majop","MJ",0,0,"Izvoz BIH Majop","3. Prepađevine"]
[370,"11","Izvoz BIH Majop","MJ",0,0,"Izvoz BIH Majop","3. Prepađevine"]
[371,"11","Izvoz BIH Majop","MJ",0,0,"Izvoz BIH Majop","3. Prepađevine"]
[372,"11","Izvoz BIH Majop","MJ",0,0,"Izvoz BIH Majop","3. Prepađevine"]
[373,"11","Izvoz BIH Majop","MJ",0,0,"Izvoz BIH Majop","3. Prepađevine"]
[374,"11","Izvoz BIH Majop","MJ",0,0,"Izvoz BIH Majop","3. Prepađevine"]
[375,"11","Izvoz BIH Majop","MJ",0,0,"Izvoz BIH Majop","3. Prepađevine"]
[376,"11","Izvoz BIH Majop","MJ",0,0,"Izvoz BIH Majop","3. Prepađevine"]
[377,"11","Izvoz BIH Majop","MJ",0,0,"Izvoz BIH Majop","3. Prepađevine"]
[378,"11","Izvoz BIH Majop","MJ",0,0,"Izvoz BIH Majop","3. Prepađevine"]
[401,"11","Izvoz BIH Majop","MJ",0,0,"Izvoz BIH Majop",{"$error":"#N/A"}]
[802,"11","Izvoz BIH Majop","MJ",0,0,"Izvoz BIH Majop",{"$error":"#N/A"}]
[2050,"11","Izvoz BIH Majop","MJ",0,0,"Izvoz BIH Majop",{"$error":"#N/A"}]
[2065,"11","Izvoz BIH Majop","MJ",0,0,"Izvoz BIH Majop",{"$error":"#N/A"}]
[2185,"11","Izvoz BIH Majop","MJ",0,0,"Izvoz BIH Majop",{"$error":"#N/A"}]
[2320,"11","Izvoz BIH Majop","MJ",0,0,"Izvoz BIH Majop",{"$error":"#N/A"}]
[2330,"11","Izvoz BIH Majop","MJ",0,0,"Izvoz BIH Majop",{"$error":"#N/A"}]
[2335,"11","Izvoz BIH Majop","MJ",0,0,{"$f":"INDEX($J$1:$K$37, MATCH(B771,$J$1:$J$37,), MATCH(\"KC\",$J$1:$K$1,))","v":"Izvoz BIH Majop"},{"$f":"INDEX($L$1:$M$161, MATCH(A771,$L$1:$L$161,), MATCH(\"GRUPA\",$L$1:$M$1,))","v":{"$error":"#N/A"}}]
[2600,"11","Izvoz BIH Majop","MJ",0,0,"Izvoz BIH Majop",{"$error":"#N/A"}]
[2660,"11","Izvoz BIH Majop","MJ",0,0,"Izvoz BIH Majop",{"$error":"#N/A"}]
[3049,"11","Izvoz BIH Majop","MJ",0,0,"Izvoz BIH Majop",{"$error":"#N/A"}]
[3051,"11","Izvoz BIH Majop","MJ",0,0,"Izvoz BIH Majop",{"$error":"#N/A"}]
[3052,"11","Izvoz BIH Majop","MJ",0,0,"Izvoz BIH Majop",{"$error":"#N/A"}]
[3054,"11","Izvoz BIH Majop","MJ",0,0,"Izvoz BIH Majop",{"$error":"#N/A"}]
[3055,"11","Izvoz BIH Majop","MJ",0,0,"Izvoz BIH Majop",{"$error":"#N/A"}]
[3062,"11","Izvoz BIH Majop","MJ",0,0,"Izvoz BIH Majop",{"$error":"#N/A"}]
[3068,"11","Izvoz BIH Majop","MJ",0,0,"Izvoz BIH Majop",{"$error":"#N/A"}]
[3087,"11","Izvoz BIH Majop","MJ",0,0,"Izvoz BIH Majop",{"$error":"#N/A"}]
[3092,"11","Izvoz BIH Majop","MJ",0,0,"Izvoz BIH Majop",{"$error":"#N/A"}]
[3127,"11","Izvoz BIH Majop","MJ",0,0,"Izvoz BIH Majop",{"$error":"#N/A"}]
[3130,"11","Izvoz BIH Majop","MJ",0,0,"Izvoz BIH Majop",{"$error":"#N/A"}]
[3135,"11","Izvoz BIH Majop","MJ",0,0,"Izvoz BIH Majop",{"$error":"#N/A"}]
[3154,"11","Izvoz BIH Majop","MJ",0,0,"Izvoz BIH Majop",{"$error":"#N/A"}]
[3162,"11","Izvoz BIH Majop","MJ",0,0,"Izvoz BIH Majop",{"$error":"#N/A"}]
[3182,"11","Izvoz BIH Majop","MJ",0,0,"Izvoz BIH Majop",{"$error":"#N/A"}]
[3195,"11","Izvoz BIH Majop","MJ",0,0,"Izvoz BIH Majop",{"$error":"#N/A"}]
[3196,"11","Izvoz BIH Majop","MJ",0,0,"Izvoz BIH Majop",{"$error":"#N/A"}]
[3225,"11","Izvoz BIH Majop","MJ",0,0,"Izvoz BIH Majop",{"$error":"#N/A"}]
[3228,"11","Izvoz BIH Majop","MJ",0,0,"Izvoz BIH Majop",{"$error":"#N/A"}]
[3358,"11","Izvoz BIH Majop","MJ",0,0,"Izvoz BIH Majop",{"$error":"#N/A"}]
[3395,"11","Izvoz BIH Majop","MJ",0,0,"Izvoz BIH Majop",{"$error":"#N/A"}]
[3550,"11","Izvoz BIH Majop","MJ",0,0,"Izvoz BIH Majop",{"$error":"#N/A"}]
[3552,"11","Izvoz BIH Majop","MJ",0,0,"Izvoz BIH Majop",{"$error":"#N/A"}]
[3645,"11","Izvoz BIH Majop","MJ",0,0,"Izvoz BIH Majop",{"$error":"#N/A"}]
[3648,"11","Izvoz BIH Majop","MJ",0,0,"Izvoz BIH Majop",{"$error":"#N/A"}]
[4000,"11","Izvoz BIH Majop","MJ",0,0,"Izvoz BIH Majop",{"$error":"#N/A"}]
[4008,"11","Izvoz BIH Majop","MJ",0,0,"Izvoz BIH Majop",{"$error":"#N/A"}]
[4010,"11","Izvoz BIH Majop","MJ",0,0,"Izvoz BIH Majop",{"$error":"#N/A"}]
[4018,"11","Izvoz BIH Majop","MJ",0,0,"Izvoz BIH Majop",{"$error":"#N/A"}]
[4012,"11","Izvoz BIH Majop","MJ",0,0,"Izvoz BIH Majop",{"$error":"#N/A"}]
[4015,"11","Izvoz BIH Majop","MJ",0,0,"Izvoz BIH Majop",{"$error":"#N/A"}]
[4050,"11","Izvoz BIH Majop","MJ",0,0,"Izvoz BIH Majop",{"$error":"#N/A"}]
[4060,"11","Izvoz BIH Majop","MJ",0,0,"Izvoz BIH Majop",{"$error":"#N/A"}]
[4110,"11","Izvoz BIH Majop","MJ",0,0,"Izvoz BIH Majop",{"$error":"#N/A"}]
[5190,"11","Izvoz BIH Majop","MJ",0,0,"Izvoz BIH Majop",{"$error":"#N/A"}]
[5200,"11","Izvoz BIH Majop","MJ",0,0,"Izvoz BIH Majop",{"$error":"#N/A"}]
[5221,"11","Izvoz BIH Majop","MJ",0,0,"Izvoz BIH Majop",{"$error":"#N/A"}]
[5224,"11","Izvoz BIH Majop","MJ",0,0,"Izvoz BIH Majop",{"$error":"#N/A"}]
[5240,"11","Izvoz BIH Majop","MJ",0,0,"Izvoz BIH Majop",{"$error":"#N/A"}]
[5242,"11","Izvoz BIH Majop","MJ",0,0,"Izvoz BIH Majop",{"$error":"#N/A"}]
[5243,"11","Izvoz BIH Majop","MJ",0,0,"Izvoz BIH Majop",{"$error":"#N/A"}]
[5246,"11","Izvoz BIH Majop","MJ",0,0,"Izvoz BIH Majop",{"$error":"#N/A"}]
[5248,"11","Izvoz BIH Majop","MJ",0,0,"Izvoz BIH Majop",{"$error":"#N/A"}]
[5249,"11","Izvoz BIH Majop","MJ",0,0,"Izvoz BIH Majop",{"$error":"#N/A"}]
[5251,"11","Izvoz BIH Majop","MJ",0,0,"Izvoz BIH Majop",{"$error":"#N/A"}]
[5268,"11","Izvoz BIH Majop","MJ",0,0,"Izvoz BIH Majop",{"$error":"#N/A"}]
[5270,"11","Izvoz BIH Majop","MJ",0,0,"Izvoz BIH Majop",{"$error":"#N/A"}]
[5372,"11","Izvoz BIH Majop","MJ",0,0,"Izvoz BIH Majop",{"$error":"#N/A"}]
[5373,"11","Izvoz BIH Majop","MJ",0,0,"Izvoz BIH Majop",{"$error":"#N/A"}]
[5836,"11","Izvoz BIH Majop","MJ",0,0,"Izvoz BIH Majop",{"$error":"#N/A"}]
[5920,"11","Izvoz BIH Majop","MJ",0,0,"Izvoz BIH Majop",{"$error":"#N/A"}]
[5923,"11","Izvoz BIH Majop","MJ",0,0,"Izvoz BIH Majop",{"$error":"#N/A"}]
[5924,"11","Izvoz BIH Majop","MJ",0,0,"Izvoz BIH Majop",{"$error":"#N/A"}]
[5938,"11","Izvoz BIH Majop","MJ",0,0,"Izvoz BIH Majop",{"$error":"#N/A"}]
[5939,"11","Izvoz BIH Majop","MJ",0,0,"Izvoz BIH Majop",{"$error":"#N/A"}]
[5941,"11","Izvoz BIH Majop","MJ",0,0,"Izvoz BIH Majop",{"$error":"#N/A"}]
[5944,"11","Izvoz BIH Majop","MJ",0,0,"Izvoz BIH Majop",{"$error":"#N/A"}]
[7340,"11","Izvoz BIH Majop","MJ",0,0,"Izvoz BIH Majop",{"$error":"#N/A"}]
[7348,"11","Izvoz BIH Majop","MJ",0,0,"Izvoz BIH Majop",{"$error":"#N/A"}]
[7342,"11","Izvoz BIH Majop","MJ",0,0,"Izvoz BIH Majop",{"$error":"#N/A"}]
[7347,"11","Izvoz BIH Majop","MJ",0,0,"Izvoz BIH Majop",{"$error":"#N/A"}]
[7370,"11","Izvoz BIH Majop","MJ",0,0,{"$f":"INDEX($J$1:$K$37, MATCH(B835,$J$1:$J$37,), MATCH(\"KC\",$J$1:$K$1,))","v":"Izvoz BIH Majop"},{"$f":"INDEX($L$1:$M$161, MATCH(A835,$L$1:$L$161,), MATCH(\"GRUPA\",$L$1:$M$1,))","v":{"$error":"#N/A"}}]
[7371,"11","Izvoz BIH Majop","MJ",0,0,"Izvoz BIH Majop",{"$error":"#N/A"}]
[7372,"11","Izvoz BIH Majop","MJ",0,0,"Izvoz BIH Majop",{"$error":"#N/A"}]
[7373,"11","Izvoz BIH Majop","MJ",0,0,"Izvoz BIH Majop",{"$error":"#N/A"}]
[7374,"11","Izvoz BIH Majop","MJ",0,0,"Izvoz BIH Majop",{"$error":"#N/A"}]
[7376,"11","Izvoz BIH Majop","MJ",0,0,"Izvoz BIH Majop",{"$error":"#N/A"}]
[7377,"11","Izvoz BIH Majop","MJ",0,0,"Izvoz BIH Majop",{"$error":"#N/A"}]
[7378,"11","Izvoz BIH Majop","MJ",0,0,"Izvoz BIH Majop",{"$error":"#N/A"}]
[7379,"11","Izvoz BIH Majop","MJ",0,0,"Izvoz BIH Majop",{"$error":"#N/A"}]
[7380,"11","Izvoz BIH Majop","MJ",0,0,"Izvoz BIH Majop",{"$error":"#N/A"}]
[7497,"11","Izvoz BIH Majop","MJ",0,0,"Izvoz BIH Majop",{"$error":"#N/A"}]
[7498,"11","Izvoz BIH Majop","MJ",0,0,"Izvoz BIH Majop",{"$error":"#N/A"}]
[7539,"11","Izvoz BIH Majop","MJ",0,0,"Izvoz BIH Majop",{"$error":"#N/A"}]
[7540,"11","Izvoz BIH Majop","MJ",0,0,"Izvoz BIH Majop",{"$error":"#N/A"}]
[7546,"11","Izvoz BIH Majop","MJ",0,0,"Izvoz BIH Majop",{"$error":"#N/A"}]
[7888,"11","Izvoz BIH Majop","MJ",0,0,"Izvoz BIH Majop",{"$error":"#N/A"}]
[12001,"11","Izvoz BIH Majop","MJ",0,0,"Izvoz BIH Majop",{"$error":"#N/A"}]
[12002,"11","Izvoz BIH Majop","MJ",0,0,"Izvoz BIH Majop",{"$error":"#N/A"}]
[12005,"11","Izvoz BIH Majop","MJ",0,0,"Izvoz BIH Majop",{"$error":"#N/A"}]
[12027,"11","Izvoz BIH Majop","MJ",0,0,"Izvoz BIH Majop",{"$error":"#N/A"}]
[12032,"11","Izvoz BIH Majop","MJ",0,0,"Izvoz BIH Majop",{"$error":"#N/A"}]
[12034,"11","Izvoz BIH Majop","MJ",0,0,"Izvoz BIH Majop",{"$error":"#N/A"}]
[12035,"11","Izvoz BIH Majop","MJ",0,0,"Izvoz BIH Majop",{"$error":"#N/A"}]
[12047,"11","Izvoz BIH Majop","MJ",0,0,"Izvoz BIH Majop",{"$error":"#N/A"}]
[12061,"11","Izvoz BIH Majop","MJ",0,0,"Izvoz BIH Majop",{"$error":"#N/A"}]
[12075,"11","Izvoz BIH Majop","MJ",0,0,"Izvoz BIH Majop",{"$error":"#N/A"}]
[12080,"11","Izvoz BIH Majop","MJ",0,0,"Izvoz BIH Majop",{"$error":"#N/A"}]
[12081,"11","Izvoz BIH Majop","MJ",0,0,"Izvoz BIH Majop",{"$error":"#N/A"}]
[12500,"11","Izvoz BIH Majop","MJ",0,0,"Izvoz BIH Majop",{"$error":"#N/A"}]
[12501,"11","Izvoz BIH Majop","MJ",0,0,"Izvoz BIH Majop",{"$error":"#N/A"}]
[12503,"11","Izvoz BIH Majop","MJ",0,0,"Izvoz BIH Majop",{"$error":"#N/A"}]
[12550,"11","Izvoz BIH Majop","MJ",0,0,"Izvoz BIH Majop",{"$error":"#N/A"}]
[12831,"11","Izvoz BIH Majop","MJ",0,0,"Izvoz BIH Majop",{"$error":"#N/A"}]
[12832,"11","Izvoz BIH Majop","MJ",0,0,"Izvoz BIH Majop",{"$error":"#N/A"}]
[12833,"11","Izvoz BIH Majop","MJ",0,0,"Izvoz BIH Majop",{"$error":"#N/A"}]
[12834,"11","Izvoz BIH Majop","MJ",0,0,"Izvoz BIH Majop",{"$error":"#N/A"}]
[12841,"11","Izvoz BIH Majop","MJ",0,0,"Izvoz BIH Majop",{"$error":"#N/A"}]
[12845,"11","Izvoz BIH Majop","MJ",0,0,"Izvoz BIH Majop",{"$error":"#N/A"}]
[12851,"11","Izvoz BIH Majop","MJ",0,0,"Izvoz BIH Majop",{"$error":"#N/A"}]
[12852,"11","Izvoz BIH Majop","MJ",0,0,"Izvoz BIH Majop",{"$error":"#N/A"}]
[14057,"11","Izvoz BIH Majop","MJ",0,0,"Izvoz BIH Majop",{"$error":"#N/A"}]
[14143,"11","Izvoz BIH Majop","MJ",0,0,"Izvoz BIH Majop",{"$error":"#N/A"}]
[14144,"11","Izvoz BIH Majop","MJ",0,0,"Izvoz BIH Majop",{"$error":"#N/A"}]
[14145,"11","Izvoz BIH Majop","MJ",0,0,"Izvoz BIH Majop",{"$error":"#N/A"}]
[14146,"11","Izvoz BIH Majop","MJ",0,0,"Izvoz BIH Majop",{"$error":"#N/A"}]
[14147,"11","Izvoz BIH Majop","MJ",0,0,"Izvoz BIH Majop",{"$error":"#N/A"}]
[14150,"11","Izvoz BIH Majop","MJ",0,0,"Izvoz BIH Majop",{"$error":"#N/A"}]
[14151,"11","Izvoz BIH Majop","MJ",0,0,"Izvoz BIH Majop",{"$error":"#N/A"}]
[14152,"11","Izvoz BIH Majop","MJ",0,0,"Izvoz BIH Majop",{"$error":"#N/A"}]
[14154,"11","Izvoz BIH Majop","MJ",0,0,"Izvoz BIH Majop",{"$error":"#N/A"}]
[14156,"11","Izvoz BIH Majop","MJ",0,0,"Izvoz BIH Majop",{"$error":"#N/A"}]
[14181,"11","Izvoz BIH Majop","MJ",0,0,"Izvoz BIH Majop",{"$error":"#N/A"}]
[14182,"11","Izvoz BIH Majop","MJ",0,0,"Izvoz BIH Majop",{"$error":"#N/A"}]
[14210,"11","Izvoz BIH Majop","MJ",0,0,"Izvoz BIH Majop",{"$error":"#N/A"}]
[14211,"11","Izvoz BIH Majop","MJ",0,0,"Izvoz BIH Majop",{"$error":"#N/A"}]
[14212,"11","Izvoz BIH Majop","MJ",0,0,"Izvoz BIH Majop",{"$error":"#N/A"}]
[40252,"11","Izvoz BIH Majop","MJ",0,0,"Izvoz BIH Majop",{"$error":"#N/A"}]
[40302,"11","Izvoz BIH Majop","MJ",0,0,"Izvoz BIH Majop",{"$error":"#N/A"}]
[40402,"11","Izvoz BIH Majop","MJ",0,0,"Izvoz BIH Majop",{"$error":"#N/A"}]
[40502,"11","Izvoz BIH Majop","MJ",0,0,"Izvoz BIH Majop",{"$error":"#N/A"}]
[40700,"11","Izvoz BIH Majop","MJ",0,0,"Izvoz BIH Majop",{"$error":"#N/A"}]
[40701,"11","Izvoz BIH Majop","MJ",0,0,"Izvoz BIH Majop",{"$error":"#N/A"}]
[43217,"11","Izvoz BIH Majop","MJ",0,0,"Izvoz BIH Majop",{"$error":"#N/A"}]
[43250,"11","Izvoz BIH Majop","MJ",0,0,"Izvoz BIH Majop",{"$error":"#N/A"}]
[43400,"11","Izvoz BIH Majop","MJ",0,0,{"$f":"INDEX($J$1:$K$37, MATCH(B899,$J$1:$J$37,), MATCH(\"KC\",$J$1:$K$1,))","v":"Izvoz BIH Majop"},{"$f":"INDEX($L$1:$M$161, MATCH(A899,$L$1:$L$161,), MATCH(\"GRUPA\",$L$1:$M$1,))","v":{"$error":"#N/A"}}]
[43500,"11","Izvoz BIH Majop","MJ",0,0,"Izvoz BIH Majop",{"$error":"#N/A"}]
[43900,"11","Izvoz BIH Majop","MJ",0,0,"Izvoz BIH Majop",{"$error":"#N/A"}]
[43905,"11","Izvoz BIH Majop","MJ",0,0,"Izvoz BIH Majop",{"$error":"#N/A"}]
[43906,"11","Izvoz BIH Majop","MJ",0,0,"Izvoz BIH Majop",{"$error":"#N/A"}]
[43910,"11","Izvoz BIH Majop","MJ",0,0,"Izvoz BIH Majop",{"$error":"#N/A"}]
[1,"10","Izvoz BIH","BA",0,0,"Izvoz BIH","1. Sveži proizvodi"]
[2,"10","Izvoz BIH","BA",0,0,"Izvoz BIH","1. Sveži proizvodi"]
[3,"10","Izvoz BIH","BA",0,0,"Izvoz BIH","1. Sveži proizvodi"]
[4,"10","Izvoz BIH","BA",0,0,"Izvoz BIH","1. Sveži proizvodi"]
[5,"10","Izvoz BIH","BA",0,0,"Izvoz BIH","1. Sveži proizvodi"]
[6,"10","Izvoz BIH","BA",0,0,"Izvoz BIH","1. Sveži proizvodi"]
[7,"10","Izvoz BIH","BA",0,0,"Izvoz BIH","1. Sveži proizvodi"]
[8,"10","Izvoz BIH","BA",0,0,"Izvoz BIH","1. Sveži proizvodi"]
[9,"10","Izvoz BIH","BA",0,0,"Izvoz BIH","1. Sveži proizvodi"]
[10,"10","Izvoz BIH","BA",0,0,"Izvoz BIH","1. Sveži proizvodi"]
[11,"10","Izvoz BIH","BA",0,0,"Izvoz BIH","1. Sveži proizvodi"]
[12,"10","Izvoz BIH","BA",0,0,"Izvoz BIH","1. Sveži proizvodi"]
[13,"10","Izvoz BIH","BA",0,0,"Izvoz BIH","1. Sveži proizvodi"]
[14,"10","Izvoz BIH","BA",0,0,"Izvoz BIH","1. Sveži proizvodi"]
[15,"10","Izvoz BIH","BA",0,0,"Izvoz BIH","1. Sveži proizvodi"]
[16,"10","Izvoz BIH","BA",0,0,"Izvoz BIH","1. Sveži proizvodi"]
[17,"10","Izvoz BIH","BA",0,0,"Izvoz BIH","1. Sveži proizvodi"]
[18,"10","Izvoz BIH","BA",0,0,"Izvoz BIH","1. Sveži proizvodi"]
[19,"10","Izvoz BIH","BA",0,0,"Izvoz BIH","1. Sveži proizvodi"]
[20,"10","Izvoz BIH","BA",0,0,"Izvoz BIH","1. Sveži proizvodi"]
[21,"10","Izvoz BIH","BA",0,0,"Izvoz BIH","1. Sveži proizvodi"]
[22,"10","Izvoz BIH","BA",0,0,"Izvoz BIH","1. Sveži proizvodi"]
[23,"10","Izvoz BIH","BA",0,0,"Izvoz BIH","1. Sveži proizvodi"]
[24,"10","Izvoz BIH","BA",0,0,"Izvoz BIH","1. Sveži proizvodi"]
[25,"10","Izvoz BIH","BA",0,0,"Izvoz BIH","1. Sveži proizvodi"]
[26,"10","Izvoz BIH","BA",0,0,"Izvoz BIH","1. Sveži proizvodi"]
[27,"10","Izvoz BIH","BA",0,0,"Izvoz BIH","1. Sveži proizvodi"]
[28,"10","Izvoz BIH","BA",0,0,"Izvoz BIH","1. Sveži proizvodi"]
[29,"10","Izvoz BIH","BA",0,0,"Izvoz BIH","1. Sveži proizvodi"]
[30,"10","Izvoz BIH","BA",0,0,"Izvoz BIH","1. Sveži proizvodi"]
[31,"10","Izvoz BIH","BA",0,0,"Izvoz BIH","1. Sveži proizvodi"]
[32,"10","Izvoz BIH","BA",0,0,"Izvoz BIH","1. Sveži proizvodi"]
[33,"10","Izvoz BIH","BA",0,0,"Izvoz BIH","1. Sveži proizvodi"]
[34,"10","Izvoz BIH","BA",0,0,"Izvoz BIH","1. Sveži proizvodi"]
[37,"10","Izvoz BIH","BA",0,0,"Izvoz BIH","1. Sveži proizvodi"]
[38,"10","Izvoz BIH","BA",0,0,"Izvoz BIH","1. Sveži proizvodi"]
[39,"10","Izvoz BIH","BA",0,0,"Izvoz BIH","1. Sveži proizvodi"]
[40,"10","Izvoz BIH","BA",0,0,"Izvoz BIH","1. Sveži proizvodi"]
[41,"10","Izvoz BIH","BA",0,0,"Izvoz BIH","1. Sveži proizvodi"]
[42,"10","Izvoz BIH","BA",0,0,"Izvoz BIH","1. Sveži proizvodi"]
[43,"10","Izvoz BIH","BA",0,0,"Izvoz BIH","1. Sveži proizvodi"]
[44,"10","Izvoz BIH","BA",0,0,"Izvoz BIH","1. Sveži proizvodi"]
[45,"10","Izvoz BIH","BA",0,0,"Izvoz BIH","1. Sveži proizvodi"]
[46,"10","Izvoz BIH","BA",0,0,"Izvoz BIH","1. Sveži proizvodi"]
[47,"10","Izvoz BIH","BA",0,0,"Izvoz BIH","1. Sveži proizvodi"]
[48,"10","Izvoz BIH","BA",0,0,"Izvoz BIH","1. Sveži proizvodi"]
[49,"10","Izvoz BIH","BA",0,0,"Izvoz BIH","1. Sveži proizvodi"]
[50,"10","Izvoz BIH","BA",0,0,"Izvoz BIH","1. Sveži proizvodi"]
[51,"10","Izvoz BIH","BA",0,0,"Izvoz BIH","1. Sveži proizvodi"]
[52,"10","Izvoz BIH","BA",0,0,"Izvoz BIH","1. Sveži proizvodi"]
[53,"10","Izvoz BIH","BA",0,0,"Izvoz BIH","1. Sveži proizvodi"]
[54,"10","Izvoz BIH","BA",0,0,"Izvoz BIH","1. Sveži proizvodi"]
[55,"10","Izvoz BIH","BA",0,0,"Izvoz BIH","1. Sveži proizvodi"]
[56,"10","Izvoz BIH","BA",0,0,"Izvoz BIH","1. Sveži proizvodi"]
[57,"10","Izvoz BIH","BA",0,0,"Izvoz BIH","1. Sveži proizvodi"]
[58,"10","Izvoz BIH","BA",0,0,"Izvoz BIH","1. Sveži proizvodi"]
[59,"10","Izvoz BIH","BA",0,0,"Izvoz BIH","1. Sveži proizvodi"]
[61,"10","Izvoz BIH","BA",0,0,"Izvoz BIH","1. Sveži proizvodi"]
[62,"10","Izvoz BIH","BA",0,0,{"$f":"INDEX($J$1:$K$37, MATCH(B963,$J$1:$J$37,), MATCH(\"KC\",$J$1:$K$1,))","v":"Izvoz BIH"},{"$f":"INDEX($L$1:$M$161, MATCH(A963,$L$1:$L$161,), MATCH(\"GRUPA\",$L$1:$M$1,))","v":"1. Sveži proizvodi"}]
[63,"10","Izvoz BIH","BA",0,0,"Izvoz BIH","1. Sveži proizvodi"]
[64,"10","Izvoz BIH","BA",0,0,"Izvoz BIH","1. Sveži proizvodi"]
[65,"10","Izvoz BIH","BA",0,0,"Izvoz BIH","1. Sveži proizvodi"]
[66,"10","Izvoz BIH","BA",0,0,"Izvoz BIH","1. Sveži proizvodi"]
[67,"10","Izvoz BIH","BA",0,0,"Izvoz BIH","1. Sveži proizvodi"]
[68,"10","Izvoz BIH","BA",0,0,"Izvoz BIH","1. Sveži proizvodi"]
[69,"10","Izvoz BIH","BA",0,0,"Izvoz BIH","1. Sveži proizvodi"]
[71,"10","Izvoz BIH","BA",0,0,"Izvoz BIH","1. Sveži proizvodi"]
[72,"10","Izvoz BIH","BA",0,0,"Izvoz BIH","1. Sveži proizvodi"]
[73,"10","Izvoz BIH","BA",0,0,"Izvoz BIH","1. Sveži proizvodi"]
[74,"10","Izvoz BIH","BA",0,0,"Izvoz BIH","1. Sveži proizvodi"]
[75,"10","Izvoz BIH","BA",0,0,"Izvoz BIH","1. Sveži proizvodi"]
[76,"10","Izvoz BIH","BA",0,0,"Izvoz BIH","1. Sveži proizvodi"]
[77,"10","Izvoz BIH","BA",0,0,"Izvoz BIH","1. Sveži proizvodi"]
[78,"10","Izvoz BIH","BA",0,0,"Izvoz BIH","1. Sveži proizvodi"]
[80,"10","Izvoz BIH","BA",0,0,"Izvoz BIH","1. Sveži proizvodi"]
[82,"10","Izvoz BIH","BA",0,0,"Izvoz BIH","1. Sveži proizvodi"]
[89,"10","Izvoz BIH","BA",0,0,"Izvoz BIH","1. Sveži proizvodi"]
[90,"10","Izvoz BIH","BA",0,0,"Izvoz BIH","1. Sveži proizvodi"]
[92,"10","Izvoz BIH","BA",0,0,"Izvoz BIH","1. Sveži proizvodi"]
[93,"10","Izvoz BIH","BA",0,0,"Izvoz BIH","1. Sveži proizvodi"]
[94,"10","Izvoz BIH","BA",0,0,"Izvoz BIH","1. Sveži proizvodi"]
[95,"10","Izvoz BIH","BA",0,0,"Izvoz BIH","1. Sveži proizvodi"]
[96,"10","Izvoz BIH","BA",0,0,"Izvoz BIH","1. Sveži proizvodi"]
[97,"10","Izvoz BIH","BA",0,0,"Izvoz BIH","1. Sveži proizvodi"]
[98,"10","Izvoz BIH","BA",0,0,"Izvoz BIH","1. Sveži proizvodi"]
[99,"10","Izvoz BIH","BA",0,0,"Izvoz BIH","1. Sveži proizvodi"]
[151,"10","Izvoz BIH","BA",0,0,"Izvoz BIH","2. Smrznuti proizvodi"]
[152,"10","Izvoz BIH","BA",0,0,"Izvoz BIH","2. Smrznuti proizvodi"]
[153,"10","Izvoz BIH","BA",0,0,"Izvoz BIH","2. Smrznuti proizvodi"]
[154,"10","Izvoz BIH","BA",0,0,"Izvoz BIH","2. Smrznuti proizvodi"]
[155,"10","Izvoz BIH","BA",0,0,"Izvoz BIH","2. Smrznuti proizvodi"]
[156,"10","Izvoz BIH","BA",0,0,"Izvoz BIH","2. Smrznuti proizvodi"]
[157,"10","Izvoz BIH","BA",0,0,"Izvoz BIH","2. Smrznuti proizvodi"]
[158,"10","Izvoz BIH","BA",0,0,"Izvoz BIH","2. Smrznuti proizvodi"]
[159,"10","Izvoz BIH","BA",0,0,"Izvoz BIH","2. Smrznuti proizvodi"]
[160,"10","Izvoz BIH","BA",0,0,"Izvoz BIH","2. Smrznuti proizvodi"]
[161,"10","Izvoz BIH","BA",0,0,"Izvoz BIH","2. Smrznuti proizvodi"]
[162,"10","Izvoz BIH","BA",0,0,"Izvoz BIH","2. Smrznuti proizvodi"]
[163,"10","Izvoz BIH","BA",0,0,"Izvoz BIH","2. Smrznuti proizvodi"]
[164,"10","Izvoz BIH","BA",0,0,"Izvoz BIH","2. Smrznuti proizvodi"]
[165,"10","Izvoz BIH","BA",0,0,"Izvoz BIH","2. Smrznuti proizvodi"]
[166,"10","Izvoz BIH","BA",0,0,"Izvoz BIH","2. Smrznuti proizvodi"]
[171,"10","Izvoz BIH","BA",0,0,"Izvoz BIH","2. Smrznuti proizvodi"]
[172,"10","Izvoz BIH","BA",0,0,"Izvoz BIH","2. Smrznuti proizvodi"]
[301,"10","Izvoz BIH","BA",0,0,"Izvoz BIH","3. Prepađevine"]
[302,"10","Izvoz BIH","BA",0,0,"Izvoz BIH","3. Prepađevine"]
[303,"10","Izvoz BIH","BA",0,0,"Izvoz BIH","3. Prepađevine"]
[304,"10","Izvoz BIH","BA",0,0,"Izvoz BIH","3. Prepađevine"]
[305,"10","Izvoz BIH","BA",0,0,"Izvoz BIH","3. Prepađevine"]
[306,"10","Izvoz BIH","BA",0,0,"Izvoz BIH","3. Prepađevine"]
[307,"10","Izvoz BIH","BA",0,0,"Izvoz BIH","3. Prepađevine"]
[308,"10","Izvoz BIH","BA",0,0,"Izvoz BIH","3. Prepađevine"]
[309,"10","Izvoz BIH","BA",0,0,"Izvoz BIH","3. Prepađevine"]
[310,"10","Izvoz BIH","BA",0,0,"Izvoz BIH","3. Prepađevine"]
[311,"10","Izvoz BIH","BA",0,0,"Izvoz BIH","3. Prepađevine"]
[312,"10","Izvoz BIH","BA",0,0,"Izvoz BIH","3. Prepađevine"]
[313,"10","Izvoz BIH","BA",0,0,"Izvoz BIH","3. Prepađevine"]
[314,"10","Izvoz BIH","BA",0,0,"Izvoz BIH","3. Prepađevine"]
[315,"10","Izvoz BIH","BA",0,0,"Izvoz BIH","3. Prepađevine"]
[316,"10","Izvoz BIH","BA",0,0,"Izvoz BIH","3. Prepađevine"]
[317,"10","Izvoz BIH","BA",0,0,"Izvoz BIH","3. Prepađevine"]
[318,"10","Izvoz BIH","BA",0,0,"Izvoz BIH","3. Prepađevine"]
[319,"10","Izvoz BIH","BA",0,0,{"$f":"INDEX($J$1:$K$37, MATCH(B1027,$J$1:$J$37,), MATCH(\"KC\",$J$1:$K$1,))","v":"Izvoz BIH"},{"$f":"INDEX($L$1:$M$161, MATCH(A1027,$L$1:$L$161,), MATCH(\"GRUPA\",$L$1:$M$1,))","v":"3. Prepađevine"}]
[321,"10","Izvoz BIH","BA",0,0,"Izvoz BIH","3. Prepađevine"]
[322,"10","Izvoz BIH","BA",0,0,"Izvoz BIH","3. Prepađevine"]
[323,"10","Izvoz BIH","BA",0,0,"Izvoz BIH","3. Prepađevine"]
[324,"10","Izvoz BIH","BA",0,0,"Izvoz BIH","3. Prepađevine"]
[326,"10","Izvoz BIH","BA",0,0,"Izvoz BIH","3. Prepađevine"]
[327,"10","Izvoz BIH","BA",0,0,"Izvoz BIH","3. Prepađevine"]
[330,"10","Izvoz BIH","BA",0,0,"Izvoz BIH","3. Prepađevine"]
[335,"10","Izvoz BIH","BA",0,0,"Izvoz BIH","3. Prepađevine"]
[336,"10","Izvoz BIH","BA",0,0,"Izvoz BIH","3. Prepađevine"]
[337,"10","Izvoz BIH","BA",0,0,"Izvoz BIH","3. Prepađevine"]
[339,"10","Izvoz BIH","BA",0,0,"Izvoz BIH","3. Prepađevine"]
[339,"10","Izvoz BIH","BA",0,0,"Izvoz BIH","3. Prepađevine"]
[351,"10","Izvoz BIH","BA",0,0,"Izvoz BIH","3. Prepađevine"]
[352,"10","Izvoz BIH","BA",0,0,"Izvoz BIH","3. Prepađevine"]
[353,"10","Izvoz BIH","BA",0,0,"Izvoz BIH","3. Prepađevine"]
[354,"10","Izvoz BIH","BA",0,0,"Izvoz BIH","3. Prepađevine"]
[355,"10","Izvoz BIH","BA",0,0,"Izvoz BIH","3. Prepađevine"]
[356,"10","Izvoz BIH","BA",0,0,"Izvoz BIH","3. Prepađevine"]
[357,"10","Izvoz BIH","BA",0,0,"Izvoz BIH","3. Prepađevine"]
[360,"10","Izvoz BIH","BA",0,0,"Izvoz BIH","3. Prepađevine"]
[361,"10","Izvoz BIH","BA",0,0,"Izvoz BIH","3. Prepađevine"]
[362,"10","Izvoz BIH","BA",0,0,"Izvoz BIH","3. Prepađevine"]
[364,"10","Izvoz BIH","BA",0,0,"Izvoz BIH","3. Prepađevine"]
[365,"10","Izvoz BIH","BA",0,0,"Izvoz BIH","3. Prepađevine"]
[366,"10","Izvoz BIH","BA",0,0,"Izvoz BIH","3. Prepađevine"]
[367,"10","Izvoz BIH","BA",0,0,"Izvoz BIH","3. Prepađevine"]
[368,"10","Izvoz BIH","BA",0,0,"Izvoz BIH","3. Prepađevine"]
[369,"10","Izvoz BIH","BA",0,0,"Izvoz BIH","3. Prepađevine"]
[370,"10","Izvoz BIH","BA",0,0,"Izvoz BIH","3. Prepađevine"]
[371,"10","Izvoz BIH","BA",0,0,"Izvoz BIH","3. Prepađevine"]
[372,"10","Izvoz BIH","BA",0,0,"Izvoz BIH","3. Prepađevine"]
[373,"10","Izvoz BIH","BA",0,0,"Izvoz BIH","3. Prepađevine"]
[374,"10","Izvoz BIH","BA",0,0,"Izvoz BIH","3. Prepađevine"]
[375,"10","Izvoz BIH","BA",0,0,"Izvoz BIH","3. Prepađevine"]
[376,"10","Izvoz BIH","BA",0,0,"Izvoz BIH","3. Prepađevine"]
[377,"10","Izvoz BIH","BA",0,0,"Izvoz BIH","3. Prepađevine"]
[378,"10","Izvoz BIH","BA",0,0,"Izvoz BIH","3. Prepađevine"]
[401,"10","Izvoz BIH","BA",0,0,"Izvoz BIH",{"$error":"#N/A"}]
[802,"10","Izvoz BIH","BA",0,0,"Izvoz BIH",{"$error":"#N/A"}]
[2050,"10","Izvoz BIH","BA",0,0,"Izvoz BIH",{"$error":"#N/A"}]
[2065,"10","Izvoz BIH","BA",0,0,"Izvoz BIH",{"$error":"#N/A"}]
[2185,"10","Izvoz BIH","BA",0,0,"Izvoz BIH",{"$error":"#N/A"}]
[2320,"10","Izvoz BIH","BA",0,0,"Izvoz BIH",{"$error":"#N/A"}]
[2330,"10","Izvoz BIH","BA",0,0,"Izvoz BIH",{"$error":"#N/A"}]
[2335,"10","Izvoz BIH","BA",0,0,"Izvoz BIH",{"$error":"#N/A"}]
[2600,"10","Izvoz BIH","BA",0,0,"Izvoz BIH",{"$error":"#N/A"}]
[2660,"10","Izvoz BIH","BA",0,0,"Izvoz BIH",{"$error":"#N/A"}]
[3049,"10","Izvoz BIH","BA",0,0,"Izvoz BIH",{"$error":"#N/A"}]
[3051,"10","Izvoz BIH","BA",0,0,"Izvoz BIH",{"$error":"#N/A"}]
[3052,"10","Izvoz BIH","BA",0,0,"Izvoz BIH",{"$error":"#N/A"}]
[3054,"10","Izvoz BIH","BA",0,0,"Izvoz BIH",{"$error":"#N/A"}]
[3055,"10","Izvoz BIH","BA",0,0,"Izvoz BIH",{"$error":"#N/A"}]
[3062,"10","Izvoz BIH","BA",0,0,"Izvoz BIH",{"$error":"#N/A"}]
[3068,"10","Izvoz BIH","BA",0,0,"Izvoz BIH",{"$error":"#N/A"}]
[3087,"10","Izvoz BIH","BA",0,0,"Izvoz BIH",{"$error":"#N/A"}]
[3092,"10","Izvoz BIH","BA",0,0,"Izvoz BIH",{"$error":"#N/A"}]
[3127,"10","Izvoz BIH","BA",0,0,"Izvoz BIH",{"$error":"#N/A"}]
[3130,"10","Izvoz BIH","BA",0,0,"Izvoz BIH",{"$error":"#N/A"}]
[3135,"10","Izvoz BIH","BA",0,0,"Izvoz BIH",{"$error":"#N/A"}]
[3154,"10","Izvoz BIH","BA",0,0,"Izvoz BIH",{"$error":"#N/A"}]
[3162,"10","Izvoz BIH","BA",0,0,"Izvoz BIH",{"$error":"#N/A"}]
[3182,"10","Izvoz BIH","BA",0,0,"Izvoz BIH",{"$error":"#N/A"}]
[3195,"10","Izvoz BIH","BA",0,0,"Izvoz BIH",{"$error":"#N/A"}]
[3196,"10","Izvoz BIH","BA",0,0,{"$f":"INDEX($J$1:$K$37, MATCH(B1091,$J$1:$J$37,), MATCH(\"KC\",$J$1:$K$1,))","v":"Izvoz BIH"},{"$f":"INDEX($L$1:$M$161, MATCH(A1091,$L$1:$L$161,), MATCH(\"GRUPA\",$L$1:$M$1,))","v":{"$error":"#N/A"}}]
[3225,"10","Izvoz BIH","BA",0,0,"Izvoz BIH",{"$error":"#N/A"}]
[3228,"10","Izvoz BIH","BA",0,0,"Izvoz BIH",{"$error":"#N/A"}]
[3358,"10","Izvoz BIH","BA",0,0,"Izvoz BIH",{"$error":"#N/A"}]
[3395,"10","Izvoz BIH","BA",0,0,"Izvoz BIH",{"$error":"#N/A"}]
[3550,"10","Izvoz BIH","BA",0,0,"Izvoz BIH",{"$error":"#N/A"}]
[3552,"10","Izvoz BIH","BA",0,0,"Izvoz BIH",{"$error":"#N/A"}]
[3645,"10","Izvoz BIH","BA",0,0,"Izvoz BIH",{"$error":"#N/A"}]
[3648,"10","Izvoz BIH","BA",0,0,"Izvoz BIH",{"$error":"#N/A"}]
[4000,"10","Izvoz BIH","BA",0,0,"Izvoz BIH",{"$error":"#N/A"}]
[4008,"10","Izvoz BIH","BA",0,0,"Izvoz BIH",{"$error":"#N/A"}]
[4010,"10","Izvoz BIH","BA",0,0,"Izvoz BIH",{"$error":"#N/A"}]
[4018,"10","Izvoz BIH","BA",0,0,"Izvoz BIH",{"$error":"#N/A"}]
[4012,"10","Izvoz BIH","BA",0,0,"Izvoz BIH",{"$error":"#N/A"}]
[4015,"10","Izvoz BIH","BA",0,0,"Izvoz BIH",{"$error":"#N/A"}]
[4050,"10","Izvoz BIH","BA",0,0,"Izvoz BIH",{"$error":"#N/A"}]
[4060,"10","Izvoz BIH","BA",0,0,"Izvoz BIH",{"$error":"#N/A"}]
[4110,"10","Izvoz BIH","BA",0,0,"Izvoz BIH",{"$error":"#N/A"}]
[5190,"10","Izvoz BIH","BA",0,0,"Izvoz BIH",{"$error":"#N/A"}]
[5200,"10","Izvoz BIH","BA",0,0,"Izvoz BIH",{"$error":"#N/A"}]
[5221,"10","Izvoz BIH","BA",0,0,"Izvoz BIH",{"$error":"#N/A"}]
[5224,"10","Izvoz BIH","BA",0,0,"Izvoz BIH",{"$error":"#N/A"}]
[5240,"10","Izvoz BIH","BA",0,0,"Izvoz BIH",{"$error":"#N/A"}]
[5242,"10","Izvoz BIH","BA",0,0,"Izvoz BIH",{"$error":"#N/A"}]
[5243,"10","Izvoz BIH","BA",0,0,"Izvoz BIH",{"$error":"#N/A"}]
[5246,"10","Izvoz BIH","BA",0,0,"Izvoz BIH",{"$error":"#N/A"}]
[5248,"10","Izvoz BIH","BA",0,0,"Izvoz BIH",{"$error":"#N/A"}]
[5249,"10","Izvoz BIH","BA",0,0,"Izvoz BIH",{"$error":"#N/A"}]
[5251,"10","Izvoz BIH","BA",0,0,"Izvoz BIH",{"$error":"#N/A"}]
[5268,"10","Izvoz BIH","BA",0,0,"Izvoz BIH",{"$error":"#N/A"}]
[5270,"10","Izvoz BIH","BA",0,0,"Izvoz BIH",{"$error":"#N/A"}]
[5372,"10","Izvoz BIH","BA",0,0,"Izvoz BIH",{"$error":"#N/A"}]
[5373,"10","Izvoz BIH","BA",0,0,"Izvoz BIH",{"$error":"#N/A"}]
[5836,"10","Izvoz BIH","BA",0,0,"Izvoz BIH",{"$error":"#N/A"}]
[5920,"10","Izvoz BIH","BA",0,0,"Izvoz BIH",{"$error":"#N/A"}]
[5923,"10","Izvoz BIH","BA",0,0,"Izvoz BIH",{"$error":"#N/A"}]
[5924,"10","Izvoz BIH","BA",0,0,"Izvoz BIH",{"$error":"#N/A"}]
[5938,"10","Izvoz BIH","BA",0,0,"Izvoz BIH",{"$error":"#N/A"}]
[5939,"10","Izvoz BIH","BA",0,0,"Izvoz BIH",{"$error":"#N/A"}]
[5941,"10","Izvoz BIH","BA",0,0,"Izvoz BIH",{"$error":"#N/A"}]
[5944,"10","Izvoz BIH","BA",0,0,"Izvoz BIH",{"$error":"#N/A"}]
[7340,"10","Izvoz BIH","BA",0,0,"Izvoz BIH",{"$error":"#N/A"}]
[7348,"10","Izvoz BIH","BA",0,0,"Izvoz BIH",{"$error":"#N/A"}]
[7342,"10","Izvoz BIH","BA",0,0,"Izvoz BIH",{"$error":"#N/A"}]
[7347,"10","Izvoz BIH","BA",0,0,"Izvoz BIH",{"$error":"#N/A"}]
[7370,"10","Izvoz BIH","BA",0,0,"Izvoz BIH",{"$error":"#N/A"}]
[7371,"10","Izvoz BIH","BA",0,0,"Izvoz BIH",{"$error":"#N/A"}]
[7372,"10","Izvoz BIH","BA",0,0,"Izvoz BIH",{"$error":"#N/A"}]
[7373,"10","Izvoz BIH","BA",0,0,"Izvoz BIH",{"$error":"#N/A"}]
[7374,"10","Izvoz BIH","BA",0,0,"Izvoz BIH",{"$error":"#N/A"}]
[7376,"10","Izvoz BIH","BA",0,0,"Izvoz BIH",{"$error":"#N/A"}]
[7377,"10","Izvoz BIH","BA",0,0,"Izvoz BIH",{"$error":"#N/A"}]
[7378,"10","Izvoz BIH","BA",0,0,"Izvoz BIH",{"$error":"#N/A"}]
[7379,"10","Izvoz BIH","BA",0,0,"Izvoz BIH",{"$error":"#N/A"}]
[7380,"10","Izvoz BIH","BA",0,0,"Izvoz BIH",{"$error":"#N/A"}]
[7497,"10","Izvoz BIH","BA",0,0,"Izvoz BIH",{"$error":"#N/A"}]
[7498,"10","Izvoz BIH","BA",0,0,"Izvoz BIH",{"$error":"#N/A"}]
[7539,"10","Izvoz BIH","BA",0,0,"Izvoz BIH",{"$error":"#N/A"}]
[7540,"10","Izvoz BIH","BA",0,0,"Izvoz BIH",{"$error":"#N/A"}]
[7546,"10","Izvoz BIH","BA",0,0,"Izvoz BIH",{"$error":"#N/A"}]
[7888,"10","Izvoz BIH","BA",0,0,"Izvoz BIH",{"$error":"#N/A"}]
[12001,"10","Izvoz BIH","BA",0,0,"Izvoz BIH",{"$error":"#N/A"}]
[12002,"10","Izvoz BIH","BA",0,0,"Izvoz BIH",{"$error":"#N/A"}]
[12005,"10","Izvoz BIH","BA",0,0,"Izvoz BIH",{"$error":"#N/A"}]
[12027,"10","Izvoz BIH","BA",0,0,{"$f":"INDEX($J$1:$K$37, MATCH(B1155,$J$1:$J$37,), MATCH(\"KC\",$J$1:$K$1,))","v":"Izvoz BIH"},{"$f":"INDEX($L$1:$M$161, MATCH(A1155,$L$1:$L$161,), MATCH(\"GRUPA\",$L$1:$M$1,))","v":{"$error":"#N/A"}}]
[12032,"10","Izvoz BIH","BA",0,0,"Izvoz BIH",{"$error":"#N/A"}]
[12034,"10","Izvoz BIH","BA",0,0,"Izvoz BIH",{"$error":"#N/A"}]
[12035,"10","Izvoz BIH","BA",0,0,"Izvoz BIH",{"$error":"#N/A"}]
[12047,"10","Izvoz BIH","BA",0,0,"Izvoz BIH",{"$error":"#N/A"}]
[12061,"10","Izvoz BIH","BA",0,0,"Izvoz BIH",{"$error":"#N/A"}]
[12075,"10","Izvoz BIH","BA",0,0,"Izvoz BIH",{"$error":"#N/A"}]
[12080,"10","Izvoz BIH","BA",0,0,"Izvoz BIH",{"$error":"#N/A"}]
[12081,"10","Izvoz BIH","BA",0,0,"Izvoz BIH",{"$error":"#N/A"}]
[12500,"10","Izvoz BIH","BA",0,0,"Izvoz BIH",{"$error":"#N/A"}]
[12501,"10","Izvoz BIH","BA",0,0,"Izvoz BIH",{"$error":"#N/A"}]
[12503,"10","Izvoz BIH","BA",0,0,"Izvoz BIH",{"$error":"#N/A"}]
[12550,"10","Izvoz BIH","BA",0,0,"Izvoz BIH",{"$error":"#N/A"}]
[12831,"10","Izvoz BIH","BA",0,0,"Izvoz BIH",{"$error":"#N/A"}]
[12832,"10","Izvoz BIH","BA",0,0,"Izvoz BIH",{"$error":"#N/A"}]
[12833,"10","Izvoz BIH","BA",0,0,"Izvoz BIH",{"$error":"#N/A"}]
[12834,"10","Izvoz BIH","BA",0,0,"Izvoz BIH",{"$error":"#N/A"}]
[12841,"10","Izvoz BIH","BA",0,0,"Izvoz BIH",{"$error":"#N/A"}]
[12845,"10","Izvoz BIH","BA",0,0,"Izvoz BIH",{"$error":"#N/A"}]
[12851,"10","Izvoz BIH","BA",0,0,"Izvoz BIH",{"$error":"#N/A"}]
[12852,"10","Izvoz BIH","BA",0,0,"Izvoz BIH",{"$error":"#N/A"}]
[14057,"10","Izvoz BIH","BA",0,0,"Izvoz BIH",{"$error":"#N/A"}]
[14143,"10","Izvoz BIH","BA",0,0,"Izvoz BIH",{"$error":"#N/A"}]
[14144,"10","Izvoz BIH","BA",0,0,"Izvoz BIH",{"$error":"#N/A"}]
[14145,"10","Izvoz BIH","BA",0,0,"Izvoz BIH",{"$error":"#N/A"}]
[14146,"10","Izvoz BIH","BA",0,0,"Izvoz BIH",{"$error":"#N/A"}]
[14147,"10","Izvoz BIH","BA",0,0,"Izvoz BIH",{"$error":"#N/A"}]
[14150,"10","Izvoz BIH","BA",0,0,"Izvoz BIH",{"$error":"#N/A"}]
[14151,"10","Izvoz BIH","BA",0,0,"Izvoz BIH",{"$error":"#N/A"}]
[14152,"10","Izvoz BIH","BA",0,0,"Izvoz BIH",{"$error":"#N/A"}]
[14154,"10","Izvoz BIH","BA",0,0,"Izvoz BIH",{"$error":"#N/A"}]
[14156,"10","Izvoz BIH","BA",0,0,"Izvoz BIH",{"$error":"#N/A"}]
[14181,"10","Izvoz BIH","BA",0,0,"Izvoz BIH",{"$error":"#N/A"}]
[14182,"10","Izvoz BIH","BA",0,0,"Izvoz BIH",{"$error":"#N/A"}]
[14210,"10","Izvoz BIH","BA",0,0,"Izvoz BIH",{"$error":"#N/A"}]
[14211,"10","Izvoz BIH","BA",0,0,"Izvoz BIH",{"$error":"#N/A"}]
[14212,"10","Izvoz BIH","BA",0,0,"Izvoz BIH",{"$error":"#N/A"}]
[40252,"10","Izvoz BIH","BA",0,0,"Izvoz BIH",{"$error":"#N/A"}]
[40302,"10","Izvoz BIH","BA",0,0,"Izvoz BIH",{"$error":"#N/A"}]
[40402,"10","Izvoz BIH","BA",0,0,"Izvoz BIH",{"$error":"#N/A"}]
[40502,"10","Izvoz BIH","BA",0,0,"Izvoz BIH",{"$error":"#N/A"}]
[40700,"10","Izvoz BIH","BA",0,0,"Izvoz BIH",{"$error":"#N/A"}]
[40701,"10","Izvoz BIH","BA",0,0,"Izvoz BIH",{"$error":"#N/A"}]
[43217,"10","Izvoz BIH","BA",0,0,"Izvoz BIH",{"$error":"#N/A"}]
[43250,"10","Izvoz BIH","BA",0,0,"Izvoz BIH",{"$error":"#N/A"}]
[43400,"10","Izvoz BIH","BA",0,0,"Izvoz BIH",{"$error":"#N/A"}]
[43500,"10","Izvoz BIH","BA",0,0,"Izvoz BIH",{"$error":"#N/A"}]
[43900,"10","Izvoz BIH","BA",0,0,"Izvoz BIH",{"$error":"#N/A"}]
[43905,"10","Izvoz BIH","BA",0,0,"Izvoz BIH",{"$error":"#N/A"}]
[43906,"10","Izvoz BIH","BA",0,0,"Izvoz BIH",{"$error":"#N/A"}]
[43910,"10","Izvoz BIH","BA",0,0,"Izvoz BIH",{"$error":"#N/A"}]
[1,"4","Crna Gora","CG",0,0,"Izvoz Crna Gora","1. Sveži proizvodi"]
[2,"4","Crna Gora","CG",0,0,"Izvoz Crna Gora","1. Sveži proizvodi"]
[3,"4","Crna Gora","CG",0,0,"Izvoz Crna Gora","1. Sveži proizvodi"]
[4,"4","Crna Gora","CG",0,0,"Izvoz Crna Gora","1. Sveži proizvodi"]
[5,"4","Crna Gora","CG",0,0,"Izvoz Crna Gora","1. Sveži proizvodi"]
[6,"4","Crna Gora","CG",0,0,"Izvoz Crna Gora","1. Sveži proizvodi"]
[7,"4","Crna Gora","CG",0,0,"Izvoz Crna Gora","1. Sveži proizvodi"]
[8,"4","Crna Gora","CG",0,0,"Izvoz Crna Gora","1. Sveži proizvodi"]
[9,"4","Crna Gora","CG",0,0,"Izvoz Crna Gora","1. Sveži proizvodi"]
[10,"4","Crna Gora","CG",0,0,"Izvoz Crna Gora","1. Sveži proizvodi"]
[11,"4","Crna Gora","CG",0,0,"Izvoz Crna Gora","1. Sveži proizvodi"]
[12,"4","Crna Gora","CG",0,0,"Izvoz Crna Gora","1. Sveži proizvodi"]
[13,"4","Crna Gora","CG",0,0,"Izvoz Crna Gora","1. Sveži proizvodi"]
[14,"4","Crna Gora","CG",0,0,{"$f":"INDEX($J$1:$K$37, MATCH(B1219,$J$1:$J$37,), MATCH(\"KC\",$J$1:$K$1,))","v":"Izvoz Crna Gora"},{"$f":"INDEX($L$1:$M$161, MATCH(A1219,$L$1:$L$161,), MATCH(\"GRUPA\",$L$1:$M$1,))","v":"1. Sveži proizvodi"}]
[15,"4","Crna Gora","CG",0,0,"Izvoz Crna Gora","1. Sveži proizvodi"]
[16,"4","Crna Gora","CG",0,0,"Izvoz Crna Gora","1. Sveži proizvodi"]
[17,"4","Crna Gora","CG",0,0,"Izvoz Crna Gora","1. Sveži proizvodi"]
[18,"4","Crna Gora","CG",0,0,"Izvoz Crna Gora","1. Sveži proizvodi"]
[19,"4","Crna Gora","CG",0,0,"Izvoz Crna Gora","1. Sveži proizvodi"]
[20,"4","Crna Gora","CG",0,0,"Izvoz Crna Gora","1. Sveži proizvodi"]
[21,"4","Crna Gora","CG",0,0,"Izvoz Crna Gora","1. Sveži proizvodi"]
[22,"4","Crna Gora","CG",0,0,"Izvoz Crna Gora","1. Sveži proizvodi"]
[23,"4","Crna Gora","CG",0,0,"Izvoz Crna Gora","1. Sveži proizvodi"]
[24,"4","Crna Gora","CG",0,0,"Izvoz Crna Gora","1. Sveži proizvodi"]
[25,"4","Crna Gora","CG",0,0,"Izvoz Crna Gora","1. Sveži proizvodi"]
[26,"4","Crna Gora","CG",0,0,"Izvoz Crna Gora","1. Sveži proizvodi"]
[27,"4","Crna Gora","CG",0,0,"Izvoz Crna Gora","1. Sveži proizvodi"]
[28,"4","Crna Gora","CG",0,0,"Izvoz Crna Gora","1. Sveži proizvodi"]
[29,"4","Crna Gora","CG",0,0,"Izvoz Crna Gora","1. Sveži proizvodi"]
[30,"4","Crna Gora","CG",0,0,"Izvoz Crna Gora","1. Sveži proizvodi"]
[31,"4","Crna Gora","CG",0,0,"Izvoz Crna Gora","1. Sveži proizvodi"]
[32,"4","Crna Gora","CG",0,0,"Izvoz Crna Gora","1. Sveži proizvodi"]
[33,"4","Crna Gora","CG",0,0,"Izvoz Crna Gora","1. Sveži proizvodi"]
[34,"4","Crna Gora","CG",0,0,"Izvoz Crna Gora","1. Sveži proizvodi"]
[37,"4","Crna Gora","CG",0,0,"Izvoz Crna Gora","1. Sveži proizvodi"]
[38,"4","Crna Gora","CG",0,0,"Izvoz Crna Gora","1. Sveži proizvodi"]
[39,"4","Crna Gora","CG",0,0,"Izvoz Crna Gora","1. Sveži proizvodi"]
[40,"4","Crna Gora","CG",0,0,"Izvoz Crna Gora","1. Sveži proizvodi"]
[41,"4","Crna Gora","CG",0,0,"Izvoz Crna Gora","1. Sveži proizvodi"]
[42,"4","Crna Gora","CG",0,0,"Izvoz Crna Gora","1. Sveži proizvodi"]
[43,"4","Crna Gora","CG",0,0,"Izvoz Crna Gora","1. Sveži proizvodi"]
[44,"4","Crna Gora","CG",0,0,"Izvoz Crna Gora","1. Sveži proizvodi"]
[45,"4","Crna Gora","CG",0,0,"Izvoz Crna Gora","1. Sveži proizvodi"]
[46,"4","Crna Gora","CG",0,0,"Izvoz Crna Gora","1. Sveži proizvodi"]
[47,"4","Crna Gora","CG",0,0,"Izvoz Crna Gora","1. Sveži proizvodi"]
[48,"4","Crna Gora","CG",0,0,"Izvoz Crna Gora","1. Sveži proizvodi"]
[49,"4","Crna Gora","CG",0,0,"Izvoz Crna Gora","1. Sveži proizvodi"]
[50,"4","Crna Gora","CG",0,0,"Izvoz Crna Gora","1. Sveži proizvodi"]
[51,"4","Crna Gora","CG",0,0,"Izvoz Crna Gora","1. Sveži proizvodi"]
[52,"4","Crna Gora","CG",0,0,"Izvoz Crna Gora","1. Sveži proizvodi"]
[53,"4","Crna Gora","CG",0,0,"Izvoz Crna Gora","1. Sveži proizvodi"]
[54,"4","Crna Gora","CG",0,0,"Izvoz Crna Gora","1. Sveži proizvodi"]
[55,"4","Crna Gora","CG",0,0,"Izvoz Crna Gora","1. Sveži proizvodi"]
[56,"4","Crna Gora","CG",0,0,"Izvoz Crna Gora","1. Sveži proizvodi"]
[57,"4","Crna Gora","CG",0,0,"Izvoz Crna Gora","1. Sveži proizvodi"]
[58,"4","Crna Gora","CG",0,0,"Izvoz Crna Gora","1. Sveži proizvodi"]
[59,"4","Crna Gora","CG",0,0,"Izvoz Crna Gora","1. Sveži proizvodi"]
[61,"4","Crna Gora","CG",0,0,"Izvoz Crna Gora","1. Sveži proizvodi"]
[62,"4","Crna Gora","CG",0,0,"Izvoz Crna Gora","1. Sveži proizvodi"]
[63,"4","Crna Gora","CG",0,0,"Izvoz Crna Gora","1. Sveži proizvodi"]
[64,"4","Crna Gora","CG",0,0,"Izvoz Crna Gora","1. Sveži proizvodi"]
[65,"4","Crna Gora","CG",0,0,"Izvoz Crna Gora","1. Sveži proizvodi"]
[66,"4","Crna Gora","CG",0,0,"Izvoz Crna Gora","1. Sveži proizvodi"]
[67,"4","Crna Gora","CG",0,0,"Izvoz Crna Gora","1. Sveži proizvodi"]
[68,"4","Crna Gora","CG",0,0,"Izvoz Crna Gora","1. Sveži proizvodi"]
[69,"4","Crna Gora","CG",0,0,"Izvoz Crna Gora","1. Sveži proizvodi"]
[71,"4","Crna Gora","CG",0,0,"Izvoz Crna Gora","1. Sveži proizvodi"]
[72,"4","Crna Gora","CG",0,0,"Izvoz Crna Gora","1. Sveži proizvodi"]
[73,"4","Crna Gora","CG",0,0,"Izvoz Crna Gora","1. Sveži proizvodi"]
[74,"4","Crna Gora","CG",0,0,"Izvoz Crna Gora","1. Sveži proizvodi"]
[75,"4","Crna Gora","CG",0,0,"Izvoz Crna Gora","1. Sveži proizvodi"]
[76,"4","Crna Gora","CG",0,0,"Izvoz Crna Gora","1. Sveži proizvodi"]
[77,"4","Crna Gora","CG",0,0,"Izvoz Crna Gora","1. Sveži proizvodi"]
[78,"4","Crna Gora","CG",0,0,"Izvoz Crna Gora","1. Sveži proizvodi"]
[80,"4","Crna Gora","CG",0,0,"Izvoz Crna Gora","1. Sveži proizvodi"]
[82,"4","Crna Gora","CG",0,0,"Izvoz Crna Gora","1. Sveži proizvodi"]
[89,"4","Crna Gora","CG",0,0,"Izvoz Crna Gora","1. Sveži proizvodi"]
[90,"4","Crna Gora","CG",0,0,{"$f":"INDEX($J$1:$K$37, MATCH(B1283,$J$1:$J$37,), MATCH(\"KC\",$J$1:$K$1,))","v":"Izvoz Crna Gora"},{"$f":"INDEX($L$1:$M$161, MATCH(A1283,$L$1:$L$161,), MATCH(\"GRUPA\",$L$1:$M$1,))","v":"1. Sveži proizvodi"}]
[92,"4","Crna Gora","CG",0,0,"Izvoz Crna Gora","1. Sveži proizvodi"]
[93,"4","Crna Gora","CG",0,0,"Izvoz Crna Gora","1. Sveži proizvodi"]
[94,"4","Crna Gora","CG",0,0,"Izvoz Crna Gora","1. Sveži proizvodi"]
[95,"4","Crna Gora","CG",0,0,"Izvoz Crna Gora","1. Sveži proizvodi"]
[96,"4","Crna Gora","CG",0,0,"Izvoz Crna Gora","1. Sveži proizvodi"]
[97,"4","Crna Gora","CG",0,0,"Izvoz Crna Gora","1. Sveži proizvodi"]
[98,"4","Crna Gora","CG",0,0,"Izvoz Crna Gora","1. Sveži proizvodi"]
[99,"4","Crna Gora","CG",0,0,"Izvoz Crna Gora","1. Sveži proizvodi"]
[151,"4","Crna Gora","CG",0,0,"Izvoz Crna Gora","2. Smrznuti proizvodi"]
[152,"4","Crna Gora","CG",0,0,"Izvoz Crna Gora","2. Smrznuti proizvodi"]
[153,"4","Crna Gora","CG",0,0,"Izvoz Crna Gora","2. Smrznuti proizvodi"]
[154,"4","Crna Gora","CG",0,0,"Izvoz Crna Gora","2. Smrznuti proizvodi"]
[155,"4","Crna Gora","CG",0,0,"Izvoz Crna Gora","2. Smrznuti proizvodi"]
[156,"4","Crna Gora","CG",0,0,"Izvoz Crna Gora","2. Smrznuti proizvodi"]
[157,"4","Crna Gora","CG",0,0,"Izvoz Crna Gora","2. Smrznuti proizvodi"]
[158,"4","Crna Gora","CG",0,0,"Izvoz Crna Gora","2. Smrznuti proizvodi"]
[159,"4","Crna Gora","CG",0,0,"Izvoz Crna Gora","2. Smrznuti proizvodi"]
[160,"4","Crna Gora","CG",0,0,"Izvoz Crna Gora","2. Smrznuti proizvodi"]
[161,"4","Crna Gora","CG",0,0,"Izvoz Crna Gora","2. Smrznuti proizvodi"]
[162,"4","Crna Gora","CG",0,0,"Izvoz Crna Gora","2. Smrznuti proizvodi"]
[163,"4","Crna Gora","CG",0,0,"Izvoz Crna Gora","2. Smrznuti proizvodi"]
[164,"4","Crna Gora","CG",0,0,"Izvoz Crna Gora","2. Smrznuti proizvodi"]
[165,"4","Crna Gora","CG",0,0,"Izvoz Crna Gora","2. Smrznuti proizvodi"]
[166,"4","Crna Gora","CG",0,0,"Izvoz Crna Gora","2. Smrznuti proizvodi"]
[171,"4","Crna Gora","CG",0,0,"Izvoz Crna Gora","2. Smrznuti proizvodi"]
[172,"4","Crna Gora","CG",0,0,"Izvoz Crna Gora","2. Smrznuti proizvodi"]
[301,"4","Crna Gora","CG",0,0,"Izvoz Crna Gora","3. Prepađevine"]
[302,"4","Crna Gora","CG",0,0,"Izvoz Crna Gora","3. Prepađevine"]
[303,"4","Crna Gora","CG",0,0,"Izvoz Crna Gora","3. Prepađevine"]
[304,"4","Crna Gora","CG",0,0,"Izvoz Crna Gora","3. Prepađevine"]
[305,"4","Crna Gora","CG",0,0,"Izvoz Crna Gora","3. Prepađevine"]
[306,"4","Crna Gora","CG",0,0,"Izvoz Crna Gora","3. Prepađevine"]
[307,"4","Crna Gora","CG",0,0,"Izvoz Crna Gora","3. Prepađevine"]
[308,"4","Crna Gora","CG",0,0,"Izvoz Crna Gora","3. Prepađevine"]
[309,"4","Crna Gora","CG",0,0,"Izvoz Crna Gora","3. Prepađevine"]
[310,"4","Crna Gora","CG",0,0,"Izvoz Crna Gora","3. Prepađevine"]
[311,"4","Crna Gora","CG",0,0,"Izvoz Crna Gora","3. Prepađevine"]
[312,"4","Crna Gora","CG",0,0,"Izvoz Crna Gora","3. Prepađevine"]
[313,"4","Crna Gora","CG",0,0,"Izvoz Crna Gora","3. Prepađevine"]
[314,"4","Crna Gora","CG",0,0,"Izvoz Crna Gora","3. Prepađevine"]
[315,"4","Crna Gora","CG",0,0,"Izvoz Crna Gora","3. Prepađevine"]
[316,"4","Crna Gora","CG",0,0,"Izvoz Crna Gora","3. Prepađevine"]
[317,"4","Crna Gora","CG",0,0,"Izvoz Crna Gora","3. Prepađevine"]
[318,"4","Crna Gora","CG",0,0,"Izvoz Crna Gora","3. Prepađevine"]
[319,"4","Crna Gora","CG",0,0,"Izvoz Crna Gora","3. Prepađevine"]
[321,"4","Crna Gora","CG",0,0,"Izvoz Crna Gora","3. Prepađevine"]
[322,"4","Crna Gora","CG",0,0,"Izvoz Crna Gora","3. Prepađevine"]
[323,"4","Crna Gora","CG",0,0,"Izvoz Crna Gora","3. Prepađevine"]
[324,"4","Crna Gora","CG",0,0,"Izvoz Crna Gora","3. Prepađevine"]
[326,"4","Crna Gora","CG",0,0,"Izvoz Crna Gora","3. Prepađevine"]
[327,"4","Crna Gora","CG",0,0,"Izvoz Crna Gora","3. Prepađevine"]
[330,"4","Crna Gora","CG",0,0,"Izvoz Crna Gora","3. Prepađevine"]
[335,"4","Crna Gora","CG",0,0,"Izvoz Crna Gora","3. Prepađevine"]
[336,"4","Crna Gora","CG",0,0,"Izvoz Crna Gora","3. Prepađevine"]
[337,"4","Crna Gora","CG",0,0,"Izvoz Crna Gora","3. Prepađevine"]
[338,"4","Crna Gora","CG",0,0,"Izvoz Crna Gora","3. Prepađevine"]
[339,"4","Crna Gora","CG",0,0,"Izvoz Crna Gora","3. Prepađevine"]
[351,"4","Crna Gora","CG",0,0,"Izvoz Crna Gora","3. Prepađevine"]
[352,"4","Crna Gora","CG",0,0,"Izvoz Crna Gora","3. Prepađevine"]
[353,"4","Crna Gora","CG",0,0,"Izvoz Crna Gora","3. Prepađevine"]
[354,"4","Crna Gora","CG",0,0,"Izvoz Crna Gora","3. Prepađevine"]
[355,"4","Crna Gora","CG",0,0,"Izvoz Crna Gora","3. Prepađevine"]
[356,"4","Crna Gora","CG",0,0,"Izvoz Crna Gora","3. Prepađevine"]
[357,"4","Crna Gora","CG",0,0,{"$f":"INDEX($J$1:$K$37, MATCH(B1347,$J$1:$J$37,), MATCH(\"KC\",$J$1:$K$1,))","v":"Izvoz Crna Gora"},{"$f":"INDEX($L$1:$M$161, MATCH(A1347,$L$1:$L$161,), MATCH(\"GRUPA\",$L$1:$M$1,))","v":"3. Prepađevine"}]
[360,"4","Crna Gora","CG",0,0,"Izvoz Crna Gora","3. Prepađevine"]
[361,"4","Crna Gora","CG",0,0,"Izvoz Crna Gora","3. Prepađevine"]
[362,"4","Crna Gora","CG",0,0,"Izvoz Crna Gora","3. Prepađevine"]
[364,"4","Crna Gora","CG",0,0,"Izvoz Crna Gora","3. Prepađevine"]
[365,"4","Crna Gora","CG",0,0,"Izvoz Crna Gora","3. Prepađevine"]
[366,"4","Crna Gora","CG",0,0,"Izvoz Crna Gora","3. Prepađevine"]
[367,"4","Crna Gora","CG",0,0,"Izvoz Crna Gora","3. Prepađevine"]
[368,"4","Crna Gora","CG",0,0,"Izvoz Crna Gora","3. Prepađevine"]
[369,"4","Crna Gora","CG",0,0,"Izvoz Crna Gora","3. Prepađevine"]
[370,"4","Crna Gora","CG",0,0,"Izvoz Crna Gora","3. Prepađevine"]
[371,"4","Crna Gora","CG",0,0,"Izvoz Crna Gora","3. Prepađevine"]
[372,"4","Crna Gora","CG",0,0,"Izvoz Crna Gora","3. Prepađevine"]
[373,"4","Crna Gora","CG",0,0,"Izvoz Crna Gora","3. Prepađevine"]
[374,"4","Crna Gora","CG",0,0,"Izvoz Crna Gora","3. Prepađevine"]
[375,"4","Crna Gora","CG",0,0,"Izvoz Crna Gora","3. Prepađevine"]
[376,"4","Crna Gora","CG",0,0,"Izvoz Crna Gora","3. Prepađevine"]
[377,"4","Crna Gora","CG",0,0,"Izvoz Crna Gora","3. Prepađevine"]
[378,"4","Crna Gora","CG",0,0,"Izvoz Crna Gora","3. Prepađevine"]
[401,"4","Crna Gora","CG",0,0,"Izvoz Crna Gora",{"$error":"#N/A"}]
[802,"4","Crna Gora","CG",0,0,"Izvoz Crna Gora",{"$error":"#N/A"}]
[2050,"4","Crna Gora","CG",0,0,"Izvoz Crna Gora",{"$error":"#N/A"}]
[2065,"4","Crna Gora","CG",0,0,"Izvoz Crna Gora",{"$error":"#N/A"}]
[2185,"4","Crna Gora","CG",0,0,"Izvoz Crna Gora",{"$error":"#N/A"}]
[2320,"4","Crna Gora","CG",0,0,"Izvoz Crna Gora",{"$error":"#N/A"}]
[2330,"4","Crna Gora","CG",0,0,"Izvoz Crna Gora",{"$error":"#N/A"}]
[2335,"4","Crna Gora","CG",0,0,"Izvoz Crna Gora",{"$error":"#N/A"}]
[2600,"4","Crna Gora","CG",0,0,"Izvoz Crna Gora",{"$error":"#N/A"}]
[2660,"4","Crna Gora","CG",0,0,"Izvoz Crna Gora",{"$error":"#N/A"}]
[3049,"4","Crna Gora","CG",0,0,"Izvoz Crna Gora",{"$error":"#N/A"}]
[3051,"4","Crna Gora","CG",0,0,"Izvoz Crna Gora",{"$error":"#N/A"}]
[3052,"4","Crna Gora","CG",0,0,"Izvoz Crna Gora",{"$error":"#N/A"}]
[3054,"4","Crna Gora","CG",0,0,"Izvoz Crna Gora",{"$error":"#N/A"}]
[3055,"4","Crna Gora","CG",0,0,"Izvoz Crna Gora",{"$error":"#N/A"}]
[3062,"4","Crna Gora","CG",0,0,"Izvoz Crna Gora",{"$error":"#N/A"}]
[3068,"4","Crna Gora","CG",0,0,"Izvoz Crna Gora",{"$error":"#N/A"}]
[3087,"4","Crna Gora","CG",0,0,"Izvoz Crna Gora",{"$error":"#N/A"}]
[3092,"4","Crna Gora","CG",0,0,"Izvoz Crna Gora",{"$error":"#N/A"}]
[3127,"4","Crna Gora","CG",0,0,"Izvoz Crna Gora",{"$error":"#N/A"}]
[3130,"4","Crna Gora","CG",0,0,"Izvoz Crna Gora",{"$error":"#N/A"}]
[3135,"4","Crna Gora","CG",0,0,"Izvoz Crna Gora",{"$error":"#N/A"}]
[3154,"4","Crna Gora","CG",0,0,"Izvoz Crna Gora",{"$error":"#N/A"}]
[3162,"4","Crna Gora","CG",0,0,"Izvoz Crna Gora",{"$error":"#N/A"}]
[3182,"4","Crna Gora","CG",0,0,"Izvoz Crna Gora",{"$error":"#N/A"}]
[3195,"4","Crna Gora","CG",0,0,"Izvoz Crna Gora",{"$error":"#N/A"}]
[3196,"4","Crna Gora","CG",0,0,"Izvoz Crna Gora",{"$error":"#N/A"}]
[3225,"4","Crna Gora","CG",0,0,"Izvoz Crna Gora",{"$error":"#N/A"}]
[3228,"4","Crna Gora","CG",0,0,"Izvoz Crna Gora",{"$error":"#N/A"}]
[3358,"4","Crna Gora","CG",0,0,"Izvoz Crna Gora",{"$error":"#N/A"}]
[3395,"4","Crna Gora","CG",0,0,"Izvoz Crna Gora",{"$error":"#N/A"}]
[3550,"4","Crna Gora","CG",0,0,"Izvoz Crna Gora",{"$error":"#N/A"}]
[3552,"4","Crna Gora","CG",0,0,"Izvoz Crna Gora",{"$error":"#N/A"}]
[3645,"4","Crna Gora","CG",0,0,"Izvoz Crna Gora",{"$error":"#N/A"}]
[3648,"4","Crna Gora","CG",0,0,"Izvoz Crna Gora",{"$error":"#N/A"}]
[4000,"4","Crna Gora","CG",0,0,"Izvoz Crna Gora",{"$error":"#N/A"}]
[4008,"4","Crna Gora","CG",0,0,"Izvoz Crna Gora",{"$error":"#N/A"}]
[4010,"4","Crna Gora","CG",0,0,"Izvoz Crna Gora",{"$error":"#N/A"}]
[4018,"4","Crna Gora","CG",0,0,"Izvoz Crna Gora",{"$error":"#N/A"}]
[4012,"4","Crna Gora","CG",0,0,"Izvoz Crna Gora",{"$error":"#N/A"}]
[4015,"4","Crna Gora","CG",0,0,"Izvoz Crna Gora",{"$error":"#N/A"}]
[4050,"4","Crna Gora","CG",0,0,"Izvoz Crna Gora",{"$error":"#N/A"}]
[4060,"4","Crna Gora","CG",0,0,"Izvoz Crna Gora",{"$error":"#N/A"}]
[4110,"4","Crna Gora","CG",0,0,"Izvoz Crna Gora",{"$error":"#N/A"}]
[5190,"4","Crna Gora","CG",0,0,"Izvoz Crna Gora",{"$error":"#N/A"}]
[5200,"4","Crna Gora","CG",0,0,{"$f":"INDEX($J$1:$K$37, MATCH(B1411,$J$1:$J$37,), MATCH(\"KC\",$J$1:$K$1,))","v":"Izvoz Crna Gora"},{"$f":"INDEX($L$1:$M$161, MATCH(A1411,$L$1:$L$161,), MATCH(\"GRUPA\",$L$1:$M$1,))","v":{"$error":"#N/A"}}]
[5221,"4","Crna Gora","CG",0,0,"Izvoz Crna Gora",{"$error":"#N/A"}]
[5224,"4","Crna Gora","CG",0,0,"Izvoz Crna Gora",{"$error":"#N/A"}]
[5240,"4","Crna Gora","CG",0,0,"Izvoz Crna Gora",{"$error":"#N/A"}]
[5242,"4","Crna Gora","CG",0,0,"Izvoz Crna Gora",{"$error":"#N/A"}]
[5243,"4","Crna Gora","CG",0,0,"Izvoz Crna Gora",{"$error":"#N/A"}]
[5246,"4","Crna Gora","CG",0,0,"Izvoz Crna Gora",{"$error":"#N/A"}]
[5248,"4","Crna Gora","CG",0,0,"Izvoz Crna Gora",{"$error":"#N/A"}]
[5249,"4","Crna Gora","CG",0,0,"Izvoz Crna Gora",{"$error":"#N/A"}]
[5251,"4","Crna Gora","CG",0,0,"Izvoz Crna Gora",{"$error":"#N/A"}]
[5268,"4","Crna Gora","CG",0,0,"Izvoz Crna Gora",{"$error":"#N/A"}]
[5270,"4","Crna Gora","CG",0,0,"Izvoz Crna Gora",{"$error":"#N/A"}]
[5372,"4","Crna Gora","CG",0,0,"Izvoz Crna Gora",{"$error":"#N/A"}]
[5373,"4","Crna Gora","CG",0,0,"Izvoz Crna Gora",{"$error":"#N/A"}]
[5836,"4","Crna Gora","CG",0,0,"Izvoz Crna Gora",{"$error":"#N/A"}]
[5920,"4","Crna Gora","CG",0,0,"Izvoz Crna Gora",{"$error":"#N/A"}]
[5923,"4","Crna Gora","CG",0,0,"Izvoz Crna Gora",{"$error":"#N/A"}]
[5924,"4","Crna Gora","CG",0,0,"Izvoz Crna Gora",{"$error":"#N/A"}]
[5938,"4","Crna Gora","CG",0,0,"Izvoz Crna Gora",{"$error":"#N/A"}]
[5939,"4","Crna Gora","CG",0,0,"Izvoz Crna Gora",{"$error":"#N/A"}]
[5941,"4","Crna Gora","CG",0,0,"Izvoz Crna Gora",{"$error":"#N/A"}]
[5944,"4","Crna Gora","CG",0,0,"Izvoz Crna Gora",{"$error":"#N/A"}]
[7340,"4","Crna Gora","CG",0,0,"Izvoz Crna Gora",{"$error":"#N/A"}]
[7348,"4","Crna Gora","CG",0,0,"Izvoz Crna Gora",{"$error":"#N/A"}]
[7342,"4","Crna Gora","CG",0,0,"Izvoz Crna Gora",{"$error":"#N/A"}]
[7347,"4","Crna Gora","CG",0,0,"Izvoz Crna Gora",{"$error":"#N/A"}]
[7370,"4","Crna Gora","CG",0,0,"Izvoz Crna Gora",{"$error":"#N/A"}]
[7371,"4","Crna Gora","CG",0,0,"Izvoz Crna Gora",{"$error":"#N/A"}]
[7372,"4","Crna Gora","CG",0,0,"Izvoz Crna Gora",{"$error":"#N/A"}]
[7373,"4","Crna Gora","CG",0,0,"Izvoz Crna Gora",{"$error":"#N/A"}]
[7374,"4","Crna Gora","CG",0,0,"Izvoz Crna Gora",{"$error":"#N/A"}]
[7376,"4","Crna Gora","CG",0,0,"Izvoz Crna Gora",{"$error":"#N/A"}]
[7377,"4","Crna Gora","CG",0,0,"Izvoz Crna Gora",{"$error":"#N/A"}]
[7378,"4","Crna Gora","CG",0,0,"Izvoz Crna Gora",{"$error":"#N/A"}]
[7379,"4","Crna Gora","CG",0,0,"Izvoz Crna Gora",{"$error":"#N/A"}]
[7380,"4","Crna Gora","CG",0,0,"Izvoz Crna Gora",{"$error":"#N/A"}]
[7497,"4","Crna Gora","CG",0,0,"Izvoz Crna Gora",{"$error":"#N/A"}]
[7498,"4","Crna Gora","CG",0,0,"Izvoz Crna Gora",{"$error":"#N/A"}]
[7539,"4","Crna Gora","CG",0,0,"Izvoz Crna Gora",{"$error":"#N/A"}]
[7540,"4","Crna Gora","CG",0,0,"Izvoz Crna Gora",{"$error":"#N/A"}]
[7546,"4","Crna Gora","CG",0,0,"Izvoz Crna Gora",{"$error":"#N/A"}]
[7888,"4","Crna Gora","CG",0,0,"Izvoz Crna Gora",{"$error":"#N/A"}]
[12001,"4","Crna Gora","CG",0,0,"Izvoz Crna Gora",{"$error":"#N/A"}]
[12002,"4","Crna Gora","CG",0,0,"Izvoz Crna Gora",{"$error":"#N/A"}]
[12005,"4","Crna Gora","CG",0,0,"Izvoz Crna Gora",{"$error":"#N/A"}]
[12027,"4","Crna Gora","CG",0,0,"Izvoz Crna Gora",{"$error":"#N/A"}]
[12032,"4","Crna Gora","CG",0,0,"Izvoz Crna Gora",{"$error":"#N/A"}]
[12034,"4","Crna Gora","CG",0,0,"Izvoz Crna Gora",{"$error":"#N/A"}]
[12035,"4","Crna Gora","CG",0,0,"Izvoz Crna Gora",{"$error":"#N/A"}]
[12047,"4","Crna Gora","CG",0,0,"Izvoz Crna Gora",{"$error":"#N/A"}]
[12061,"4","Crna Gora","CG",0,0,"Izvoz Crna Gora",{"$error":"#N/A"}]
[12075,"4","Crna Gora","CG",0,0,"Izvoz Crna Gora",{"$error":"#N/A"}]
[12080,"4","Crna Gora","CG",0,0,"Izvoz Crna Gora",{"$error":"#N/A"}]
[12081,"4","Crna Gora","CG",0,0,"Izvoz Crna Gora",{"$error":"#N/A"}]
[12500,"4","Crna Gora","CG",0,0,"Izvoz Crna Gora",{"$error":"#N/A"}]
[12501,"4","Crna Gora","CG",0,0,"Izvoz Crna Gora",{"$error":"#N/A"}]
[12503,"4","Crna Gora","CG",0,0,"Izvoz Crna Gora",{"$error":"#N/A"}]
[12550,"4","Crna Gora","CG",0,0,"Izvoz Crna Gora",{"$error":"#N/A"}]
[12831,"4","Crna Gora","CG",0,0,"Izvoz Crna Gora",{"$error":"#N/A"}]
[12832,"4","Crna Gora","CG",0,0,"Izvoz Crna Gora",{"$error":"#N/A"}]
[12833,"4","Crna Gora","CG",0,0,"Izvoz Crna Gora",{"$error":"#N/A"}]
[12834,"4","Crna Gora","CG",0,0,"Izvoz Crna Gora",{"$error":"#N/A"}]
[12841,"4","Crna Gora","CG",0,0,"Izvoz Crna Gora",{"$error":"#N/A"}]
[12845,"4","Crna Gora","CG",0,0,"Izvoz Crna Gora",{"$error":"#N/A"}]
[12851,"4","Crna Gora","CG",0,0,{"$f":"INDEX($J$1:$K$37, MATCH(B1475,$J$1:$J$37,), MATCH(\"KC\",$J$1:$K$1,))","v":"Izvoz Crna Gora"},{"$f":"INDEX($L$1:$M$161, MATCH(A1475,$L$1:$L$161,), MATCH(\"GRUPA\",$L$1:$M$1,))","v":{"$error":"#N/A"}}]
[12852,"4","Crna Gora","CG",0,0,"Izvoz Crna Gora",{"$error":"#N/A"}]
[14057,"4","Crna Gora","CG",0,0,"Izvoz Crna Gora",{"$error":"#N/A"}]
[14143,"4","Crna Gora","CG",0,0,"Izvoz Crna Gora",{"$error":"#N/A"}]
[14144,"4","Crna Gora","CG",0,0,"Izvoz Crna Gora",{"$error":"#N/A"}]
[14145,"4","Crna Gora","CG",0,0,"Izvoz Crna Gora",{"$error":"#N/A"}]
[14146,"4","Crna Gora","CG",0,0,"Izvoz Crna Gora",{"$error":"#N/A"}]
[14147,"4","Crna Gora","CG",0,0,"Izvoz Crna Gora",{"$error":"#N/A"}]
[14150,"4","Crna Gora","CG",0,0,"Izvoz Crna Gora",{"$error":"#N/A"}]
[14151,"4","Crna Gora","CG",0,0,"Izvoz Crna Gora",{"$error":"#N/A"}]
[14152,"4","Crna Gora","CG",0,0,"Izvoz Crna Gora",{"$error":"#N/A"}]
[14154,"4","Crna Gora","CG",0,0,"Izvoz Crna Gora",{"$error":"#N/A"}]
[14156,"4","Crna Gora","CG",0,0,"Izvoz Crna Gora",{"$error":"#N/A"}]
[14181,"4","Crna Gora","CG",0,0,"Izvoz Crna Gora",{"$error":"#N/A"}]
[14182,"4","Crna Gora","CG",0,0,"Izvoz Crna Gora",{"$error":"#N/A"}]
[14210,"4","Crna Gora","CG",0,0,"Izvoz Crna Gora",{"$error":"#N/A"}]
[14211,"4","Crna Gora","CG",0,0,"Izvoz Crna Gora",{"$error":"#N/A"}]
[14212,"4","Crna Gora","CG",0,0,"Izvoz Crna Gora",{"$error":"#N/A"}]
[40252,"4","Crna Gora","CG",0,0,"Izvoz Crna Gora",{"$error":"#N/A"}]
[40302,"4","Crna Gora","CG",0,0,"Izvoz Crna Gora",{"$error":"#N/A"}]
[40402,"4","Crna Gora","CG",0,0,"Izvoz Crna Gora",{"$error":"#N/A"}]
[40502,"4","Crna Gora","CG",0,0,"Izvoz Crna Gora",{"$error":"#N/A"}]
[40700,"4","Crna Gora","CG",0,0,"Izvoz Crna Gora",{"$error":"#N/A"}]
[40701,"4","Crna Gora","CG",0,0,"Izvoz Crna Gora",{"$error":"#N/A"}]
[43217,"4","Crna Gora","CG",0,0,"Izvoz Crna Gora",{"$error":"#N/A"}]
[43250,"4","Crna Gora","CG",0,0,"Izvoz Crna Gora",{"$error":"#N/A"}]
[43400,"4","Crna Gora","CG",0,0,"Izvoz Crna Gora",{"$error":"#N/A"}]
[43500,"4","Crna Gora","CG",0,0,"Izvoz Crna Gora",{"$error":"#N/A"}]
[43900,"4","Crna Gora","CG",0,0,"Izvoz Crna Gora",{"$error":"#N/A"}]
[43905,"4","Crna Gora","CG",0,0,"Izvoz Crna Gora",{"$error":"#N/A"}]
[43906,"4","Crna Gora","CG",0,0,"Izvoz Crna Gora",{"$error":"#N/A"}]
[43910,"4","Crna Gora","CG",0,0,"Izvoz Crna Gora",{"$error":"#N/A"}]
[1,"9","Izvoz Makedonija","MK",0,0,"Izvoz Makedonija","1. Sveži proizvodi"]
[2,"9","Izvoz Makedonija","MK",0,0,"Izvoz Makedonija","1. Sveži proizvodi"]
[3,"9","Izvoz Makedonija","MK",0,0,"Izvoz Makedonija","1. Sveži proizvodi"]
[4,"9","Izvoz Makedonija","MK",0,0,"Izvoz Makedonija","1. Sveži proizvodi"]
[5,"9","Izvoz Makedonija","MK",0,0,"Izvoz Makedonija","1. Sveži proizvodi"]
[6,"9","Izvoz Makedonija","MK",0,0,"Izvoz Makedonija","1. Sveži proizvodi"]
[7,"9","Izvoz Makedonija","MK",0,0,"Izvoz Makedonija","1. Sveži proizvodi"]
[8,"9","Izvoz Makedonija","MK",0,0,"Izvoz Makedonija","1. Sveži proizvodi"]
[9,"9","Izvoz Makedonija","MK",0,0,"Izvoz Makedonija","1. Sveži proizvodi"]
[10,"9","Izvoz Makedonija","MK",0,0,"Izvoz Makedonija","1. Sveži proizvodi"]
[11,"9","Izvoz Makedonija","MK",0,0,"Izvoz Makedonija","1. Sveži proizvodi"]
[12,"9","Izvoz Makedonija","MK",0,0,"Izvoz Makedonija","1. Sveži proizvodi"]
[13,"9","Izvoz Makedonija","MK",0,0,"Izvoz Makedonija","1. Sveži proizvodi"]
[14,"9","Izvoz Makedonija","MK",0,0,"Izvoz Makedonija","1. Sveži proizvodi"]
[15,"9","Izvoz Makedonija","MK",0,0,"Izvoz Makedonija","1. Sveži proizvodi"]
[16,"9","Izvoz Makedonija","MK",0,0,"Izvoz Makedonija","1. Sveži proizvodi"]
[17,"9","Izvoz Makedonija","MK",0,0,"Izvoz Makedonija","1. Sveži proizvodi"]
[18,"9","Izvoz Makedonija","MK",0,0,"Izvoz Makedonija","1. Sveži proizvodi"]
[19,"9","Izvoz Makedonija","MK",0,0,"Izvoz Makedonija","1. Sveži proizvodi"]
[20,"9","Izvoz Makedonija","MK",0,0,"Izvoz Makedonija","1. Sveži proizvodi"]
[21,"9","Izvoz Makedonija","MK",0,0,"Izvoz Makedonija","1. Sveži proizvodi"]
[22,"9","Izvoz Makedonija","MK",0,0,"Izvoz Makedonija","1. Sveži proizvodi"]
[23,"9","Izvoz Makedonija","MK",0,0,"Izvoz Makedonija","1. Sveži proizvodi"]
[24,"9","Izvoz Makedonija","MK",0,0,"Izvoz Makedonija","1. Sveži proizvodi"]
[25,"9","Izvoz Makedonija","MK",0,0,"Izvoz Makedonija","1. Sveži proizvodi"]
[26,"9","Izvoz Makedonija","MK",0,0,"Izvoz Makedonija","1. Sveži proizvodi"]
[27,"9","Izvoz Makedonija","MK",0,0,"Izvoz Makedonija","1. Sveži proizvodi"]
[28,"9","Izvoz Makedonija","MK",0,0,"Izvoz Makedonija","1. Sveži proizvodi"]
[29,"9","Izvoz Makedonija","MK",0,0,"Izvoz Makedonija","1. Sveži proizvodi"]
[30,"9","Izvoz Makedonija","MK",0,0,"Izvoz Makedonija","1. Sveži proizvodi"]
[31,"9","Izvoz Makedonija","MK",0,0,"Izvoz Makedonija","1. Sveži proizvodi"]
[32,"9","Izvoz Makedonija","MK",0,0,"Izvoz Makedonija","1. Sveži proizvodi"]
[33,"9","Izvoz Makedonija","MK",0,0,{"$f":"INDEX($J$1:$K$37, MATCH(B1539,$J$1:$J$37,), MATCH(\"KC\",$J$1:$K$1,))","v":"Izvoz Makedonija"},{"$f":"INDEX($L$1:$M$161, MATCH(A1539,$L$1:$L$161,), MATCH(\"GRUPA\",$L$1:$M$1,))","v":"1. Sveži proizvodi"}]
[34,"9","Izvoz Makedonija","MK",0,0,"Izvoz Makedonija","1. Sveži proizvodi"]
[37,"9","Izvoz Makedonija","MK",0,0,"Izvoz Makedonija","1. Sveži proizvodi"]
[38,"9","Izvoz Makedonija","MK",0,0,"Izvoz Makedonija","1. Sveži proizvodi"]
[39,"9","Izvoz Makedonija","MK",0,0,"Izvoz Makedonija","1. Sveži proizvodi"]
[40,"9","Izvoz Makedonija","MK",0,0,"Izvoz Makedonija","1. Sveži proizvodi"]
[41,"9","Izvoz Makedonija","MK",0,0,"Izvoz Makedonija","1. Sveži proizvodi"]
[42,"9","Izvoz Makedonija","MK",0,0,"Izvoz Makedonija","1. Sveži proizvodi"]
[43,"9","Izvoz Makedonija","MK",0,0,"Izvoz Makedonija","1. Sveži proizvodi"]
[44,"9","Izvoz Makedonija","MK",0,0,"Izvoz Makedonija","1. Sveži proizvodi"]
[45,"9","Izvoz Makedonija","MK",0,0,"Izvoz Makedonija","1. Sveži proizvodi"]
[46,"9","Izvoz Makedonija","MK",0,0,"Izvoz Makedonija","1. Sveži proizvodi"]
[47,"9","Izvoz Makedonija","MK",0,0,"Izvoz Makedonija","1. Sveži proizvodi"]
[48,"9","Izvoz Makedonija","MK",0,0,"Izvoz Makedonija","1. Sveži proizvodi"]
[49,"9","Izvoz Makedonija","MK",0,0,"Izvoz Makedonija","1. Sveži proizvodi"]
[50,"9","Izvoz Makedonija","MK",0,0,"Izvoz Makedonija","1. Sveži proizvodi"]
[51,"9","Izvoz Makedonija","MK",0,0,"Izvoz Makedonija","1. Sveži proizvodi"]
[52,"9","Izvoz Makedonija","MK",0,0,"Izvoz Makedonija","1. Sveži proizvodi"]
[53,"9","Izvoz Makedonija","MK",0,0,"Izvoz Makedonija","1. Sveži proizvodi"]
[54,"9","Izvoz Makedonija","MK",0,0,"Izvoz Makedonija","1. Sveži proizvodi"]
[55,"9","Izvoz Makedonija","MK",0,0,"Izvoz Makedonija","1. Sveži proizvodi"]
[56,"9","Izvoz Makedonija","MK",0,0,"Izvoz Makedonija","1. Sveži proizvodi"]
[57,"9","Izvoz Makedonija","MK",0,0,"Izvoz Makedonija","1. Sveži proizvodi"]
[58,"9","Izvoz Makedonija","MK",0,0,"Izvoz Makedonija","1. Sveži proizvodi"]
[59,"9","Izvoz Makedonija","MK",0,0,"Izvoz Makedonija","1. Sveži proizvodi"]
[61,"9","Izvoz Makedonija","MK",0,0,"Izvoz Makedonija","1. Sveži proizvodi"]
[62,"9","Izvoz Makedonija","MK",0,0,"Izvoz Makedonija","1. Sveži proizvodi"]
[63,"9","Izvoz Makedonija","MK",0,0,"Izvoz Makedonija","1. Sveži proizvodi"]
[64,"9","Izvoz Makedonija","MK",0,0,"Izvoz Makedonija","1. Sveži proizvodi"]
[65,"9","Izvoz Makedonija","MK",0,0,"Izvoz Makedonija","1. Sveži proizvodi"]
[66,"9","Izvoz Makedonija","MK",0,0,"Izvoz Makedonija","1. Sveži proizvodi"]
[67,"9","Izvoz Makedonija","MK",0,0,"Izvoz Makedonija","1. Sveži proizvodi"]
[68,"9","Izvoz Makedonija","MK",0,0,"Izvoz Makedonija","1. Sveži proizvodi"]
[69,"9","Izvoz Makedonija","MK",0,0,"Izvoz Makedonija","1. Sveži proizvodi"]
[71,"9","Izvoz Makedonija","MK",0,0,"Izvoz Makedonija","1. Sveži proizvodi"]
[72,"9","Izvoz Makedonija","MK",0,0,"Izvoz Makedonija","1. Sveži proizvodi"]
[73,"9","Izvoz Makedonija","MK",0,0,"Izvoz Makedonija","1. Sveži proizvodi"]
[74,"9","Izvoz Makedonija","MK",0,0,"Izvoz Makedonija","1. Sveži proizvodi"]
[75,"9","Izvoz Makedonija","MK",0,0,"Izvoz Makedonija","1. Sveži proizvodi"]
[76,"9","Izvoz Makedonija","MK",0,0,"Izvoz Makedonija","1. Sveži proizvodi"]
[77,"9","Izvoz Makedonija","MK",0,0,"Izvoz Makedonija","1. Sveži proizvodi"]
[78,"9","Izvoz Makedonija","MK",0,0,"Izvoz Makedonija","1. Sveži proizvodi"]
[80,"9","Izvoz Makedonija","MK",0,0,"Izvoz Makedonija","1. Sveži proizvodi"]
[82,"9","Izvoz Makedonija","MK",0,0,"Izvoz Makedonija","1. Sveži proizvodi"]
[89,"9","Izvoz Makedonija","MK",0,0,"Izvoz Makedonija","1. Sveži proizvodi"]
[90,"9","Izvoz Makedonija","MK",0,0,"Izvoz Makedonija","1. Sveži proizvodi"]
[92,"9","Izvoz Makedonija","MK",0,0,"Izvoz Makedonija","1. Sveži proizvodi"]
[93,"9","Izvoz Makedonija","MK",0,0,"Izvoz Makedonija","1. Sveži proizvodi"]
[94,"9","Izvoz Makedonija","MK",0,0,"Izvoz Makedonija","1. Sveži proizvodi"]
[95,"9","Izvoz Makedonija","MK",0,0,"Izvoz Makedonija","1. Sveži proizvodi"]
[96,"9","Izvoz Makedonija","MK",0,0,"Izvoz Makedonija","1. Sveži proizvodi"]
[97,"9","Izvoz Makedonija","MK",0,0,"Izvoz Makedonija","1. Sveži proizvodi"]
[98,"9","Izvoz Makedonija","MK",0,0,"Izvoz Makedonija","1. Sveži proizvodi"]
[99,"9","Izvoz Makedonija","MK",0,0,"Izvoz Makedonija","1. Sveži proizvodi"]
[151,"9","Izvoz Makedonija","MK",0,0,"Izvoz Makedonija","2. Smrznuti proizvodi"]
[152,"9","Izvoz Makedonija","MK",0,0,"Izvoz Makedonija","2. Smrznuti proizvodi"]
[153,"9","Izvoz Makedonija","MK",0,0,"Izvoz Makedonija","2. Smrznuti proizvodi"]
[154,"9","Izvoz Makedonija","MK",0,0,"Izvoz Makedonija","2. Smrznuti proizvodi"]
[155,"9","Izvoz Makedonija","MK",0,0,"Izvoz Makedonija","2. Smrznuti proizvodi"]
[156,"9","Izvoz Makedonija","MK",0,0,"Izvoz Makedonija","2. Smrznuti proizvodi"]
[157,"9","Izvoz Makedonija","MK",0,0,"Izvoz Makedonija","2. Smrznuti proizvodi"]
[158,"9","Izvoz Makedonija","MK",0,0,"Izvoz Makedonija","2. Smrznuti proizvodi"]
[159,"9","Izvoz Makedonija","MK",0,0,"Izvoz Makedonija","2. Smrznuti proizvodi"]
[160,"9","Izvoz Makedonija","MK",0,0,"Izvoz Makedonija","2. Smrznuti proizvodi"]
[161,"9","Izvoz Makedonija","MK",0,0,{"$f":"INDEX($J$1:$K$37, MATCH(B1603,$J$1:$J$37,), MATCH(\"KC\",$J$1:$K$1,))","v":"Izvoz Makedonija"},{"$f":"INDEX($L$1:$M$161, MATCH(A1603,$L$1:$L$161,), MATCH(\"GRUPA\",$L$1:$M$1,))","v":"2. Smrznuti proizvodi"}]
[162,"9","Izvoz Makedonija","MK",0,0,"Izvoz Makedonija","2. Smrznuti proizvodi"]
[163,"9","Izvoz Makedonija","MK",0,0,"Izvoz Makedonija","2. Smrznuti proizvodi"]
[164,"9","Izvoz Makedonija","MK",0,0,"Izvoz Makedonija","2. Smrznuti proizvodi"]
[165,"9","Izvoz Makedonija","MK",0,0,"Izvoz Makedonija","2. Smrznuti proizvodi"]
[166,"9","Izvoz Makedonija","MK",0,0,"Izvoz Makedonija","2. Smrznuti proizvodi"]
[171,"9","Izvoz Makedonija","MK",0,0,"Izvoz Makedonija","2. Smrznuti proizvodi"]
[172,"9","Izvoz Makedonija","MK",0,0,"Izvoz Makedonija","2. Smrznuti proizvodi"]
[301,"9","Izvoz Makedonija","MK",0,0,"Izvoz Makedonija","3. Prepađevine"]
[302,"9","Izvoz Makedonija","MK",0,0,"Izvoz Makedonija","3. Prepađevine"]
[303,"9","Izvoz Makedonija","MK",0,0,"Izvoz Makedonija","3. Prepađevine"]
[304,"9","Izvoz Makedonija","MK",0,0,"Izvoz Makedonija","3. Prepađevine"]
[305,"9","Izvoz Makedonija","MK",0,0,"Izvoz Makedonija","3. Prepađevine"]
[306,"9","Izvoz Makedonija","MK",0,0,"Izvoz Makedonija","3. Prepađevine"]
[307,"9","Izvoz Makedonija","MK",0,0,"Izvoz Makedonija","3. Prepađevine"]
[308,"9","Izvoz Makedonija","MK",0,0,"Izvoz Makedonija","3. Prepađevine"]
[309,"9","Izvoz Makedonija","MK",0,0,"Izvoz Makedonija","3. Prepađevine"]
[310,"9","Izvoz Makedonija","MK",0,0,"Izvoz Makedonija","3. Prepađevine"]
[311,"9","Izvoz Makedonija","MK",0,0,"Izvoz Makedonija","3. Prepađevine"]
[312,"9","Izvoz Makedonija","MK",0,0,"Izvoz Makedonija","3. Prepađevine"]
[313,"9","Izvoz Makedonija","MK",0,0,"Izvoz Makedonija","3. Prepađevine"]
[314,"9","Izvoz Makedonija","MK",0,0,"Izvoz Makedonija","3. Prepađevine"]
[315,"9","Izvoz Makedonija","MK",0,0,"Izvoz Makedonija","3. Prepađevine"]
[316,"9","Izvoz Makedonija","MK",0,0,"Izvoz Makedonija","3. Prepađevine"]
[317,"9","Izvoz Makedonija","MK",0,0,"Izvoz Makedonija","3. Prepađevine"]
[318,"9","Izvoz Makedonija","MK",0,0,"Izvoz Makedonija","3. Prepađevine"]
[319,"9","Izvoz Makedonija","MK",0,0,"Izvoz Makedonija","3. Prepađevine"]
[321,"9","Izvoz Makedonija","MK",0,0,"Izvoz Makedonija","3. Prepađevine"]
[322,"9","Izvoz Makedonija","MK",0,0,"Izvoz Makedonija","3. Prepađevine"]
[323,"9","Izvoz Makedonija","MK",0,0,"Izvoz Makedonija","3. Prepađevine"]
[324,"9","Izvoz Makedonija","MK",0,0,"Izvoz Makedonija","3. Prepađevine"]
[326,"9","Izvoz Makedonija","MK",0,0,"Izvoz Makedonija","3. Prepađevine"]
[327,"9","Izvoz Makedonija","MK",0,0,"Izvoz Makedonija","3. Prepađevine"]
[330,"9","Izvoz Makedonija","MK",0,0,"Izvoz Makedonija","3. Prepađevine"]
[335,"9","Izvoz Makedonija","MK",0,0,"Izvoz Makedonija","3. Prepađevine"]
[336,"9","Izvoz Makedonija","MK",0,0,"Izvoz Makedonija","3. Prepađevine"]
[337,"9","Izvoz Makedonija","MK",0,0,"Izvoz Makedonija","3. Prepađevine"]
[338,"9","Izvoz Makedonija","MK",0,0,"Izvoz Makedonija","3. Prepađevine"]
[339,"9","Izvoz Makedonija","MK",0,0,"Izvoz Makedonija","3. Prepađevine"]
[351,"9","Izvoz Makedonija","MK",0,0,"Izvoz Makedonija","3. Prepađevine"]
[352,"9","Izvoz Makedonija","MK",0,0,"Izvoz Makedonija","3. Prepađevine"]
[353,"9","Izvoz Makedonija","MK",0,0,"Izvoz Makedonija","3. Prepađevine"]
[354,"9","Izvoz Makedonija","MK",0,0,"Izvoz Makedonija","3. Prepađevine"]
[355,"9","Izvoz Makedonija","MK",0,0,"Izvoz Makedonija","3. Prepađevine"]
[356,"9","Izvoz Makedonija","MK",0,0,"Izvoz Makedonija","3. Prepađevine"]
[357,"9","Izvoz Makedonija","MK",0,0,"Izvoz Makedonija","3. Prepađevine"]
[360,"9","Izvoz Makedonija","MK",0,0,"Izvoz Makedonija","3. Prepađevine"]
[361,"9","Izvoz Makedonija","MK",0,0,"Izvoz Makedonija","3. Prepađevine"]
[362,"9","Izvoz Makedonija","MK",0,0,"Izvoz Makedonija","3. Prepađevine"]
[364,"9","Izvoz Makedonija","MK",0,0,"Izvoz Makedonija","3. Prepađevine"]
[365,"9","Izvoz Makedonija","MK",0,0,"Izvoz Makedonija","3. Prepađevine"]
[366,"9","Izvoz Makedonija","MK",0,0,"Izvoz Makedonija","3. Prepađevine"]
[367,"9","Izvoz Makedonija","MK",0,0,"Izvoz Makedonija","3. Prepađevine"]
[368,"9","Izvoz Makedonija","MK",0,0,"Izvoz Makedonija","3. Prepađevine"]
[369,"9","Izvoz Makedonija","MK",0,0,"Izvoz Makedonija","3. Prepađevine"]
[370,"9","Izvoz Makedonija","MK",0,0,"Izvoz Makedonija","3. Prepađevine"]
[371,"9","Izvoz Makedonija","MK",0,0,"Izvoz Makedonija","3. Prepađevine"]
[372,"9","Izvoz Makedonija","MK",0,0,"Izvoz Makedonija","3. Prepađevine"]
[373,"9","Izvoz Makedonija","MK",0,0,"Izvoz Makedonija","3. Prepađevine"]
[374,"9","Izvoz Makedonija","MK",0,0,"Izvoz Makedonija","3. Prepađevine"]
[375,"9","Izvoz Makedonija","MK",0,0,"Izvoz Makedonija","3. Prepađevine"]
[376,"9","Izvoz Makedonija","MK",0,0,"Izvoz Makedonija","3. Prepađevine"]
[377,"9","Izvoz Makedonija","MK",0,0,"Izvoz Makedonija","3. Prepađevine"]
[378,"9","Izvoz Makedonija","MK",0,0,"Izvoz Makedonija","3. Prepađevine"]
[401,"9","Izvoz Makedonija","MK",0,0,{"$f":"INDEX($J$1:$K$37, MATCH(B1667,$J$1:$J$37,), MATCH(\"KC\",$J$1:$K$1,))","v":"Izvoz Makedonija"},{"$f":"INDEX($L$1:$M$161, MATCH(A1667,$L$1:$L$161,), MATCH(\"GRUPA\",$L$1:$M$1,))","v":{"$error":"#N/A"}}]
[802,"9","Izvoz Makedonija","MK",0,0,"Izvoz Makedonija",{"$error":"#N/A"}]
[2050,"9","Izvoz Makedonija","MK",0,0,"Izvoz Makedonija",{"$error":"#N/A"}]
[2065,"9","Izvoz Makedonija","MK",0,0,"Izvoz Makedonija",{"$error":"#N/A"}]
[2185,"9","Izvoz Makedonija","MK",0,0,"Izvoz Makedonija",{"$error":"#N/A"}]
[2320,"9","Izvoz Makedonija","MK",0,0,"Izvoz Makedonija",{"$error":"#N/A"}]
[2330,"9","Izvoz Makedonija","MK",0,0,"Izvoz Makedonija",{"$error":"#N/A"}]
[2335,"9","Izvoz Makedonija","MK",0,0,"Izvoz Makedonija",{"$error":"#N/A"}]
[2600,"9","Izvoz Makedonija","MK",0,0,"Izvoz Makedonija",{"$error":"#N/A"}]
[2660,"9","Izvoz Makedonija","MK",0,0,"Izvoz Makedonija",{"$error":"#N/A"}]
[3049,"9","Izvoz Makedonija","MK",0,0,"Izvoz Makedonija",{"$error":"#N/A"}]
[3051,"9","Izvoz Makedonija","MK",0,0,"Izvoz Makedonija",{"$error":"#N/A"}]
[3052,"9","Izvoz Makedonija","MK",0,0,"Izvoz Makedonija",{"$error":"#N/A"}]
[3054,"9","Izvoz Makedonija","MK",0,0,"Izvoz Makedonija",{"$error":"#N/A"}]
[3055,"9","Izvoz Makedonija","MK",0,0,"Izvoz Makedonija",{"$error":"#N/A"}]
[3062,"9","Izvoz Makedonija","MK",0,0,"Izvoz Makedonija",{"$error":"#N/A"}]
[3068,"9","Izvoz Makedonija","MK",0,0,"Izvoz Makedonija",{"$error":"#N/A"}]
[3087,"9","Izvoz Makedonija","MK",0,0,"Izvoz Makedonija",{"$error":"#N/A"}]
[3092,"9","Izvoz Makedonija","MK",0,0,"Izvoz Makedonija",{"$error":"#N/A"}]
[3127,"9","Izvoz Makedonija","MK",0,0,"Izvoz Makedonija",{"$error":"#N/A"}]
[3130,"9","Izvoz Makedonija","MK",0,0,"Izvoz Makedonija",{"$error":"#N/A"}]
[3135,"9","Izvoz Makedonija","MK",0,0,"Izvoz Makedonija",{"$error":"#N/A"}]
[3154,"9","Izvoz Makedonija","MK",0,0,"Izvoz Makedonija",{"$error":"#N/A"}]
[3162,"9","Izvoz Makedonija","MK",0,0,"Izvoz Makedonija",{"$error":"#N/A"}]
[3182,"9","Izvoz Makedonija","MK",0,0,"Izvoz Makedonija",{"$error":"#N/A"}]
[3195,"9","Izvoz Makedonija","MK",0,0,"Izvoz Makedonija",{"$error":"#N/A"}]
[3196,"9","Izvoz Makedonija","MK",0,0,"Izvoz Makedonija",{"$error":"#N/A"}]
[3225,"9","Izvoz Makedonija","MK",0,0,"Izvoz Makedonija",{"$error":"#N/A"}]
[3228,"9","Izvoz Makedonija","MK",0,0,"Izvoz Makedonija",{"$error":"#N/A"}]
[3358,"9","Izvoz Makedonija","MK",0,0,"Izvoz Makedonija",{"$error":"#N/A"}]
[3395,"9","Izvoz Makedonija","MK",0,0,"Izvoz Makedonija",{"$error":"#N/A"}]
[3550,"9","Izvoz Makedonija","MK",0,0,"Izvoz Makedonija",{"$error":"#N/A"}]
[3552,"9","Izvoz Makedonija","MK",0,0,"Izvoz Makedonija",{"$error":"#N/A"}]
[3645,"9","Izvoz Makedonija","MK",0,0,"Izvoz Makedonija",{"$error":"#N/A"}]
[3648,"9","Izvoz Makedonija","MK",0,0,"Izvoz Makedonija",{"$error":"#N/A"}]
[4000,"9","Izvoz Makedonija","MK",0,0,"Izvoz Makedonija",{"$error":"#N/A"}]
[4008,"9","Izvoz Makedonija","MK",0,0,"Izvoz Makedonija",{"$error":"#N/A"}]
[4010,"9","Izvoz Makedonija","MK",0,0,"Izvoz Makedonija",{"$error":"#N/A"}]
[4018,"9","Izvoz Makedonija","MK",0,0,"Izvoz Makedonija",{"$error":"#N/A"}]
[4012,"9","Izvoz Makedonija","MK",0,0,"Izvoz Makedonija",{"$error":"#N/A"}]
[4015,"9","Izvoz Makedonija","MK",0,0,"Izvoz Makedonija",{"$error":"#N/A"}]
[4050,"9","Izvoz Makedonija","MK",0,0,"Izvoz Makedonija",{"$error":"#N/A"}]
[4060,"9","Izvoz Makedonija","MK",0,0,"Izvoz Makedonija",{"$error":"#N/A"}]
[4110,"9","Izvoz Makedonija","MK",0,0,"Izvoz Makedonija",{"$error":"#N/A"}]
[5190,"9","Izvoz Makedonija","MK",0,0,"Izvoz Makedonija",{"$error":"#N/A"}]
[5200,"9","Izvoz Makedonija","MK",0,0,"Izvoz Makedonija",{"$error":"#N/A"}]
[5221,"9","Izvoz Makedonija","MK",0,0,"Izvoz Makedonija",{"$error":"#N/A"}]
[5224,"9","Izvoz Makedonija","MK",0,0,"Izvoz Makedonija",{"$error":"#N/A"}]
[5240,"9","Izvoz Makedonija","MK",0,0,"Izvoz Makedonija",{"$error":"#N/A"}]
[5242,"9","Izvoz Makedonija","MK",0,0,"Izvoz Makedonija",{"$error":"#N/A"}]
[5243,"9","Izvoz Makedonija","MK",0,0,"Izvoz Makedonija",{"$error":"#N/A"}]
[5246,"9","Izvoz Makedonija","MK",0,0,"Izvoz Makedonija",{"$error":"#N/A"}]
[5248,"9","Izvoz Makedonija","MK",0,0,"Izvoz Makedonija",{"$error":"#N/A"}]
[5249,"9","Izvoz Makedonija","MK",0,0,"Izvoz Makedonija",{"$error":"#N/A"}]
[5251,"9","Izvoz Makedonija","MK",0,0,"Izvoz Makedonija",{"$error":"#N/A"}]
[5268,"9","Izvoz Makedonija","MK",0,0,"Izvoz Makedonija",{"$error":"#N/A"}]
[5270,"9","Izvoz Makedonija","MK",0,0,"Izvoz Makedonija",{"$error":"#N/A"}]
[5372,"9","Izvoz Makedonija","MK",0,0,"Izvoz Makedonija",{"$error":"#N/A"}]
[5373,"9","Izvoz Makedonija","MK",0,0,"Izvoz Makedonija",{"$error":"#N/A"}]
[5836,"9","Izvoz Makedonija","MK",0,0,"Izvoz Makedonija",{"$error":"#N/A"}]
[5920,"9","Izvoz Makedonija","MK",0,0,"Izvoz Makedonija",{"$error":"#N/A"}]
[5923,"9","Izvoz Makedonija","MK",0,0,"Izvoz Makedonija",{"$error":"#N/A"}]
[5924,"9","Izvoz Makedonija","MK",0,0,"Izvoz Makedonija",{"$error":"#N/A"}]
[5938,"9","Izvoz Makedonija","MK",0,0,"Izvoz Makedonija",{"$error":"#N/A"}]
[5939,"9","Izvoz Makedonija","MK",0,0,{"$f":"INDEX($J$1:$K$37, MATCH(B1731,$J$1:$J$37,), MATCH(\"KC\",$J$1:$K$1,))","v":"Izvoz Makedonija"},{"$f":"INDEX($L$1:$M$161, MATCH(A1731,$L$1:$L$161,), MATCH(\"GRUPA\",$L$1:$M$1,))","v":{"$error":"#N/A"}}]
[5941,"9","Izvoz Makedonija","MK",0,0,"Izvoz Makedonija",{"$error":"#N/A"}]
[5944,"9","Izvoz Makedonija","MK",0,0,"Izvoz Makedonija",{"$error":"#N/A"}]
[7340,"9","Izvoz Makedonija","MK",0,0,"Izvoz Makedonija",{"$error":"#N/A"}]
[7348,"9","Izvoz Makedonija","MK",0,0,"Izvoz Makedonija",{"$error":"#N/A"}]
[7342,"9","Izvoz Makedonija","MK",0,0,"Izvoz Makedonija",{"$error":"#N/A"}]
[7347,"9","Izvoz Makedonija","MK",0,0,"Izvoz Makedonija",{"$error":"#N/A"}]
[7370,"9","Izvoz Makedonija","MK",0,0,"Izvoz Makedonija",{"$error":"#N/A"}]
[7371,"9","Izvoz Makedonija","MK",0,0,"Izvoz Makedonija",{"$error":"#N/A"}]
[7372,"9","Izvoz Makedonija","MK",0,0,"Izvoz Makedonija",{"$error":"#N/A"}]
[7373,"9","Izvoz Makedonija","MK",0,0,"Izvoz Makedonija",{"$error":"#N/A"}]
[7374,"9","Izvoz Makedonija","MK",0,0,"Izvoz Makedonija",{"$error":"#N/A"}]
[7376,"9","Izvoz Makedonija","MK",0,0,"Izvoz Makedonija",{"$error":"#N/A"}]
[7377,"9","Izvoz Makedonija","MK",0,0,"Izvoz Makedonija",{"$error":"#N/A"}]
[7378,"9","Izvoz Makedonija","MK",0,0,"Izvoz Makedonija",{"$error":"#N/A"}]
[7379,"9","Izvoz Makedonija","MK",0,0,"Izvoz Makedonija",{"$error":"#N/A"}]
[7380,"9","Izvoz Makedonija","MK",0,0,"Izvoz Makedonija",{"$error":"#N/A"}]
[7497,"9","Izvoz Makedonija","MK",0,0,"Izvoz Makedonija",{"$error":"#N/A"}]
[7498,"9","Izvoz Makedonija","MK",0,0,"Izvoz Makedonija",{"$error":"#N/A"}]
[7539,"9","Izvoz Makedonija","MK",0,0,"Izvoz Makedonija",{"$error":"#N/A"}]
[7540,"9","Izvoz Makedonija","MK",0,0,"Izvoz Makedonija",{"$error":"#N/A"}]
[7546,"9","Izvoz Makedonija","MK",0,0,"Izvoz Makedonija",{"$error":"#N/A"}]
[7888,"9","Izvoz Makedonija","MK",0,0,"Izvoz Makedonija",{"$error":"#N/A"}]
[12001,"9","Izvoz Makedonija","MK",0,0,"Izvoz Makedonija",{"$error":"#N/A"}]
[12002,"9","Izvoz Makedonija","MK",0,0,"Izvoz Makedonija",{"$error":"#N/A"}]
[12005,"9","Izvoz Makedonija","MK",0,0,"Izvoz Makedonija",{"$error":"#N/A"}]
[12027,"9","Izvoz Makedonija","MK",0,0,"Izvoz Makedonija",{"$error":"#N/A"}]
[12032,"9","Izvoz Makedonija","MK",0,0,"Izvoz Makedonija",{"$error":"#N/A"}]
[12034,"9","Izvoz Makedonija","MK",0,0,"Izvoz Makedonija",{"$error":"#N/A"}]
[12035,"9","Izvoz Makedonija","MK",0,0,"Izvoz Makedonija",{"$error":"#N/A"}]
[12047,"9","Izvoz Makedonija","MK",0,0,"Izvoz Makedonija",{"$error":"#N/A"}]
[12061,"9","Izvoz Makedonija","MK",0,0,"Izvoz Makedonija",{"$error":"#N/A"}]
[12075,"9","Izvoz Makedonija","MK",0,0,"Izvoz Makedonija",{"$error":"#N/A"}]
[12080,"9","Izvoz Makedonija","MK",0,0,"Izvoz Makedonija",{"$error":"#N/A"}]
[12081,"9","Izvoz Makedonija","MK",0,0,"Izvoz Makedonija",{"$error":"#N/A"}]
[12500,"9","Izvoz Makedonija","MK",0,0,"Izvoz Makedonija",{"$error":"#N/A"}]
[12501,"9","Izvoz Makedonija","MK",0,0,"Izvoz Makedonija",{"$error":"#N/A"}]
[12503,"9","Izvoz Makedonija","MK",0,0,"Izvoz Makedonija",{"$error":"#N/A"}]
[12550,"9","Izvoz Makedonija","MK",0,0,"Izvoz Makedonija",{"$error":"#N/A"}]
[12831,"9","Izvoz Makedonija","MK",0,0,"Izvoz Makedonija",{"$error":"#N/A"}]
[12832,"9","Izvoz Makedonija","MK",0,0,"Izvoz Makedonija",{"$error":"#N/A"}]
[12833,"9","Izvoz Makedonija","MK",0,0,"Izvoz Makedonija",{"$error":"#N/A"}]
[12834,"9","Izvoz Makedonija","MK",0,0,"Izvoz Makedonija",{"$error":"#N/A"}]
[12841,"9","Izvoz Makedonija","MK",0,0,"Izvoz Makedonija",{"$error":"#N/A"}]
[12845,"9","Izvoz Makedonija","MK",0,0,"Izvoz Makedonija",{"$error":"#N/A"}]
[12851,"9","Izvoz Makedonija","MK",0,0,"Izvoz Makedonija",{"$error":"#N/A"}]
[12852,"9","Izvoz Makedonija","MK",0,0,"Izvoz Makedonija",{"$error":"#N/A"}]
[14057,"9","Izvoz Makedonija","MK",0,0,"Izvoz Makedonija",{"$error":"#N/A"}]
[14143,"9","Izvoz Makedonija","MK",0,0,"Izvoz Makedonija",{"$error":"#N/A"}]
[14144,"9","Izvoz Makedonija","MK",0,0,"Izvoz Makedonija",{"$error":"#N/A"}]
[14145,"9","Izvoz Makedonija","MK",0,0,"Izvoz Makedonija",{"$error":"#N/A"}]
[14146,"9","Izvoz Makedonija","MK",0,0,"Izvoz Makedonija",{"$error":"#N/A"}]
[14147,"9","Izvoz Makedonija","MK",0,0,"Izvoz Makedonija",{"$error":"#N/A"}]
[14150,"9","Izvoz Makedonija","MK",0,0,"Izvoz Makedonija",{"$error":"#N/A"}]
[14151,"9","Izvoz Makedonija","MK",0,0,"Izvoz Makedonija",{"$error":"#N/A"}]
[14152,"9","Izvoz Makedonija","MK",0,0,"Izvoz Makedonija",{"$error":"#N/A"}]
[14154,"9","Izvoz Makedonija","MK",0,0,"Izvoz Makedonija",{"$error":"#N/A"}]
[14156,"9","Izvoz Makedonija","MK",0,0,"Izvoz Makedonija",{"$error":"#N/A"}]
[14181,"9","Izvoz Makedonija","MK",0,0,"Izvoz Makedonija",{"$error":"#N/A"}]
[14182,"9","Izvoz Makedonija","MK",0,0,"Izvoz Makedonija",{"$error":"#N/A"}]
[14210,"9","Izvoz Makedonija","MK",0,0,"Izvoz Makedonija",{"$error":"#N/A"}]
[14211,"9","Izvoz Makedonija","MK",0,0,"Izvoz Makedonija",{"$error":"#N/A"}]
[14212,"9","Izvoz Makedonija","MK",0,0,"Izvoz Makedonija",{"$error":"#N/A"}]
[40252,"9","Izvoz Makedonija","MK",0,0,"Izvoz Makedonija",{"$error":"#N/A"}]
[40302,"9","Izvoz Makedonija","MK",0,0,{"$f":"INDEX($J$1:$K$37, MATCH(B1795,$J$1:$J$37,), MATCH(\"KC\",$J$1:$K$1,))","v":"Izvoz Makedonija"},{"$f":"INDEX($L$1:$M$161, MATCH(A1795,$L$1:$L$161,), MATCH(\"GRUPA\",$L$1:$M$1,))","v":{"$error":"#N/A"}}]
[40402,"9","Izvoz Makedonija","MK",0,0,"Izvoz Makedonija",{"$error":"#N/A"}]
[40502,"9","Izvoz Makedonija","MK",0,0,"Izvoz Makedonija",{"$error":"#N/A"}]
[40700,"9","Izvoz Makedonija","MK",0,0,"Izvoz Makedonija",{"$error":"#N/A"}]
[40701,"9","Izvoz Makedonija","MK",0,0,"Izvoz Makedonija",{"$error":"#N/A"}]
[43217,"9","Izvoz Makedonija","MK",0,0,"Izvoz Makedonija",{"$error":"#N/A"}]
[43250,"9","Izvoz Makedonija","MK",0,0,"Izvoz Makedonija",{"$error":"#N/A"}]
[43400,"9","Izvoz Makedonija","MK",0,0,"Izvoz Makedonija",{"$error":"#N/A"}]
[43500,"9","Izvoz Makedonija","MK",0,0,"Izvoz Makedonija",{"$error":"#N/A"}]
[43900,"9","Izvoz Makedonija","MK",0,0,"Izvoz Makedonija",{"$error":"#N/A"}]
[43905,"9","Izvoz Makedonija","MK",0,0,"Izvoz Makedonija",{"$error":"#N/A"}]
[43906,"9","Izvoz Makedonija","MK",0,0,"Izvoz Makedonija",{"$error":"#N/A"}]
[43910,"9","Izvoz Makedonija","MK",0,0,"Izvoz Makedonija",{"$error":"#N/A"}]
[1,"3","Niš","NN",0,0,"Niš","1. Sveži proizvodi"]
[2,"3","Niš","NN",0,0,"Niš","1. Sveži proizvodi"]
[3,"3","Niš","NN",0,0,"Niš","1. Sveži proizvodi"]
[4,"3","Niš","NN",0,0,"Niš","1. Sveži proizvodi"]
[5,"3","Niš","NN",0,0,"Niš","1. Sveži proizvodi"]
[6,"3","Niš","NN",0,0,"Niš","1. Sveži proizvodi"]
[7,"3","Niš","NN",0,0,"Niš","1. Sveži proizvodi"]
[8,"3","Niš","NN",0,0,"Niš","1. Sveži proizvodi"]
[9,"3","Niš","NN",0,0,"Niš","1. Sveži proizvodi"]
[10,"3","Niš","NN",0,0,"Niš","1. Sveži proizvodi"]
[11,"3","Niš","NN",0,0,"Niš","1. Sveži proizvodi"]
[12,"3","Niš","NN",0,0,"Niš","1. Sveži proizvodi"]
[13,"3","Niš","NN",0,0,"Niš","1. Sveži proizvodi"]
[14,"3","Niš","NN",0,0,"Niš","1. Sveži proizvodi"]
[15,"3","Niš","NN",0,0,"Niš","1. Sveži proizvodi"]
[16,"3","Niš","NN",0,0,"Niš","1. Sveži proizvodi"]
[17,"3","Niš","NN",0,0,"Niš","1. Sveži proizvodi"]
[18,"3","Niš","NN",0,0,"Niš","1. Sveži proizvodi"]
[19,"3","Niš","NN",0,0,"Niš","1. Sveži proizvodi"]
[20,"3","Niš","NN",0,0,"Niš","1. Sveži proizvodi"]
[21,"3","Niš","NN",0,0,"Niš","1. Sveži proizvodi"]
[22,"3","Niš","NN",0,0,"Niš","1. Sveži proizvodi"]
[23,"3","Niš","NN",0,0,"Niš","1. Sveži proizvodi"]
[24,"3","Niš","NN",0,0,"Niš","1. Sveži proizvodi"]
[25,"3","Niš","NN",0,0,"Niš","1. Sveži proizvodi"]
[26,"3","Niš","NN",0,0,"Niš","1. Sveži proizvodi"]
[27,"3","Niš","NN",0,0,"Niš","1. Sveži proizvodi"]
[28,"3","Niš","NN",0,0,"Niš","1. Sveži proizvodi"]
[29,"3","Niš","NN",0,0,"Niš","1. Sveži proizvodi"]
[30,"3","Niš","NN",0,0,"Niš","1. Sveži proizvodi"]
[31,"3","Niš","NN",0,0,"Niš","1. Sveži proizvodi"]
[32,"3","Niš","NN",0,0,"Niš","1. Sveži proizvodi"]
[33,"3","Niš","NN",0,0,"Niš","1. Sveži proizvodi"]
[34,"3","Niš","NN",0,0,"Niš","1. Sveži proizvodi"]
[37,"3","Niš","NN",0,0,"Niš","1. Sveži proizvodi"]
[38,"3","Niš","NN",0,0,"Niš","1. Sveži proizvodi"]
[39,"3","Niš","NN",0,0,"Niš","1. Sveži proizvodi"]
[40,"3","Niš","NN",0,0,"Niš","1. Sveži proizvodi"]
[41,"3","Niš","NN",0,0,"Niš","1. Sveži proizvodi"]
[42,"3","Niš","NN",0,0,"Niš","1. Sveži proizvodi"]
[43,"3","Niš","NN",0,0,"Niš","1. Sveži proizvodi"]
[44,"3","Niš","NN",0,0,"Niš","1. Sveži proizvodi"]
[45,"3","Niš","NN",0,0,"Niš","1. Sveži proizvodi"]
[46,"3","Niš","NN",0,0,"Niš","1. Sveži proizvodi"]
[47,"3","Niš","NN",0,0,"Niš","1. Sveži proizvodi"]
[48,"3","Niš","NN",0,0,"Niš","1. Sveži proizvodi"]
[49,"3","Niš","NN",0,0,"Niš","1. Sveži proizvodi"]
[50,"3","Niš","NN",0,0,"Niš","1. Sveži proizvodi"]
[51,"3","Niš","NN",0,0,"Niš","1. Sveži proizvodi"]
[52,"3","Niš","NN",0,0,"Niš","1. Sveži proizvodi"]
[53,"3","Niš","NN",0,0,"Niš","1. Sveži proizvodi"]
[54,"3","Niš","NN",0,0,{"$f":"INDEX($J$1:$K$37, MATCH(B1859,$J$1:$J$37,), MATCH(\"KC\",$J$1:$K$1,))","v":"Niš"},{"$f":"INDEX($L$1:$M$161, MATCH(A1859,$L$1:$L$161,), MATCH(\"GRUPA\",$L$1:$M$1,))","v":"1. Sveži proizvodi"}]
[55,"3","Niš","NN",0,0,"Niš","1. Sveži proizvodi"]
[56,"3","Niš","NN",0,0,"Niš","1. Sveži proizvodi"]
[57,"3","Niš","NN",0,0,"Niš","1. Sveži proizvodi"]
[58,"3","Niš","NN",0,0,"Niš","1. Sveži proizvodi"]
[59,"3","Niš","NN",0,0,"Niš","1. Sveži proizvodi"]
[61,"3","Niš","NN",0,0,"Niš","1. Sveži proizvodi"]
[62,"3","Niš","NN",0,0,"Niš","1. Sveži proizvodi"]
[63,"3","Niš","NN",0,0,"Niš","1. Sveži proizvodi"]
[64,"3","Niš","NN",0,0,"Niš","1. Sveži proizvodi"]
[65,"3","Niš","NN",0,0,"Niš","1. Sveži proizvodi"]
[66,"3","Niš","NN",0,0,"Niš","1. Sveži proizvodi"]
[67,"3","Niš","NN",0,0,"Niš","1. Sveži proizvodi"]
[68,"3","Niš","NN",0,0,"Niš","1. Sveži proizvodi"]
[69,"3","Niš","NN",0,0,"Niš","1. Sveži proizvodi"]
[71,"3","Niš","NN",0,0,"Niš","1. Sveži proizvodi"]
[72,"3","Niš","NN",0,0,"Niš","1. Sveži proizvodi"]
[73,"3","Niš","NN",0,0,"Niš","1. Sveži proizvodi"]
[74,"3","Niš","NN",0,0,"Niš","1. Sveži proizvodi"]
[75,"3","Niš","NN",0,0,"Niš","1. Sveži proizvodi"]
[76,"3","Niš","NN",0,0,"Niš","1. Sveži proizvodi"]
[77,"3","Niš","NN",0,0,"Niš","1. Sveži proizvodi"]
[78,"3","Niš","NN",0,0,"Niš","1. Sveži proizvodi"]
[80,"3","Niš","NN",0,0,"Niš","1. Sveži proizvodi"]
[82,"3","Niš","NN",0,0,"Niš","1. Sveži proizvodi"]
[89,"3","Niš","NN",0,0,"Niš","1. Sveži proizvodi"]
[90,"3","Niš","NN",0,0,"Niš","1. Sveži proizvodi"]
[92,"3","Niš","NN",0,0,"Niš","1. Sveži proizvodi"]
[93,"3","Niš","NN",0,0,"Niš","1. Sveži proizvodi"]
[94,"3","Niš","NN",0,0,"Niš","1. Sveži proizvodi"]
[95,"3","Niš","NN",0,0,"Niš","1. Sveži proizvodi"]
[96,"3","Niš","NN",0,0,"Niš","1. Sveži proizvodi"]
[97,"3","Niš","NN",0,0,"Niš","1. Sveži proizvodi"]
[98,"3","Niš","NN",0,0,"Niš","1. Sveži proizvodi"]
[99,"3","Niš","NN",0,0,"Niš","1. Sveži proizvodi"]
[151,"3","Niš","NN",0,0,"Niš","2. Smrznuti proizvodi"]
[152,"3","Niš","NN",0,0,"Niš","2. Smrznuti proizvodi"]
[153,"3","Niš","NN",0,0,"Niš","2. Smrznuti proizvodi"]
[154,"3","Niš","NN",0,0,"Niš","2. Smrznuti proizvodi"]
[155,"3","Niš","NN",0,0,"Niš","2. Smrznuti proizvodi"]
[156,"3","Niš","NN",0,0,"Niš","2. Smrznuti proizvodi"]
[157,"3","Niš","NN",0,0,"Niš","2. Smrznuti proizvodi"]
[158,"3","Niš","NN",0,0,"Niš","2. Smrznuti proizvodi"]
[159,"3","Niš","NN",0,0,"Niš","2. Smrznuti proizvodi"]
[160,"3","Niš","NN",0,0,"Niš","2. Smrznuti proizvodi"]
[161,"3","Niš","NN",0,0,"Niš","2. Smrznuti proizvodi"]
[162,"3","Niš","NN",0,0,"Niš","2. Smrznuti proizvodi"]
[163,"3","Niš","NN",0,0,"Niš","2. Smrznuti proizvodi"]
[164,"3","Niš","NN",0,0,"Niš","2. Smrznuti proizvodi"]
[165,"3","Niš","NN",0,0,"Niš","2. Smrznuti proizvodi"]
[166,"3","Niš","NN",0,0,"Niš","2. Smrznuti proizvodi"]
[171,"3","Niš","NN",0,0,"Niš","2. Smrznuti proizvodi"]
[172,"3","Niš","NN",0,0,"Niš","2. Smrznuti proizvodi"]
[301,"3","Niš","NN",0,0,"Niš","3. Prepađevine"]
[302,"3","Niš","NN",0,0,"Niš","3. Prepađevine"]
[303,"3","Niš","NN",0,0,"Niš","3. Prepađevine"]
[304,"3","Niš","NN",0,0,"Niš","3. Prepađevine"]
[305,"3","Niš","NN",0,0,"Niš","3. Prepađevine"]
[306,"3","Niš","NN",0,0,"Niš","3. Prepađevine"]
[307,"3","Niš","NN",0,0,"Niš","3. Prepađevine"]
[308,"3","Niš","NN",0,0,"Niš","3. Prepađevine"]
[309,"3","Niš","NN",0,0,"Niš","3. Prepađevine"]
[310,"3","Niš","NN",0,0,"Niš","3. Prepađevine"]
[311,"3","Niš","NN",0,0,"Niš","3. Prepađevine"]
[312,"3","Niš","NN",0,0,{"$f":"INDEX($J$1:$K$37, MATCH(B1923,$J$1:$J$37,), MATCH(\"KC\",$J$1:$K$1,))","v":"Niš"},{"$f":"INDEX($L$1:$M$161, MATCH(A1923,$L$1:$L$161,), MATCH(\"GRUPA\",$L$1:$M$1,))","v":"3. Prepađevine"}]
[313,"3","Niš","NN",0,0,"Niš","3. Prepađevine"]
[314,"3","Niš","NN",0,0,"Niš","3. Prepađevine"]
[315,"3","Niš","NN",0,0,"Niš","3. Prepađevine"]
[316,"3","Niš","NN",0,0,"Niš","3. Prepađevine"]
[317,"3","Niš","NN",0,0,"Niš","3. Prepađevine"]
[318,"3","Niš","NN",0,0,"Niš","3. Prepađevine"]
[319,"3","Niš","NN",0,0,"Niš","3. Prepađevine"]
[321,"3","Niš","NN",0,0,"Niš","3. Prepađevine"]
[322,"3","Niš","NN",0,0,"Niš","3. Prepađevine"]
[323,"3","Niš","NN",0,0,"Niš","3. Prepađevine"]
[324,"3","Niš","NN",0,0,"Niš","3. Prepađevine"]
[326,"3","Niš","NN",0,0,"Niš","3. Prepađevine"]
[327,"3","Niš","NN",0,0,"Niš","3. Prepađevine"]
[330,"3","Niš","NN",0,0,"Niš","3. Prepađevine"]
[335,"3","Niš","NN",0,0,"Niš","3. Prepađevine"]
[336,"3","Niš","NN",0,0,"Niš","3. Prepađevine"]
[337,"3","Niš","NN",0,0,"Niš","3. Prepađevine"]
[338,"3","Niš","NN",0,0,"Niš","3. Prepađevine"]
[339,"3","Niš","NN",0,0,"Niš","3. Prepađevine"]
[351,"3","Niš","NN",0,0,"Niš","3. Prepađevine"]
[352,"3","Niš","NN",0,0,"Niš","3. Prepađevine"]
[353,"3","Niš","NN",0,0,"Niš","3. Prepađevine"]
[354,"3","Niš","NN",0,0,"Niš","3. Prepađevine"]
[355,"3","Niš","NN",0,0,"Niš","3. Prepađevine"]
[356,"3","Niš","NN",0,0,"Niš","3. Prepađevine"]
[357,"3","Niš","NN",0,0,"Niš","3. Prepađevine"]
[360,"3","Niš","NN",0,0,"Niš","3. Prepađevine"]
[361,"3","Niš","NN",0,0,"Niš","3. Prepađevine"]
[362,"3","Niš","NN",0,0,"Niš","3. Prepađevine"]
[364,"3","Niš","NN",0,0,"Niš","3. Prepađevine"]
[365,"3","Niš","NN",0,0,"Niš","3. Prepađevine"]
[366,"3","Niš","NN",0,0,"Niš","3. Prepađevine"]
[367,"3","Niš","NN",0,0,"Niš","3. Prepađevine"]
[368,"3","Niš","NN",0,0,"Niš","3. Prepađevine"]
[369,"3","Niš","NN",0,0,"Niš","3. Prepađevine"]
[370,"3","Niš","NN",0,0,"Niš","3. Prepađevine"]
[371,"3","Niš","NN",0,0,"Niš","3. Prepađevine"]
[372,"3","Niš","NN",0,0,"Niš","3. Prepađevine"]
[373,"3","Niš","NN",0,0,"Niš","3. Prepađevine"]
[374,"3","Niš","NN",0,0,"Niš","3. Prepađevine"]
[375,"3","Niš","NN",0,0,"Niš","3. Prepađevine"]
[376,"3","Niš","NN",0,0,"Niš","3. Prepađevine"]
[377,"3","Niš","NN",0,0,"Niš","3. Prepađevine"]
[378,"3","Niš","NN",0,0,"Niš","3. Prepađevine"]
[401,"3","Niš","NN",0,0,"Niš",{"$error":"#N/A"}]
[802,"3","Niš","NN",0,0,"Niš",{"$error":"#N/A"}]
[2050,"3","Niš","NN",0,0,"Niš",{"$error":"#N/A"}]
[2065,"3","Niš","NN",0,0,"Niš",{"$error":"#N/A"}]
[2185,"3","Niš","NN",0,0,"Niš",{"$error":"#N/A"}]
[2320,"3","Niš","NN",0,0,"Niš",{"$error":"#N/A"}]
[2330,"3","Niš","NN",0,0,"Niš",{"$error":"#N/A"}]
[2335,"3","Niš","NN",0,0,"Niš",{"$error":"#N/A"}]
[2600,"3","Niš","NN",0,0,"Niš",{"$error":"#N/A"}]
[2660,"3","Niš","NN",0,0,"Niš",{"$error":"#N/A"}]
[3049,"3","Niš","NN",0,0,"Niš",{"$error":"#N/A"}]
[3051,"3","Niš","NN",0,0,"Niš",{"$error":"#N/A"}]
[3052,"3","Niš","NN",0,0,"Niš",{"$error":"#N/A"}]
[3054,"3","Niš","NN",0,0,"Niš",{"$error":"#N/A"}]
[3055,"3","Niš","NN",0,0,"Niš",{"$error":"#N/A"}]
[3062,"3","Niš","NN",0,0,"Niš",{"$error":"#N/A"}]
[3068,"3","Niš","NN",0,0,"Niš",{"$error":"#N/A"}]
[3087,"3","Niš","NN",0,0,"Niš",{"$error":"#N/A"}]
[3092,"3","Niš","NN",0,0,"Niš",{"$error":"#N/A"}]
[3127,"3","Niš","NN",0,0,{"$f":"INDEX($J$1:$K$37, MATCH(B1987,$J$1:$J$37,), MATCH(\"KC\",$J$1:$K$1,))","v":"Niš"},{"$f":"INDEX($L$1:$M$161, MATCH(A1987,$L$1:$L$161,), MATCH(\"GRUPA\",$L$1:$M$1,))","v":{"$error":"#N/A"}}]
[3130,"3","Niš","NN",0,0,"Niš",{"$error":"#N/A"}]
[3135,"3","Niš","NN",0,0,"Niš",{"$error":"#N/A"}]
[3154,"3","Niš","NN",0,0,"Niš",{"$error":"#N/A"}]
[3162,"3","Niš","NN",0,0,"Niš",{"$error":"#N/A"}]
[3182,"3","Niš","NN",0,0,"Niš",{"$error":"#N/A"}]
[3195,"3","Niš","NN",0,0,"Niš",{"$error":"#N/A"}]
[3196,"3","Niš","NN",0,0,"Niš",{"$error":"#N/A"}]
[3225,"3","Niš","NN",0,0,"Niš",{"$error":"#N/A"}]
[3228,"3","Niš","NN",0,0,"Niš",{"$error":"#N/A"}]
[3358,"3","Niš","NN",0,0,"Niš",{"$error":"#N/A"}]
[3395,"3","Niš","NN",0,0,"Niš",{"$error":"#N/A"}]
[3550,"3","Niš","NN",0,0,"Niš",{"$error":"#N/A"}]
[3552,"3","Niš","NN",0,0,"Niš",{"$error":"#N/A"}]
[3645,"3","Niš","NN",0,0,"Niš",{"$error":"#N/A"}]
[3648,"3","Niš","NN",0,0,"Niš",{"$error":"#N/A"}]
[4000,"3","Niš","NN",0,0,"Niš",{"$error":"#N/A"}]
[4008,"3","Niš","NN",0,0,"Niš",{"$error":"#N/A"}]
[4010,"3","Niš","NN",0,0,"Niš",{"$error":"#N/A"}]
[4018,"3","Niš","NN",0,0,"Niš",{"$error":"#N/A"}]
[4012,"3","Niš","NN",0,0,"Niš",{"$error":"#N/A"}]
[4015,"3","Niš","NN",0,0,"Niš",{"$error":"#N/A"}]
[4050,"3","Niš","NN",0,0,"Niš",{"$error":"#N/A"}]
[4060,"3","Niš","NN",0,0,"Niš",{"$error":"#N/A"}]
[4110,"3","Niš","NN",0,0,"Niš",{"$error":"#N/A"}]
[5190,"3","Niš","NN",0,0,"Niš",{"$error":"#N/A"}]
[5200,"3","Niš","NN",0,0,"Niš",{"$error":"#N/A"}]
[5221,"3","Niš","NN",0,0,"Niš",{"$error":"#N/A"}]
[5224,"3","Niš","NN",0,0,"Niš",{"$error":"#N/A"}]
[5240,"3","Niš","NN",0,0,"Niš",{"$error":"#N/A"}]
[5242,"3","Niš","NN",0,0,"Niš",{"$error":"#N/A"}]
[5243,"3","Niš","NN",0,0,"Niš",{"$error":"#N/A"}]
[5246,"3","Niš","NN",0,0,"Niš",{"$error":"#N/A"}]
[5248,"3","Niš","NN",0,0,"Niš",{"$error":"#N/A"}]
[5249,"3","Niš","NN",0,0,"Niš",{"$error":"#N/A"}]
[5251,"3","Niš","NN",0,0,"Niš",{"$error":"#N/A"}]
[5268,"3","Niš","NN",0,0,"Niš",{"$error":"#N/A"}]
[5270,"3","Niš","NN",0,0,"Niš",{"$error":"#N/A"}]
[5372,"3","Niš","NN",0,0,"Niš",{"$error":"#N/A"}]
[5373,"3","Niš","NN",0,0,"Niš",{"$error":"#N/A"}]
[5836,"3","Niš","NN",0,0,"Niš",{"$error":"#N/A"}]
[5920,"3","Niš","NN",0,0,"Niš",{"$error":"#N/A"}]
[5923,"3","Niš","NN",0,0,"Niš",{"$error":"#N/A"}]
[5924,"3","Niš","NN",0,0,"Niš",{"$error":"#N/A"}]
[5938,"3","Niš","NN",0,0,"Niš",{"$error":"#N/A"}]
[5939,"3","Niš","NN",0,0,"Niš",{"$error":"#N/A"}]
[5941,"3","Niš","NN",0,0,"Niš",{"$error":"#N/A"}]
[5944,"3","Niš","NN",0,0,"Niš",{"$error":"#N/A"}]
[7340,"3","Niš","NN",0,0,"Niš",{"$error":"#N/A"}]
[7348,"3","Niš","NN",0,0,"Niš",{"$error":"#N/A"}]
[7342,"3","Niš","NN",0,0,"Niš",{"$error":"#N/A"}]
[7347,"3","Niš","NN",0,0,"Niš",{"$error":"#N/A"}]
[7370,"3","Niš","NN",0,0,"Niš",{"$error":"#N/A"}]
[7371,"3","Niš","NN",0,0,"Niš",{"$error":"#N/A"}]
[7372,"3","Niš","NN",0,0,"Niš",{"$error":"#N/A"}]
[7373,"3","Niš","NN",0,0,"Niš",{"$error":"#N/A"}]
[7374,"3","Niš","NN",0,0,"Niš",{"$error":"#N/A"}]
[7376,"3","Niš","NN",0,0,"Niš",{"$error":"#N/A"}]
[7377,"3","Niš","NN",0,0,"Niš",{"$error":"#N/A"}]
[7378,"3","Niš","NN",0,0,"Niš",{"$error":"#N/A"}]
[7379,"3","Niš","NN",0,0,"Niš",{"$error":"#N/A"}]
[7380,"3","Niš","NN",0,0,"Niš",{"$error":"#N/A"}]
[7497,"3","Niš","NN",0,0,"Niš",{"$error":"#N/A"}]
[7498,"3","Niš","NN",0,0,"Niš",{"$error":"#N/A"}]
[7539,"3","Niš","NN",0,0,{"$f":"INDEX($J$1:$K$37, MATCH(B2051,$J$1:$J$37,), MATCH(\"KC\",$J$1:$K$1,))","v":"Niš"},{"$f":"INDEX($L$1:$M$161, MATCH(A2051,$L$1:$L$161,), MATCH(\"GRUPA\",$L$1:$M$1,))","v":{"$error":"#N/A"}}]
[7540,"3","Niš","NN",0,0,"Niš",{"$error":"#N/A"}]
[7546,"3","Niš","NN",0,0,"Niš",{"$error":"#N/A"}]
[7888,"3","Niš","NN",0,0,"Niš",{"$error":"#N/A"}]
[12001,"3","Niš","NN",0,0,"Niš",{"$error":"#N/A"}]
[12002,"3","Niš","NN",0,0,"Niš",{"$error":"#N/A"}]
[12005,"3","Niš","NN",0,0,"Niš",{"$error":"#N/A"}]
[12027,"3","Niš","NN",0,0,"Niš",{"$error":"#N/A"}]
[12032,"3","Niš","NN",0,0,"Niš",{"$error":"#N/A"}]
[12034,"3","Niš","NN",0,0,"Niš",{"$error":"#N/A"}]
[12035,"3","Niš","NN",0,0,"Niš",{"$error":"#N/A"}]
[12047,"3","Niš","NN",0,0,"Niš",{"$error":"#N/A"}]
[12061,"3","Niš","NN",0,0,"Niš",{"$error":"#N/A"}]
[12075,"3","Niš","NN",0,0,"Niš",{"$error":"#N/A"}]
[12080,"3","Niš","NN",0,0,"Niš",{"$error":"#N/A"}]
[12081,"3","Niš","NN",0,0,"Niš",{"$error":"#N/A"}]
[12500,"3","Niš","NN",0,0,"Niš",{"$error":"#N/A"}]
[12501,"3","Niš","NN",0,0,"Niš",{"$error":"#N/A"}]
[12503,"3","Niš","NN",0,0,"Niš",{"$error":"#N/A"}]
[12550,"3","Niš","NN",0,0,"Niš",{"$error":"#N/A"}]
[12831,"3","Niš","NN",0,0,"Niš",{"$error":"#N/A"}]
[12832,"3","Niš","NN",0,0,"Niš",{"$error":"#N/A"}]
[12833,"3","Niš","NN",0,0,"Niš",{"$error":"#N/A"}]
[12834,"3","Niš","NN",0,0,"Niš",{"$error":"#N/A"}]
[12841,"3","Niš","NN",0,0,"Niš",{"$error":"#N/A"}]
[12845,"3","Niš","NN",0,0,"Niš",{"$error":"#N/A"}]
[12851,"3","Niš","NN",0,0,"Niš",{"$error":"#N/A"}]
[12852,"3","Niš","NN",0,0,"Niš",{"$error":"#N/A"}]
[14057,"3","Niš","NN",0,0,"Niš",{"$error":"#N/A"}]
[14143,"3","Niš","NN",0,0,"Niš",{"$error":"#N/A"}]
[14144,"3","Niš","NN",0,0,"Niš",{"$error":"#N/A"}]
[14145,"3","Niš","NN",0,0,"Niš",{"$error":"#N/A"}]
[14146,"3","Niš","NN",0,0,"Niš",{"$error":"#N/A"}]
[14147,"3","Niš","NN",0,0,"Niš",{"$error":"#N/A"}]
[14150,"3","Niš","NN",0,0,"Niš",{"$error":"#N/A"}]
[14151,"3","Niš","NN",0,0,"Niš",{"$error":"#N/A"}]
[14152,"3","Niš","NN",0,0,"Niš",{"$error":"#N/A"}]
[14154,"3","Niš","NN",0,0,"Niš",{"$error":"#N/A"}]
[14156,"3","Niš","NN",0,0,"Niš",{"$error":"#N/A"}]
[14181,"3","Niš","NN",0,0,"Niš",{"$error":"#N/A"}]
[14182,"3","Niš","NN",0,0,"Niš",{"$error":"#N/A"}]
[14210,"3","Niš","NN",0,0,"Niš",{"$error":"#N/A"}]
[14211,"3","Niš","NN",0,0,"Niš",{"$error":"#N/A"}]
[14212,"3","Niš","NN",0,0,"Niš",{"$error":"#N/A"}]
[40252,"3","Niš","NN",0,0,"Niš",{"$error":"#N/A"}]
[40302,"3","Niš","NN",0,0,"Niš",{"$error":"#N/A"}]
[40402,"3","Niš","NN",0,0,"Niš",{"$error":"#N/A"}]
[40502,"3","Niš","NN",0,0,"Niš",{"$error":"#N/A"}]
[40700,"3","Niš","NN",0,0,"Niš",{"$error":"#N/A"}]
[40701,"3","Niš","NN",0,0,"Niš",{"$error":"#N/A"}]
[43217,"3","Niš","NN",0,0,"Niš",{"$error":"#N/A"}]
[43250,"3","Niš","NN",0,0,"Niš",{"$error":"#N/A"}]
[43400,"3","Niš","NN",0,0,"Niš",{"$error":"#N/A"}]
[43500,"3","Niš","NN",0,0,"Niš",{"$error":"#N/A"}]
[43900,"3","Niš","NN",0,0,"Niš",{"$error":"#N/A"}]
[43905,"3","Niš","NN",0,0,"Niš",{"$error":"#N/A"}]
[43906,"3","Niš","NN",0,0,"Niš",{"$error":"#N/A"}]
[43910,"3","Niš","NN",0,0,{"$f":"INDEX($J$1:$K$37, MATCH(B2108,$J$1:$J$37,), MATCH(\"KC\",$J$1:$K$1,))","v":"Niš"},{"$error":"#N/A"}]

{"sheet":"KUMULATIV","index":3,"n_rows":124,"n_cols":26,"rows_kept":124,"cut":false,"hidden":false,"merged":[]}
[null,null,null,null,"COPY ",null,null,null,null,null,null,null,null,"PASTE",null,null,null,null,null,null,null,null,"DNEVNI PLAN"]
[]
[null,null,null,null,"DNEVNA PRODAJA KUMULATIV",null,null,null,"PLAN KUMULATIV",null,null,null,null,"DNEVNA PRODAJA DO DANA",null,null,null,"PLAN",null,null,null,null,"DNEVNI PLAN"]
["KC","RB","PR/P","KUPAC","1. Sveži proizvodi","2. Smrznuti proizvodi","3. Prepađevine","Grand Total","1. Sveži proizvodi","2. Smrznuti proizvodi","3. Prepađevine","Grand Total",null,"1. Sveži proizvodi","2. Smrznuti proizvodi","3. Prepađevine","Grand Total","1. Sveži proizvodi","2. Smrznuti proizvodi","3. Prepađevine","Grand Total",null,"1. Sveži proizvodi","2. Smrznuti proizvodi","3. Prepađevine","Grand Total"]
[{"$f":"PRORAČUNI!A3","v":{"$error":"#REF!"}},1,"PR",{"$f":"PRORAČUNI!B3","v":{"$error":"#REF!"}},{"$f":"IFERROR(+N5+PRORAČUNI!L3,0)","v":14981.998999999998},{"$f":"IFERROR(+O5+PRORAČUNI!M3,0)","v":0},{"$f":"IFERROR(+P5+PRORAČUNI!N3,0)","v":281.80799999999999},{"$f":"IFERROR(+Q5+PRORAČUNI!O3,0)","v":15263.806999999999},{"$f":"IFERROR(+R5+PRORAČUNI!P3,0)","v":0},{"$f":"IFERROR(+S5+PRORAČUNI!Q3,0)","v":0},{"$f":"IFERROR(+T5+PRORAČUNI!R3,0)","v":0},{"$f":"IFERROR(+U5+PRORAČUNI!S3,0)","v":0},null,14981.998999999998,0,281.80799999999999,15263.806999999999,12423.969928926093,0,1764.1053367922643,14188.075265718358,null,{"$f":"$Z5*PRORAČUNI!H3","v":{"$error":"#REF!"}},{"$f":"$Z5*PRORAČUNI!I3","v":{"$error":"#REF!"}},{"$f":"$Z5*PRORAČUNI!J3","v":{"$error":"#REF!"}},{"$f":"'PLAN UNOSA'!$B$38*PRORAČUNI!K3","v":{"$error":"#REF!"}}]
[{"$f":"$A$5","v":{"$error":"#REF!"}},2,"PR",{"$f":"PRORAČUNI!B4","v":{"$error":"#REF!"}},{"$f":"IFERROR(+N6+PRORAČUNI!L4,0)","v":8777.5840000000007},{"$f":"IFERROR(+O6+PRORAČUNI!M4,0)","v":0},{"$f":"IFERROR(+P6+PRORAČUNI!N4,0)","v":1250.0730000000001},{"$f":"IFERROR(+Q6+PRORAČUNI!O4,0)","v":10027.657000000001},{"$f":"IFERROR(+R6+PRORAČUNI!P4,0)","v":0},{"$f":"IFERROR(+S6+PRORAČUNI!Q4,0)","v":0},{"$f":"IFERROR(+T6+PRORAČUNI!R4,0)","v":0},{"$f":"IFERROR(+U6+PRORAČUNI!S4,0)","v":0},null,8777.5840000000007,0,1250.0730000000001,10027.657000000001,7672.8424000071309,0,106.99447842357634,7779.8368784307067,null,{"$f":"$Z6*PRORAČUNI!H4","v":{"$error":"#REF!"}},{"$f":"$Z6*PRORAČUNI!I4","v":{"$error":"#REF!"}},{"$f":"$Z6*PRORAČUNI!J4","v":{"$error":"#REF!"}},{"$f":"'PLAN UNOSA'!$B$38*PRORAČUNI!K4","v":{"$error":"#REF!"}}]
[{"$f":"$A$5","v":{"$error":"#REF!"}},3,"PR",{"$f":"PRORAČUNI!B5","v":{"$error":"#REF!"}},{"$f":"IFERROR(+N7+PRORAČUNI!L5,0)","v":2999.9170000000004},{"$f":"IFERROR(+O7+PRORAČUNI!M5,0)","v":27.402999999999999},{"$f":"IFERROR(+P7+PRORAČUNI!N5,0)","v":530.49},{"$f":"IFERROR(+Q7+PRORAČUNI!O5,0)","v":3557.8100000000004},{"$f":"IFERROR(+R7+PRORAČUNI!P5,0)","v":0},{"$f":"IFERROR(+S7+PRORAČUNI!Q5,0)","v":0},{"$f":"IFERROR(+T7+PRORAČUNI!R5,0)","v":0},{"$f":"IFERROR(+U7+PRORAČUNI!S5,0)","v":0},null,2999.9170000000004,27.402999999999999,530.49,3557.8100000000004,4252.6540877511452,90.632274029150935,885.82330720453285,5229.1096689848291,null,{"$f":"$Z7*PRORAČUNI!H5","v":{"$error":"#REF!"}},{"$f":"$Z7*PRORAČUNI!I5","v":{"$error":"#REF!"}},{"$f":"$Z7*PRORAČUNI!J5","v":{"$error":"#REF!"}},{"$f":"'PLAN UNOSA'!$B$38*PRORAČUNI!K5","v":{"$error":"#REF!"}}]
[{"$error":"#REF!"},4,"PR",{"$f":"PRORAČUNI!B6","v":{"$error":"#REF!"}},{"$f":"IFERROR(+N8+PRORAČUNI!L6,0)","v":4341.2139999999999},{"$f":"IFERROR(+O8+PRORAČUNI!M6,0)","v":0},{"$f":"IFERROR(+P8+PRORAČUNI!N6,0)","v":0},{"$f":"IFERROR(+Q8+PRORAČUNI!O6,0)","v":4341.2139999999999},{"$f":"IFERROR(+R8+PRORAČUNI!P6,0)","v":0},{"$f":"IFERROR(+S8+PRORAČUNI!Q6,0)","v":0},{"$f":"IFERROR(+T8+PRORAČUNI!R6,0)","v":0},{"$f":"IFERROR(+U8+PRORAČUNI!S6,0)","v":0},null,4341.2139999999999,0,0,4341.2139999999999,4057.2685103665603,0,0,4057.2685103665603,null,{"$f":"$Z8*PRORAČUNI!H6","v":{"$error":"#REF!"}},{"$f":"$Z8*PRORAČUNI!I6","v":{"$error":"#REF!"}},{"$f":"$Z8*PRORAČUNI!J6","v":{"$error":"#REF!"}},{"$f":"'PLAN UNOSA'!$B$38*PRORAČUNI!K6","v":{"$error":"#REF!"}}]
[{"$error":"#REF!"},5,"PR",{"$f":"PRORAČUNI!B7","v":{"$error":"#REF!"}},{"$f":"IFERROR(+N9+PRORAČUNI!L7,0)","v":1162.277},{"$f":"IFERROR(+O9+PRORAČUNI!M7,0)","v":0},{"$f":"IFERROR(+P9+PRORAČUNI!N7,0)","v":260.5},{"$f":"IFERROR(+Q9+PRORAČUNI!O7,0)","v":1422.777},{"$f":"IFERROR(+R9+PRORAČUNI!P7,0)","v":0},{"$f":"IFERROR(+S9+PRORAČUNI!Q7,0)","v":0},{"$f":"IFERROR(+T9+PRORAČUNI!R7,0)","v":0},{"$f":"IFERROR(+U9+PRORAČUNI!S7,0)","v":0},null,1162.277,0,260.5,1422.777,3114.4133153467674,38.249604682527142,619.78736935187703,3772.4502893811705,null,{"$f":"$Z9*PRORAČUNI!H7","v":{"$error":"#REF!"}},{"$f":"$Z9*PRORAČUNI!I7","v":{"$error":"#REF!"}},{"$f":"$Z9*PRORAČUNI!J7","v":{"$error":"#REF!"}},{"$f":"'PLAN UNOSA'!$B$38*PRORAČUNI!K7","v":{"$error":"#REF!"}}]
[{"$error":"#REF!"},6,"PR",{"$f":"PRORAČUNI!B8","v":{"$error":"#REF!"}},{"$f":"IFERROR(+N10+PRORAČUNI!L8,0)","v":3121.5989999999997},{"$f":"IFERROR(+O10+PRORAČUNI!M8,0)","v":0},{"$f":"IFERROR(+P10+PRORAČUNI!N8,0)","v":441.65},{"$f":"IFERROR(+Q10+PRORAČUNI!O8,0)","v":3563.2489999999998},{"$f":"IFERROR(+R10+PRORAČUNI!P8,0)","v":0},{"$f":"IFERROR(+S10+PRORAČUNI!Q8,0)","v":0},{"$f":"IFERROR(+T10+PRORAČUNI!R8,0)","v":0},{"$f":"IFERROR(+U10+PRORAČUNI!S8,0)","v":0},null,3121.5989999999997,0,441.65,3563.2489999999998,2683.3188997180878,0,269.55903903742023,2952.8779387555082,null,{"$f":"$Z10*PRORAČUNI!H8","v":{"$error":"#REF!"}},{"$f":"$Z10*PRORAČUNI!I8","v":{"$error":"#REF!"}},{"$f":"$Z10*PRORAČUNI!J8","v":{"$error":"#REF!"}},{"$f":"'PLAN UNOSA'!$B$38*PRORAČUNI!K8","v":{"$error":"#REF!"}}]
[{"$error":"#REF!"},7,"PR",{"$f":"PRORAČUNI!B9","v":{"$error":"#REF!"}},{"$f":"IFERROR(+N11+PRORAČUNI!L9,0)","v":115.361},{"$f":"IFERROR(+O11+PRORAČUNI!M9,0)","v":0},{"$f":"IFERROR(+P11+PRORAČUNI!N9,0)","v":1604.8389999999999},{"$f":"IFERROR(+Q11+PRORAČUNI!O9,0)","v":1720.2000000000003},{"$f":"IFERROR(+R11+PRORAČUNI!P9,0)","v":0},{"$f":"IFERROR(+S11+PRORAČUNI!Q9,0)","v":0},{"$f":"IFERROR(+T11+PRORAČUNI!R9,0)","v":0},{"$f":"IFERROR(+U11+PRORAČUNI!S9,0)","v":0},null,115.361,0,1604.8389999999999,1720.2000000000003,1817.6785287440248,0,832.17985490230444,2649.8583836463295,null,{"$f":"$Z11*PRORAČUNI!H9","v":{"$error":"#REF!"}},{"$f":"$Z11*PRORAČUNI!I9","v":{"$error":"#REF!"}},{"$f":"$Z11*PRORAČUNI!J9","v":{"$error":"#REF!"}},{"$f":"'PLAN UNOSA'!$B$38*PRORAČUNI!K9","v":{"$error":"#REF!"}}]
[{"$error":"#REF!"},8,"PR",{"$f":"PRORAČUNI!B10","v":{"$error":"#REF!"}},{"$f":"IFERROR(+N12+PRORAČUNI!L10,0)","v":1530.9209999999998},{"$f":"IFERROR(+O12+PRORAČUNI!M10,0)","v":0},{"$f":"IFERROR(+P12+PRORAČUNI!N10,0)","v":13.285},{"$f":"IFERROR(+Q12+PRORAČUNI!O10,0)","v":1544.2059999999999},{"$f":"IFERROR(+R12+PRORAČUNI!P10,0)","v":0},{"$f":"IFERROR(+S12+PRORAČUNI!Q10,0)","v":0},{"$f":"IFERROR(+T12+PRORAČUNI!R10,0)","v":0},{"$f":"IFERROR(+U12+PRORAČUNI!S10,0)","v":0},null,1530.9209999999998,0,13.285,1544.2059999999999,1849.6795161465839,0,20.06453452876098,1869.7440506753453,null,{"$f":"$Z12*PRORAČUNI!H10","v":{"$error":"#REF!"}},{"$f":"$Z12*PRORAČUNI!I10","v":{"$error":"#REF!"}},{"$f":"$Z12*PRORAČUNI!J10","v":{"$error":"#REF!"}},{"$f":"'PLAN UNOSA'!$B$38*PRORAČUNI!K10","v":{"$error":"#REF!"}}]
[{"$error":"#REF!"},9,"PR",{"$f":"PRORAČUNI!B11","v":{"$error":"#REF!"}},{"$f":"IFERROR(+N13+PRORAČUNI!L11,0)","v":0},{"$f":"IFERROR(+O13+PRORAČUNI!M11,0)","v":1012.7210000000001},{"$f":"IFERROR(+P13+PRORAČUNI!N11,0)","v":0},{"$f":"IFERROR(+Q13+PRORAČUNI!O11,0)","v":1012.7210000000001},{"$f":"IFERROR(+R13+PRORAČUNI!P11,0)","v":0},{"$f":"IFERROR(+S13+PRORAČUNI!Q11,0)","v":0},{"$f":"IFERROR(+T13+PRORAČUNI!R11,0)","v":0},{"$f":"IFERROR(+U13+PRORAČUNI!S11,0)","v":0},null,0,1012.7210000000001,0,1012.7210000000001,0,1062.2119170521785,0,1062.2119170521785,null,{"$f":"$Z13*PRORAČUNI!H11","v":{"$error":"#REF!"}},{"$f":"$Z13*PRORAČUNI!I11","v":{"$error":"#REF!"}},{"$f":"$Z13*PRORAČUNI!J11","v":{"$error":"#REF!"}},{"$f":"'PLAN UNOSA'!$B$38*PRORAČUNI!K11","v":{"$error":"#REF!"}}]
[{"$error":"#REF!"},10,"PR",{"$f":"PRORAČUNI!B12","v":{"$error":"#REF!"}},{"$f":"IFERROR(+N14+PRORAČUNI!L12,0)","v":322.24099999999999},{"$f":"IFERROR(+O14+PRORAČUNI!M12,0)","v":0},{"$f":"IFERROR(+P14+PRORAČUNI!N12,0)","v":13},{"$f":"IFERROR(+Q14+PRORAČUNI!O12,0)","v":335.24099999999999},{"$f":"IFERROR(+R14+PRORAČUNI!P12,0)","v":0},{"$f":"IFERROR(+S14+PRORAČUNI!Q12,0)","v":0},{"$f":"IFERROR(+T14+PRORAČUNI!R12,0)","v":0},{"$f":"IFERROR(+U14+PRORAČUNI!S12,0)","v":0},null,322.24099999999999,0,13,335.24099999999999,986.51809948229322,0,0,986.51809948229322,null,{"$f":"$Z14*PRORAČUNI!H12","v":{"$error":"#REF!"}},{"$f":"$Z14*PRORAČUNI!I12","v":{"$error":"#REF!"}},{"$f":"$Z14*PRORAČUNI!J12","v":{"$error":"#REF!"}},{"$f":"'PLAN UNOSA'!$B$38*PRORAČUNI!K12","v":{"$error":"#REF!"}}]
[{"$error":"#REF!"},11,"PR",{"$f":"PRORAČUNI!B13","v":{"$error":"#REF!"}},{"$f":"IFERROR(+N15+PRORAČUNI!L13,0)","v":0},{"$f":"IFERROR(+O15+PRORAČUNI!M13,0)","v":169.79500000000002},{"$f":"IFERROR(+P15+PRORAČUNI!N13,0)","v":390.63499999999999},{"$f":"IFERROR(+Q15+PRORAČUNI!O13,0)","v":560.43000000000006},{"$f":"IFERROR(+R15+PRORAČUNI!P13,0)","v":0},{"$f":"IFERROR(+S15+PRORAČUNI!Q13,0)","v":0},{"$f":"IFERROR(+T15+PRORAČUNI!R13,0)","v":0},{"$f":"IFERROR(+U15+PRORAČUNI!S13,0)","v":0},null,0,169.79500000000002,390.63499999999999,560.43000000000006,0,154.11900626417872,473.67186273234154,627.79086899652009,null,{"$f":"$Z15*PRORAČUNI!H13","v":{"$error":"#REF!"}},{"$f":"$Z15*PRORAČUNI!I13","v":{"$error":"#REF!"}},{"$f":"$Z15*PRORAČUNI!J13","v":{"$error":"#REF!"}},{"$f":"'PLAN UNOSA'!$B$38*PRORAČUNI!K13","v":{"$error":"#REF!"}}]
[{"$error":"#REF!"},12,"PR",{"$f":"PRORAČUNI!B14","v":{"$error":"#REF!"}},{"$f":"IFERROR(+N16+PRORAČUNI!L14,0)","v":0},{"$f":"IFERROR(+O16+PRORAČUNI!M14,0)","v":0},{"$f":"IFERROR(+P16+PRORAČUNI!N14,0)","v":0},{"$f":"IFERROR(+Q16+PRORAČUNI!O14,0)","v":0},{"$f":"IFERROR(+R16+PRORAČUNI!P14,0)","v":0},{"$f":"IFERROR(+S16+PRORAČUNI!Q14,0)","v":0},{"$f":"IFERROR(+T16+PRORAČUNI!R14,0)","v":0},{"$f":"IFERROR(+U16+PRORAČUNI!S14,0)","v":0},null,0,0,0,0,283.27639662791989,175.11774323063185,125.53735591768415,583.93149577623581,null,{"$f":"$Z16*PRORAČUNI!H14","v":{"$error":"#REF!"}},{"$f":"$Z16*PRORAČUNI!I14","v":{"$error":"#REF!"}},{"$f":"$Z16*PRORAČUNI!J14","v":{"$error":"#REF!"}},{"$f":"'PLAN UNOSA'!$B$38*PRORAČUNI!K14","v":{"$error":"#REF!"}}]
[{"$error":"#REF!"},13,"PR",{"$f":"PRORAČUNI!B15","v":{"$error":"#REF!"}},{"$f":"IFERROR(+N17+PRORAČUNI!L15,0)","v":451.24299999999999},{"$f":"IFERROR(+O17+PRORAČUNI!M15,0)","v":476.60799999999995},{"$f":"IFERROR(+P17+PRORAČUNI!N15,0)","v":111.786},{"$f":"IFERROR(+Q17+PRORAČUNI!O15,0)","v":1039.6369999999999},{"$f":"IFERROR(+R17+PRORAČUNI!P15,0)","v":0},{"$f":"IFERROR(+S17+PRORAČUNI!Q15,0)","v":0},{"$f":"IFERROR(+T17+PRORAČUNI!R15,0)","v":0},{"$f":"IFERROR(+U17+PRORAČUNI!S15,0)","v":0},null,451.24299999999999,476.60799999999995,111.786,1039.6369999999999,196.02149861219419,285.39364024454181,59.233378796565979,540.64851765330206,null,{"$f":"$Z17*PRORAČUNI!H15","v":{"$error":"#REF!"}},{"$f":"$Z17*PRORAČUNI!I15","v":{"$error":"#REF!"}},{"$f":"$Z17*PRORAČUNI!J15","v":{"$error":"#REF!"}},{"$f":"'PLAN UNOSA'!$B$38*PRORAČUNI!K15","v":{"$error":"#REF!"}}]
[{"$error":"#REF!"},14,"PR",{"$f":"PRORAČUNI!B16","v":{"$error":"#REF!"}},{"$f":"IFERROR(+N18+PRORAČUNI!L16,0)","v":0},{"$f":"IFERROR(+O18+PRORAČUNI!M16,0)","v":0},{"$f":"IFERROR(+P18+PRORAČUNI!N16,0)","v":0},{"$f":"IFERROR(+Q18+PRORAČUNI!O16,0)","v":0},{"$f":"IFERROR(+R18+PRORAČUNI!P16,0)","v":0},{"$f":"IFERROR(+S18+PRORAČUNI!Q16,0)","v":0},{"$f":"IFERROR(+T18+PRORAČUNI!R16,0)","v":0},{"$f":"IFERROR(+U18+PRORAČUNI!S16,0)","v":0},null,0,0,0,0,499.27005041918704,3.6408523276768969,0,502.91090274686394,null,{"$f":"$Z18*PRORAČUNI!H16","v":{"$error":"#REF!"}},{"$f":"$Z18*PRORAČUNI!I16","v":{"$error":"#REF!"}},{"$f":"$Z18*PRORAČUNI!J16","v":{"$error":"#REF!"}},{"$f":"'PLAN UNOSA'!$B$38*PRORAČUNI!K16","v":{"$error":"#REF!"}}]
[{"$error":"#REF!"},15,"PR",{"$f":"PRORAČUNI!B17","v":{"$error":"#REF!"}},{"$f":"IFERROR(+N19+PRORAČUNI!L17,0)","v":190.82},{"$f":"IFERROR(+O19+PRORAČUNI!M17,0)","v":0},{"$f":"IFERROR(+P19+PRORAČUNI!N17,0)","v":227.61699999999996},{"$f":"IFERROR(+Q19+PRORAČUNI!O17,0)","v":418.43700000000001},{"$f":"IFERROR(+R19+PRORAČUNI!P17,0)","v":0},{"$f":"IFERROR(+S19+PRORAČUNI!Q17,0)","v":0},{"$f":"IFERROR(+T19+PRORAČUNI!R17,0)","v":0},{"$f":"IFERROR(+U19+PRORAČUNI!S17,0)","v":0},null,190.82,0,227.61699999999996,418.43700000000001,274.32796032537436,0,224.70886476378973,499.0368250891641,null,{"$f":"$Z19*PRORAČUNI!H17","v":{"$error":"#REF!"}},{"$f":"$Z19*PRORAČUNI!I17","v":{"$error":"#REF!"}},{"$f":"$Z19*PRORAČUNI!J17","v":{"$error":"#REF!"}},{"$f":"'PLAN UNOSA'!$B$38*PRORAČUNI!K17","v":{"$error":"#REF!"}}]
[{"$error":"#REF!"},16,"PR",{"$f":"PRORAČUNI!B18","v":{"$error":"#REF!"}},{"$f":"IFERROR(+N20+PRORAČUNI!L18,0)","v":122.76900000000001},{"$f":"IFERROR(+O20+PRORAČUNI!M18,0)","v":0},{"$f":"IFERROR(+P20+PRORAČUNI!N18,0)","v":158.82},{"$f":"IFERROR(+Q20+PRORAČUNI!O18,0)","v":281.589},{"$f":"IFERROR(+R20+PRORAČUNI!P18,0)","v":0},{"$f":"IFERROR(+S20+PRORAČUNI!Q18,0)","v":0},{"$f":"IFERROR(+T20+PRORAČUNI!R18,0)","v":0},{"$f":"IFERROR(+U20+PRORAČUNI!S18,0)","v":0},null,122.76900000000001,0,158.82,281.589,335.74786725082845,3.1275614339867208,101.1078971161548,439.98332580097002,null,{"$f":"$Z20*PRORAČUNI!H18","v":{"$error":"#REF!"}},{"$f":"$Z20*PRORAČUNI!I18","v":{"$error":"#REF!"}},{"$f":"$Z20*PRORAČUNI!J18","v":{"$error":"#REF!"}},{"$f":"'PLAN UNOSA'!$B$38*PRORAČUNI!K18","v":{"$error":"#REF!"}}]
[{"$error":"#REF!"},17,"PR",{"$f":"PRORAČUNI!B19","v":{"$error":"#REF!"}},{"$f":"IFERROR(+N21+PRORAČUNI!L19,0)","v":204.77599999999998},{"$f":"IFERROR(+O21+PRORAČUNI!M19,0)","v":0},{"$f":"IFERROR(+P21+PRORAČUNI!N19,0)","v":40.911000000000001},{"$f":"IFERROR(+Q21+PRORAČUNI!O19,0)","v":245.68700000000001},{"$f":"IFERROR(+R21+PRORAČUNI!P19,0)","v":0},{"$f":"IFERROR(+S21+PRORAČUNI!Q19,0)","v":0},{"$f":"IFERROR(+T21+PRORAČUNI!R19,0)","v":0},{"$f":"IFERROR(+U21+PRORAČUNI!S19,0)","v":0},null,204.77599999999998,0,40.911000000000001,245.68700000000001,323.80620990662453,0,59.945740683246257,383.75195058987077,null,{"$f":"$Z21*PRORAČUNI!H19","v":{"$error":"#REF!"}},{"$f":"$Z21*PRORAČUNI!I19","v":{"$error":"#REF!"}},{"$f":"$Z21*PRORAČUNI!J19","v":{"$error":"#REF!"}},{"$f":"'PLAN UNOSA'!$B$38*PRORAČUNI!K19","v":{"$error":"#REF!"}}]
[{"$error":"#REF!"},18,"PR",{"$f":"PRORAČUNI!B20","v":{"$error":"#REF!"}},{"$f":"IFERROR(+N22+PRORAČUNI!L20,0)","v":0},{"$f":"IFERROR(+O22+PRORAČUNI!M20,0)","v":0},{"$f":"IFERROR(+P22+PRORAČUNI!N20,0)","v":0},{"$f":"IFERROR(+Q22+PRORAČUNI!O20,0)","v":0},{"$f":"IFERROR(+R22+PRORAČUNI!P20,0)","v":0},{"$f":"IFERROR(+S22+PRORAČUNI!Q20,0)","v":0},{"$f":"IFERROR(+T22+PRORAČUNI!R20,0)","v":0},{"$f":"IFERROR(+U22+PRORAČUNI!S20,0)","v":0},null,0,0,0,0,343.14016690228783,0,0,343.14016690228783,null,{"$f":"$Z22*PRORAČUNI!H20","v":{"$error":"#REF!"}},{"$f":"$Z22*PRORAČUNI!I20","v":{"$error":"#REF!"}},{"$f":"$Z22*PRORAČUNI!J20","v":{"$error":"#REF!"}},{"$f":"'PLAN UNOSA'!$B$38*PRORAČUNI!K20","v":{"$error":"#REF!"}}]
[{"$error":"#REF!"},19,"PR",{"$f":"PRORAČUNI!B21","v":{"$error":"#REF!"}},{"$f":"IFERROR(+N23+PRORAČUNI!L21,0)","v":10.173},{"$f":"IFERROR(+O23+PRORAČUNI!M21,0)","v":0},{"$f":"IFERROR(+P23+PRORAČUNI!N21,0)","v":216.56399999999999},{"$f":"IFERROR(+Q23+PRORAČUNI!O21,0)","v":226.73699999999999},{"$f":"IFERROR(+R23+PRORAČUNI!P21,0)","v":0},{"$f":"IFERROR(+S23+PRORAČUNI!Q21,0)","v":0},{"$f":"IFERROR(+T23+PRORAČUNI!R21,0)","v":0},{"$f":"IFERROR(+U23+PRORAČUNI!S21,0)","v":0},null,10.173,0,216.56399999999999,226.73699999999999,53.604093494790213,0,279.12843371515868,332.7325272099489,null,{"$f":"$Z23*PRORAČUNI!H21","v":{"$error":"#REF!"}},{"$f":"$Z23*PRORAČUNI!I21","v":{"$error":"#REF!"}},{"$f":"$Z23*PRORAČUNI!J21","v":{"$error":"#REF!"}},{"$f":"'PLAN UNOSA'!$B$38*PRORAČUNI!K21","v":{"$error":"#REF!"}}]
[{"$error":"#REF!"},20,"PR",{"$f":"PRORAČUNI!B22","v":{"$error":"#REF!"}},{"$f":"IFERROR(+N24+PRORAČUNI!L22,0)","v":0},{"$f":"IFERROR(+O24+PRORAČUNI!M22,0)","v":0},{"$f":"IFERROR(+P24+PRORAČUNI!N22,0)","v":0},{"$f":"IFERROR(+Q24+PRORAČUNI!O22,0)","v":0},{"$f":"IFERROR(+R24+PRORAČUNI!P22,0)","v":0},{"$f":"IFERROR(+S24+PRORAČUNI!Q22,0)","v":0},{"$f":"IFERROR(+T24+PRORAČUNI!R22,0)","v":0},{"$f":"IFERROR(+U24+PRORAČUNI!S22,0)","v":0},null,0,0,0,0,303.25700907140072,0,0,303.25700907140072,null,{"$f":"$Z24*PRORAČUNI!H22","v":{"$error":"#REF!"}},{"$f":"$Z24*PRORAČUNI!I22","v":{"$error":"#REF!"}},{"$f":"$Z24*PRORAČUNI!J22","v":{"$error":"#REF!"}},{"$f":"'PLAN UNOSA'!$B$38*PRORAČUNI!K22","v":{"$error":"#REF!"}}]
[{"$f":"PRORAČUNI!A23","v":{"$error":"#REF!"}},1,"PR",{"$f":"PRORAČUNI!B23","v":{"$error":"#REF!"}},{"$f":"IFERROR(+N25+PRORAČUNI!L23,0)","v":1614.5080000000003},{"$f":"IFERROR(+O25+PRORAČUNI!M23,0)","v":11.108000000000001},{"$f":"IFERROR(+P25+PRORAČUNI!N23,0)","v":257.81},{"$f":"IFERROR(+Q25+PRORAČUNI!O23,0)","v":1883.4260000000002},{"$f":"IFERROR(+R25+PRORAČUNI!P23,0)","v":0},{"$f":"IFERROR(+S25+PRORAČUNI!Q23,0)","v":0},{"$f":"IFERROR(+T25+PRORAČUNI!R23,0)","v":0},{"$f":"IFERROR(+U25+PRORAČUNI!S23,0)","v":0},null,1614.5080000000003,11.108000000000001,257.81,1883.4260000000002,2546.0126483810568,30.742351406657491,295.83652283744954,2872.5915226251632,null,{"$f":"$Z25*PRORAČUNI!H23","v":{"$error":"#REF!"}},{"$f":"$Z25*PRORAČUNI!I23","v":{"$error":"#REF!"}},{"$f":"$Z25*PRORAČUNI!J23","v":{"$error":"#REF!"}},{"$f":"'PLAN UNOSA'!$D$38*PRORAČUNI!K23","v":{"$error":"#REF!"}}]
[{"$f":"$A$25","v":{"$error":"#REF!"}},2,"PR",{"$f":"PRORAČUNI!B24","v":{"$error":"#REF!"}},{"$f":"IFERROR(+N26+PRORAČUNI!L24,0)","v":2145.7730000000001},{"$f":"IFERROR(+O26+PRORAČUNI!M24,0)","v":0},{"$f":"IFERROR(+P26+PRORAČUNI!N24,0)","v":199.15300000000002},{"$f":"IFERROR(+Q26+PRORAČUNI!O24,0)","v":2344.9259999999995},{"$f":"IFERROR(+R26+PRORAČUNI!P24,0)","v":0},{"$f":"IFERROR(+S26+PRORAČUNI!Q24,0)","v":0},{"$f":"IFERROR(+T26+PRORAČUNI!R24,0)","v":0},{"$f":"IFERROR(+U26+PRORAČUNI!S24,0)","v":0},null,2145.7730000000001,0,199.15300000000002,2344.9259999999995,2756.2804622488261,0,8.8790398480875812,2765.1595020969139,null,{"$f":"$Z26*PRORAČUNI!H24","v":{"$error":"#REF!"}},{"$f":"$Z26*PRORAČUNI!I24","v":{"$error":"#REF!"}},{"$f":"$Z26*PRORAČUNI!J24","v":{"$error":"#REF!"}},{"$f":"'PLAN UNOSA'!$D$38*PRORAČUNI!K24","v":{"$error":"#REF!"}}]
[{"$f":"$A$25","v":{"$error":"#REF!"}},3,"PR",{"$f":"PRORAČUNI!B25","v":{"$error":"#REF!"}},{"$f":"IFERROR(+N27+PRORAČUNI!L25,0)","v":652.57400000000007},{"$f":"IFERROR(+O27+PRORAČUNI!M25,0)","v":0},{"$f":"IFERROR(+P27+PRORAČUNI!N25,0)","v":717.71100000000001},{"$f":"IFERROR(+Q27+PRORAČUNI!O25,0)","v":1370.2849999999999},{"$f":"IFERROR(+R27+PRORAČUNI!P25,0)","v":0},{"$f":"IFERROR(+S27+PRORAČUNI!Q25,0)","v":0},{"$f":"IFERROR(+T27+PRORAČUNI!R25,0)","v":0},{"$f":"IFERROR(+U27+PRORAČUNI!S25,0)","v":0},null,652.57400000000007,0,717.71100000000001,1370.2849999999999,1077.7568610215978,0,1019.4841898164863,2097.241050838084,null,{"$f":"$Z27*PRORAČUNI!H25","v":{"$error":"#REF!"}},{"$f":"$Z27*PRORAČUNI!I25","v":{"$error":"#REF!"}},{"$f":"$Z27*PRORAČUNI!J25","v":{"$error":"#REF!"}},{"$f":"'PLAN UNOSA'!$D$38*PRORAČUNI!K25","v":{"$error":"#REF!"}}]
[{"$error":"#REF!"},4,"PR",{"$f":"PRORAČUNI!B26","v":{"$error":"#REF!"}},{"$f":"IFERROR(+N28+PRORAČUNI!L26,0)","v":1041.5740000000001},{"$f":"IFERROR(+O28+PRORAČUNI!M26,0)","v":91.923999999999992},{"$f":"IFERROR(+P28+PRORAČUNI!N26,0)","v":390.85},{"$f":"IFERROR(+Q28+PRORAČUNI!O26,0)","v":1524.348},{"$f":"IFERROR(+R28+PRORAČUNI!P26,0)","v":0},{"$f":"IFERROR(+S28+PRORAČUNI!Q26,0)","v":0},{"$f":"IFERROR(+T28+PRORAČUNI!R26,0)","v":0},{"$f":"IFERROR(+U28+PRORAČUNI!S26,0)","v":0},null,1041.5740000000001,91.923999999999992,390.85,1524.348,1356.5341001761785,322.76711801458589,276.80796157985327,1956.1091797706174,null,{"$f":"$Z28*PRORAČUNI!H26","v":{"$error":"#REF!"}},{"$f":"$Z28*PRORAČUNI!I26","v":{"$error":"#REF!"}},{"$f":"$Z28*PRORAČUNI!J26","v":{"$error":"#REF!"}},{"$f":"'PLAN UNOSA'!$D$38*PRORAČUNI!K26","v":{"$error":"#REF!"}}]
[{"$error":"#REF!"},5,"PR",{"$f":"PRORAČUNI!B27","v":{"$error":"#REF!"}},{"$f":"IFERROR(+N29+PRORAČUNI!L27,0)","v":650.30700000000002},{"$f":"IFERROR(+O29+PRORAČUNI!M27,0)","v":0},{"$f":"IFERROR(+P29+PRORAČUNI!N27,0)","v":114.20100000000001},{"$f":"IFERROR(+Q29+PRORAČUNI!O27,0)","v":764.50800000000004},{"$f":"IFERROR(+R29+PRORAČUNI!P27,0)","v":0},{"$f":"IFERROR(+S29+PRORAČUNI!Q27,0)","v":0},{"$f":"IFERROR(+T29+PRORAČUNI!R27,0)","v":0},{"$f":"IFERROR(+U29+PRORAČUNI!S27,0)","v":0},null,650.30700000000002,0,114.20100000000001,764.50800000000004,1231.400701188679,23.609834273951623,72.223044760117872,1327.2335802227485,null,{"$f":"$Z29*PRORAČUNI!H27","v":{"$error":"#REF!"}},{"$f":"$Z29*PRORAČUNI!I27","v":{"$error":"#REF!"}},{"$f":"$Z29*PRORAČUNI!J27","v":{"$error":"#REF!"}},{"$f":"'PLAN UNOSA'!$D$38*PRORAČUNI!K27","v":{"$error":"#REF!"}}]
[{"$error":"#REF!"},6,"PR",{"$f":"PRORAČUNI!B28","v":{"$error":"#REF!"}},{"$f":"IFERROR(+N30+PRORAČUNI!L28,0)","v":414.00899999999996},{"$f":"IFERROR(+O30+PRORAČUNI!M28,0)","v":108.146},{"$f":"IFERROR(+P30+PRORAČUNI!N28,0)","v":349.31999999999994},{"$f":"IFERROR(+Q30+PRORAČUNI!O28,0)","v":871.47499999999991},{"$f":"IFERROR(+R30+PRORAČUNI!P28,0)","v":0},{"$f":"IFERROR(+S30+PRORAČUNI!Q28,0)","v":0},{"$f":"IFERROR(+T30+PRORAČUNI!R28,0)","v":0},{"$f":"IFERROR(+U30+PRORAČUNI!S28,0)","v":0},null,414.00899999999996,108.146,349.31999999999994,871.47499999999991,675.60084577160126,261.27711893188786,309.44855824245457,1246.3265229459439,null,{"$f":"$Z30*PRORAČUNI!H28","v":{"$error":"#REF!"}},{"$f":"$Z30*PRORAČUNI!I28","v":{"$error":"#REF!"}},{"$f":"$Z30*PRORAČUNI!J28","v":{"$error":"#REF!"}},{"$f":"'PLAN UNOSA'!$D$38*PRORAČUNI!K28","v":{"$error":"#REF!"}}]
[{"$error":"#REF!"},7,"PR",{"$f":"PRORAČUNI!B29","v":{"$error":"#REF!"}},{"$f":"IFERROR(+N31+PRORAČUNI!L29,0)","v":0},{"$f":"IFERROR(+O31+PRORAČUNI!M29,0)","v":0},{"$f":"IFERROR(+P31+PRORAČUNI!N29,0)","v":0},{"$f":"IFERROR(+Q31+PRORAČUNI!O29,0)","v":0},{"$f":"IFERROR(+R31+PRORAČUNI!P29,0)","v":0},{"$f":"IFERROR(+S31+PRORAČUNI!Q29,0)","v":0},{"$f":"IFERROR(+T31+PRORAČUNI!R29,0)","v":0},{"$f":"IFERROR(+U31+PRORAČUNI!S29,0)","v":0},null,0,0,0,0,820.38714271338438,89.839371363981485,234.74187468693466,1144.9683887643007,null,{"$f":"$Z31*PRORAČUNI!H29","v":{"$error":"#REF!"}},{"$f":"$Z31*PRORAČUNI!I29","v":{"$error":"#REF!"}},{"$f":"$Z31*PRORAČUNI!J29","v":{"$error":"#REF!"}},{"$f":"'PLAN UNOSA'!$D$38*PRORAČUNI!K29","v":{"$error":"#REF!"}}]
[{"$error":"#REF!"},8,"PR",{"$f":"PRORAČUNI!B30","v":{"$error":"#REF!"}},{"$f":"IFERROR(+N32+PRORAČUNI!L30,0)","v":73.782000000000011},{"$f":"IFERROR(+O32+PRORAČUNI!M30,0)","v":0},{"$f":"IFERROR(+P32+PRORAČUNI!N30,0)","v":35.4},{"$f":"IFERROR(+Q32+PRORAČUNI!O30,0)","v":109.18200000000002},{"$f":"IFERROR(+R32+PRORAČUNI!P30,0)","v":0},{"$f":"IFERROR(+S32+PRORAČUNI!Q30,0)","v":0},{"$f":"IFERROR(+T32+PRORAČUNI!R30,0)","v":0},{"$f":"IFERROR(+U32+PRORAČUNI!S30,0)","v":0},null,73.782000000000011,0,35.4,109.18200000000002,688.05954063212835,2.8958131715078625,40.982220940936173,731.9375747445722,null,{"$f":"$Z32*PRORAČUNI!H30","v":{"$error":"#REF!"}},{"$f":"$Z32*PRORAČUNI!I30","v":{"$error":"#REF!"}},{"$f":"$Z32*PRORAČUNI!J30","v":{"$error":"#REF!"}},{"$f":"'PLAN UNOSA'!$D$38*PRORAČUNI!K30","v":{"$error":"#REF!"}}]
[{"$error":"#REF!"},9,"PR",{"$f":"PRORAČUNI!B31","v":{"$error":"#REF!"}},{"$f":"IFERROR(+N33+PRORAČUNI!L31,0)","v":283.63599999999997},{"$f":"IFERROR(+O33+PRORAČUNI!M31,0)","v":0},{"$f":"IFERROR(+P33+PRORAČUNI!N31,0)","v":0},{"$f":"IFERROR(+Q33+PRORAČUNI!O31,0)","v":283.63599999999997},{"$f":"IFERROR(+R33+PRORAČUNI!P31,0)","v":0},{"$f":"IFERROR(+S33+PRORAČUNI!Q31,0)","v":0},{"$f":"IFERROR(+T33+PRORAČUNI!R31,0)","v":0},{"$f":"IFERROR(+U33+PRORAČUNI!S31,0)","v":0},null,283.63599999999997,0,0,283.63599999999997,552.58439681103926,0,1.869271546965807,554.45366835800507,null,{"$f":"$Z33*PRORAČUNI!H31","v":{"$error":"#REF!"}},{"$f":"$Z33*PRORAČUNI!I31","v":{"$error":"#REF!"}},{"$f":"$Z33*PRORAČUNI!J31","v":{"$error":"#REF!"}},{"$f":"'PLAN UNOSA'!$D$38*PRORAČUNI!K31","v":{"$error":"#REF!"}}]
[{"$error":"#REF!"},10,"PR",{"$f":"PRORAČUNI!B32","v":{"$error":"#REF!"}},{"$f":"IFERROR(+N34+PRORAČUNI!L32,0)","v":97.596999999999994},{"$f":"IFERROR(+O34+PRORAČUNI!M32,0)","v":0},{"$f":"IFERROR(+P34+PRORAČUNI!N32,0)","v":70.704999999999998},{"$f":"IFERROR(+Q34+PRORAČUNI!O32,0)","v":168.30199999999999},{"$f":"IFERROR(+R34+PRORAČUNI!P32,0)","v":0},{"$f":"IFERROR(+S34+PRORAČUNI!Q32,0)","v":0},{"$f":"IFERROR(+T34+PRORAČUNI!R32,0)","v":0},{"$f":"IFERROR(+U34+PRORAČUNI!S32,0)","v":0},null,97.596999999999994,0,70.704999999999998,168.30199999999999,430.46862519085681,0,100.34187355060887,530.81049874146572,null,{"$f":"$Z34*PRORAČUNI!H32","v":{"$error":"#REF!"}},{"$f":"$Z34*PRORAČUNI!I32","v":{"$error":"#REF!"}},{"$f":"$Z34*PRORAČUNI!J32","v":{"$error":"#REF!"}},{"$f":"'PLAN UNOSA'!$D$38*PRORAČUNI!K32","v":{"$error":"#REF!"}}]
[{"$error":"#REF!"},11,"PR",{"$f":"PRORAČUNI!B33","v":{"$error":"#REF!"}},{"$f":"IFERROR(+N35+PRORAČUNI!L33,0)","v":297.77999999999997},{"$f":"IFERROR(+O35+PRORAČUNI!M33,0)","v":0},{"$f":"IFERROR(+P35+PRORAČUNI!N33,0)","v":43.5},{"$f":"IFERROR(+Q35+PRORAČUNI!O33,0)","v":341.28},{"$f":"IFERROR(+R35+PRORAČUNI!P33,0)","v":0},{"$f":"IFERROR(+S35+PRORAČUNI!Q33,0)","v":0},{"$f":"IFERROR(+T35+PRORAČUNI!R33,0)","v":0},{"$f":"IFERROR(+U35+PRORAČUNI!S33,0)","v":0},null,297.77999999999997,0,43.5,341.28,377.96390288916569,0,149.74048963175855,527.70439252092422,null,{"$f":"$Z35*PRORAČUNI!H33","v":{"$error":"#REF!"}},{"$f":"$Z35*PRORAČUNI!I33","v":{"$error":"#REF!"}},{"$f":"$Z35*PRORAČUNI!J33","v":{"$error":"#REF!"}},{"$f":"'PLAN UNOSA'!$D$38*PRORAČUNI!K33","v":{"$error":"#REF!"}}]
[{"$error":"#REF!"},12,"PR",{"$f":"PRORAČUNI!B34","v":{"$error":"#REF!"}},{"$f":"IFERROR(+N36+PRORAČUNI!L34,0)","v":190.89700000000002},{"$f":"IFERROR(+O36+PRORAČUNI!M34,0)","v":0},{"$f":"IFERROR(+P36+PRORAČUNI!N34,0)","v":11.25},{"$f":"IFERROR(+Q36+PRORAČUNI!O34,0)","v":202.14700000000002},{"$f":"IFERROR(+R36+PRORAČUNI!P34,0)","v":0},{"$f":"IFERROR(+S36+PRORAČUNI!Q34,0)","v":0},{"$f":"IFERROR(+T36+PRORAČUNI!R34,0)","v":0},{"$f":"IFERROR(+U36+PRORAČUNI!S34,0)","v":0},null,190.89700000000002,0,11.25,202.14700000000002,349.40735301142689,54.86561226550905,21.886054362391324,426.15901963932731,null,{"$f":"$Z36*PRORAČUNI!H34","v":{"$error":"#REF!"}},{"$f":"$Z36*PRORAČUNI!I34","v":{"$error":"#REF!"}},{"$f":"$Z36*PRORAČUNI!J34","v":{"$error":"#REF!"}},{"$f":"'PLAN UNOSA'!$D$38*PRORAČUNI!K34","v":{"$error":"#REF!"}}]
[{"$error":"#REF!"},13,"PR",{"$f":"PRORAČUNI!B35","v":{"$error":"#REF!"}},{"$f":"IFERROR(+N37+PRORAČUNI!L35,0)","v":18.081},{"$f":"IFERROR(+O37+PRORAČUNI!M35,0)","v":0},{"$f":"IFERROR(+P37+PRORAČUNI!N35,0)","v":0},{"$f":"IFERROR(+Q37+PRORAČUNI!O35,0)","v":18.081},{"$f":"IFERROR(+R37+PRORAČUNI!P35,0)","v":0},{"$f":"IFERROR(+S37+PRORAČUNI!Q35,0)","v":0},{"$f":"IFERROR(+T37+PRORAČUNI!R35,0)","v":0},{"$f":"IFERROR(+U37+PRORAČUNI!S35,0)","v":0},null,18.081,0,0,18.081,359.28769931817249,0,21.64086824448097,380.92856756265348,null,{"$f":"$Z37*PRORAČUNI!H35","v":{"$error":"#REF!"}},{"$f":"$Z37*PRORAČUNI!I35","v":{"$error":"#REF!"}},{"$f":"$Z37*PRORAČUNI!J35","v":{"$error":"#REF!"}},{"$f":"'PLAN UNOSA'!$D$38*PRORAČUNI!K35","v":{"$error":"#REF!"}}]
[{"$error":"#REF!"},14,"PR",{"$f":"PRORAČUNI!B36","v":{"$error":"#REF!"}},{"$f":"IFERROR(+N38+PRORAČUNI!L36,0)","v":93.894999999999996},{"$f":"IFERROR(+O38+PRORAČUNI!M36,0)","v":24.317999999999998},{"$f":"IFERROR(+P38+PRORAČUNI!N36,0)","v":92.361000000000004},{"$f":"IFERROR(+Q38+PRORAČUNI!O36,0)","v":210.57400000000001},{"$f":"IFERROR(+R38+PRORAČUNI!P36,0)","v":0},{"$f":"IFERROR(+S38+PRORAČUNI!Q36,0)","v":0},{"$f":"IFERROR(+T38+PRORAČUNI!R36,0)","v":0},{"$f":"IFERROR(+U38+PRORAČUNI!S36,0)","v":0},null,93.894999999999996,24.317999999999998,92.361000000000004,210.57400000000001,224.87118628318174,63.345562638319443,81.526097704108864,369.74284662561007,null,{"$f":"$Z38*PRORAČUNI!H36","v":{"$error":"#REF!"}},{"$f":"$Z38*PRORAČUNI!I36","v":{"$error":"#REF!"}},{"$f":"$Z38*PRORAČUNI!J36","v":{"$error":"#REF!"}},{"$f":"'PLAN UNOSA'!$D$38*PRORAČUNI!K36","v":{"$error":"#REF!"}}]
[{"$error":"#REF!"},15,"PR",{"$f":"PRORAČUNI!B37","v":{"$error":"#REF!"}},{"$f":"IFERROR(+N39+PRORAČUNI!L37,0)","v":0},{"$f":"IFERROR(+O39+PRORAČUNI!M37,0)","v":0},{"$f":"IFERROR(+P39+PRORAČUNI!N37,0)","v":0},{"$f":"IFERROR(+Q39+PRORAČUNI!O37,0)","v":0},{"$f":"IFERROR(+R39+PRORAČUNI!P37,0)","v":0},{"$f":"IFERROR(+S39+PRORAČUNI!Q37,0)","v":0},{"$f":"IFERROR(+T39+PRORAČUNI!R37,0)","v":0},{"$f":"IFERROR(+U39+PRORAČUNI!S37,0)","v":0},null,0,0,0,0,118.13422322514505,58.058328067726634,191.87293566459437,368.06548695746608,null,{"$f":"$Z39*PRORAČUNI!H37","v":{"$error":"#REF!"}},{"$f":"$Z39*PRORAČUNI!I37","v":{"$error":"#REF!"}},{"$f":"$Z39*PRORAČUNI!J37","v":{"$error":"#REF!"}},{"$f":"'PLAN UNOSA'!$D$38*PRORAČUNI!K37","v":{"$error":"#REF!"}}]
[{"$error":"#REF!"},16,"PR",{"$f":"PRORAČUNI!B38","v":{"$error":"#REF!"}},{"$f":"IFERROR(+N40+PRORAČUNI!L38,0)","v":0},{"$f":"IFERROR(+O40+PRORAČUNI!M38,0)","v":0},{"$f":"IFERROR(+P40+PRORAČUNI!N38,0)","v":0},{"$f":"IFERROR(+Q40+PRORAČUNI!O38,0)","v":0},{"$f":"IFERROR(+R40+PRORAČUNI!P38,0)","v":0},{"$f":"IFERROR(+S40+PRORAČUNI!Q38,0)","v":0},{"$f":"IFERROR(+T40+PRORAČUNI!R38,0)","v":0},{"$f":"IFERROR(+U40+PRORAČUNI!S38,0)","v":0},null,0,0,0,0,353.47706871442932,7.6718019740054988,3.5983477279091778,364.74721841634403,null,{"$f":"$Z40*PRORAČUNI!H38","v":{"$error":"#REF!"}},{"$f":"$Z40*PRORAČUNI!I38","v":{"$error":"#REF!"}},{"$f":"$Z40*PRORAČUNI!J38","v":{"$error":"#REF!"}},{"$f":"'PLAN UNOSA'!$D$38*PRORAČUNI!K38","v":{"$error":"#REF!"}}]
[{"$error":"#REF!"},17,"PR",{"$f":"PRORAČUNI!B39","v":{"$error":"#REF!"}},{"$f":"IFERROR(+N41+PRORAČUNI!L39,0)","v":217.595},{"$f":"IFERROR(+O41+PRORAČUNI!M39,0)","v":123.068},{"$f":"IFERROR(+P41+PRORAČUNI!N39,0)","v":0},{"$f":"IFERROR(+Q41+PRORAČUNI!O39,0)","v":340.66300000000001},{"$f":"IFERROR(+R41+PRORAČUNI!P39,0)","v":0},{"$f":"IFERROR(+S41+PRORAČUNI!Q39,0)","v":0},{"$f":"IFERROR(+T41+PRORAČUNI!R39,0)","v":0},{"$f":"IFERROR(+U41+PRORAČUNI!S39,0)","v":0},null,217.595,123.068,0,340.66300000000001,205.14071355969983,125.96397864486917,0,331.10469220456901,null,{"$f":"$Z41*PRORAČUNI!H39","v":{"$error":"#REF!"}},{"$f":"$Z41*PRORAČUNI!I39","v":{"$error":"#REF!"}},{"$f":"$Z41*PRORAČUNI!J39","v":{"$error":"#REF!"}},{"$f":"'PLAN UNOSA'!$D$38*PRORAČUNI!K39","v":{"$error":"#REF!"}}]
[{"$error":"#REF!"},18,"PR",{"$f":"PRORAČUNI!B40","v":{"$error":"#REF!"}},{"$f":"IFERROR(+N42+PRORAČUNI!L40,0)","v":0},{"$f":"IFERROR(+O42+PRORAČUNI!M40,0)","v":0},{"$f":"IFERROR(+P42+PRORAČUNI!N40,0)","v":0},{"$f":"IFERROR(+Q42+PRORAČUNI!O40,0)","v":0},{"$f":"IFERROR(+R42+PRORAČUNI!P40,0)","v":0},{"$f":"IFERROR(+S42+PRORAČUNI!Q40,0)","v":0},{"$f":"IFERROR(+T42+PRORAČUNI!R40,0)","v":0},{"$f":"IFERROR(+U42+PRORAČUNI!S40,0)","v":0},null,0,0,0,0,236.91552595079804,0,73.431840360489105,310.34736631128715,null,{"$f":"$Z42*PRORAČUNI!H40","v":{"$error":"#REF!"}},{"$f":"$Z42*PRORAČUNI!I40","v":{"$error":"#REF!"}},{"$f":"$Z42*PRORAČUNI!J40","v":{"$error":"#REF!"}},{"$f":"'PLAN UNOSA'!$D$38*PRORAČUNI!K40","v":{"$error":"#REF!"}}]
[{"$error":"#REF!"},19,"PR",{"$f":"PRORAČUNI!B41","v":{"$error":"#REF!"}},{"$f":"IFERROR(+N43+PRORAČUNI!L41,0)","v":18.712},{"$f":"IFERROR(+O43+PRORAČUNI!M41,0)","v":13.376000000000001},{"$f":"IFERROR(+P43+PRORAČUNI!N41,0)","v":65.194000000000003},{"$f":"IFERROR(+Q43+PRORAČUNI!O41,0)","v":97.282000000000011},{"$f":"IFERROR(+R43+PRORAČUNI!P41,0)","v":0},{"$f":"IFERROR(+S43+PRORAČUNI!Q41,0)","v":0},{"$f":"IFERROR(+T43+PRORAČUNI!R41,0)","v":0},{"$f":"IFERROR(+U43+PRORAČUNI!S41,0)","v":0},null,18.712,13.376000000000001,65.194000000000003,97.282000000000011,171.629970991986,36.017124166937165,81.911167642783866,289.55826280170703,null,{"$f":"$Z43*PRORAČUNI!H41","v":{"$error":"#REF!"}},{"$f":"$Z43*PRORAČUNI!I41","v":{"$error":"#REF!"}},{"$f":"$Z43*PRORAČUNI!J41","v":{"$error":"#REF!"}},{"$f":"'PLAN UNOSA'!$D$38*PRORAČUNI!K41","v":{"$error":"#REF!"}}]
[{"$error":"#REF!"},20,"PR",{"$f":"PRORAČUNI!B42","v":{"$error":"#REF!"}},{"$f":"IFERROR(+N44+PRORAČUNI!L42,0)","v":6.1520000000000001},{"$f":"IFERROR(+O44+PRORAČUNI!M42,0)","v":149.04000000000002},{"$f":"IFERROR(+P44+PRORAČUNI!N42,0)","v":42},{"$f":"IFERROR(+Q44+PRORAČUNI!O42,0)","v":197.19200000000001},{"$f":"IFERROR(+R44+PRORAČUNI!P42,0)","v":0},{"$f":"IFERROR(+S44+PRORAČUNI!Q42,0)","v":0},{"$f":"IFERROR(+T44+PRORAČUNI!R42,0)","v":0},{"$f":"IFERROR(+U44+PRORAČUNI!S42,0)","v":0},null,6.1520000000000001,149.04000000000002,42,197.19200000000001,3.2609442136818498,237.05945985991448,37.525626305338569,277.84603037893493,null,{"$f":"$Z44*PRORAČUNI!H42","v":{"$error":"#REF!"}},{"$f":"$Z44*PRORAČUNI!I42","v":{"$error":"#REF!"}},{"$f":"$Z44*PRORAČUNI!J42","v":{"$error":"#REF!"}},{"$f":"'PLAN UNOSA'!$D$38*PRORAČUNI!K42","v":{"$error":"#REF!"}}]
[{"$f":"PRORAČUNI!A43","v":{"$error":"#REF!"}},1,"PR",{"$f":"PRORAČUNI!B43","v":{"$error":"#REF!"}},{"$f":"IFERROR(+N45+PRORAČUNI!L43,0)","v":173.83700000000002},{"$f":"IFERROR(+O45+PRORAČUNI!M43,0)","v":60},{"$f":"IFERROR(+P45+PRORAČUNI!N43,0)","v":474.298},{"$f":"IFERROR(+Q45+PRORAČUNI!O43,0)","v":708.13499999999988},{"$f":"IFERROR(+R45+PRORAČUNI!P43,0)","v":0},{"$f":"IFERROR(+S45+PRORAČUNI!Q43,0)","v":0},{"$f":"IFERROR(+T45+PRORAČUNI!R43,0)","v":0},{"$f":"IFERROR(+U45+PRORAČUNI!S43,0)","v":0},null,173.83700000000002,60,474.298,708.13499999999988,4553.8868039804856,128.89191601821179,2134.5301418920312,6817.3088618907295,null,{"$f":"$Z45*PRORAČUNI!H43","v":{"$error":"#REF!"}},{"$f":"$Z45*PRORAČUNI!I43","v":{"$error":"#REF!"}},{"$f":"$Z45*PRORAČUNI!J43","v":{"$error":"#REF!"}},{"$f":"'PLAN UNOSA'!$F$38*PRORAČUNI!K43","v":{"$error":"#REF!"}}]
[{"$f":"$A$45","v":{"$error":"#REF!"}},2,"PR",{"$f":"PRORAČUNI!B44","v":{"$error":"#REF!"}},{"$f":"IFERROR(+N46+PRORAČUNI!L44,0)","v":1327.643},{"$f":"IFERROR(+O46+PRORAČUNI!M44,0)","v":0},{"$f":"IFERROR(+P46+PRORAČUNI!N44,0)","v":323.41000000000003},{"$f":"IFERROR(+Q46+PRORAČUNI!O44,0)","v":1651.0530000000001},{"$f":"IFERROR(+R46+PRORAČUNI!P44,0)","v":0},{"$f":"IFERROR(+S46+PRORAČUNI!Q44,0)","v":0},{"$f":"IFERROR(+T46+PRORAČUNI!R44,0)","v":0},{"$f":"IFERROR(+U46+PRORAČUNI!S44,0)","v":0},null,1327.643,0,323.41000000000003,1651.0530000000001,6176.4909104382987,0,166.5762401125638,6343.0671505508608,null,{"$f":"$Z46*PRORAČUNI!H44","v":{"$error":"#REF!"}},{"$f":"$Z46*PRORAČUNI!I44","v":{"$error":"#REF!"}},{"$f":"$Z46*PRORAČUNI!J44","v":{"$error":"#REF!"}},{"$f":"'PLAN UNOSA'!$F$38*PRORAČUNI!K44","v":{"$error":"#REF!"}}]
[{"$f":"$A$45","v":{"$error":"#REF!"}},3,"PR",{"$f":"PRORAČUNI!B45","v":{"$error":"#REF!"}},{"$f":"IFERROR(+N47+PRORAČUNI!L45,0)","v":9453.68},{"$f":"IFERROR(+O47+PRORAČUNI!M45,0)","v":0},{"$f":"IFERROR(+P47+PRORAČUNI!N45,0)","v":0},{"$f":"IFERROR(+Q47+PRORAČUNI!O45,0)","v":9453.68},{"$f":"IFERROR(+R47+PRORAČUNI!P45,0)","v":0},{"$f":"IFERROR(+S47+PRORAČUNI!Q45,0)","v":0},{"$f":"IFERROR(+T47+PRORAČUNI!R45,0)","v":0},{"$f":"IFERROR(+U47+PRORAČUNI!S45,0)","v":0},null,9453.68,0,0,9453.68,5601.7690128176673,0,0,5601.7690128176673,null,{"$f":"$Z47*PRORAČUNI!H45","v":{"$error":"#REF!"}},{"$f":"$Z47*PRORAČUNI!I45","v":{"$error":"#REF!"}},{"$f":"$Z47*PRORAČUNI!J45","v":{"$error":"#REF!"}},{"$f":"'PLAN UNOSA'!$F$38*PRORAČUNI!K45","v":{"$error":"#REF!"}}]
[{"$error":"#REF!"},4,"PR",{"$f":"PRORAČUNI!B46","v":{"$error":"#REF!"}},{"$f":"IFERROR(+N48+PRORAČUNI!L46,0)","v":28.513000000000002},{"$f":"IFERROR(+O48+PRORAČUNI!M46,0)","v":146.69799999999998},{"$f":"IFERROR(+P48+PRORAČUNI!N46,0)","v":1262.9189999999996},{"$f":"IFERROR(+Q48+PRORAČUNI!O46,0)","v":1438.1299999999997},{"$f":"IFERROR(+R48+PRORAČUNI!P46,0)","v":0},{"$f":"IFERROR(+S48+PRORAČUNI!Q46,0)","v":0},{"$f":"IFERROR(+T48+PRORAČUNI!R46,0)","v":0},{"$f":"IFERROR(+U48+PRORAČUNI!S46,0)","v":0},null,28.513000000000002,146.69799999999998,1262.9189999999996,1438.1299999999997,129.92610781127451,961.11000422114716,3822.8186016270761,4913.854713659498,null,{"$f":"$Z48*PRORAČUNI!H46","v":{"$error":"#REF!"}},{"$f":"$Z48*PRORAČUNI!I46","v":{"$error":"#REF!"}},{"$f":"$Z48*PRORAČUNI!J46","v":{"$error":"#REF!"}},{"$f":"'PLAN UNOSA'!$F$38*PRORAČUNI!K46","v":{"$error":"#REF!"}}]
[{"$error":"#REF!"},5,"PR",{"$f":"PRORAČUNI!B47","v":{"$error":"#REF!"}},{"$f":"IFERROR(+N49+PRORAČUNI!L47,0)","v":157.21},{"$f":"IFERROR(+O49+PRORAČUNI!M47,0)","v":40.267000000000003},{"$f":"IFERROR(+P49+PRORAČUNI!N47,0)","v":104.4},{"$f":"IFERROR(+Q49+PRORAČUNI!O47,0)","v":301.87700000000001},{"$f":"IFERROR(+R49+PRORAČUNI!P47,0)","v":0},{"$f":"IFERROR(+S49+PRORAČUNI!Q47,0)","v":0},{"$f":"IFERROR(+T49+PRORAČUNI!R47,0)","v":0},{"$f":"IFERROR(+U49+PRORAČUNI!S47,0)","v":0},null,157.21,40.267000000000003,104.4,301.87700000000001,2019.4142753635772,830.70522589843438,347.74973508772058,3197.8692363497312,null,{"$f":"$Z49*PRORAČUNI!H47","v":{"$error":"#REF!"}},{"$f":"$Z49*PRORAČUNI!I47","v":{"$error":"#REF!"}},{"$f":"$Z49*PRORAČUNI!J47","v":{"$error":"#REF!"}},{"$f":"'PLAN UNOSA'!$F$38*PRORAČUNI!K47","v":{"$error":"#REF!"}}]
[{"$error":"#REF!"},6,"PR",{"$f":"PRORAČUNI!B48","v":{"$error":"#REF!"}},{"$f":"IFERROR(+N50+PRORAČUNI!L48,0)","v":0},{"$f":"IFERROR(+O50+PRORAČUNI!M48,0)","v":0},{"$f":"IFERROR(+P50+PRORAČUNI!N48,0)","v":0},{"$f":"IFERROR(+Q50+PRORAČUNI!O48,0)","v":0},{"$f":"IFERROR(+R50+PRORAČUNI!P48,0)","v":0},{"$f":"IFERROR(+S50+PRORAČUNI!Q48,0)","v":0},{"$f":"IFERROR(+T50+PRORAČUNI!R48,0)","v":0},{"$f":"IFERROR(+U50+PRORAČUNI!S48,0)","v":0},null,0,0,0,0,2418.689158255992,0,405.61836503712493,2824.3075232931169,null,{"$f":"$Z50*PRORAČUNI!H48","v":{"$error":"#REF!"}},{"$f":"$Z50*PRORAČUNI!I48","v":{"$error":"#REF!"}},{"$f":"$Z50*PRORAČUNI!J48","v":{"$error":"#REF!"}},{"$f":"'PLAN UNOSA'!$F$38*PRORAČUNI!K48","v":{"$error":"#REF!"}}]
[{"$error":"#REF!"},7,"PR",{"$f":"PRORAČUNI!B49","v":{"$error":"#REF!"}},{"$f":"IFERROR(+N51+PRORAČUNI!L49,0)","v":234.06},{"$f":"IFERROR(+O51+PRORAČUNI!M49,0)","v":0},{"$f":"IFERROR(+P51+PRORAČUNI!N49,0)","v":36.049999999999997},{"$f":"IFERROR(+Q51+PRORAČUNI!O49,0)","v":270.11},{"$f":"IFERROR(+R51+PRORAČUNI!P49,0)","v":0},{"$f":"IFERROR(+S51+PRORAČUNI!Q49,0)","v":0},{"$f":"IFERROR(+T51+PRORAČUNI!R49,0)","v":0},{"$f":"IFERROR(+U51+PRORAČUNI!S49,0)","v":0},null,234.06,0,36.049999999999997,270.11,2352.4350114112422,0,344.75694652308249,2697.1919579343248,null,{"$f":"$Z51*PRORAČUNI!H49","v":{"$error":"#REF!"}},{"$f":"$Z51*PRORAČUNI!I49","v":{"$error":"#REF!"}},{"$f":"$Z51*PRORAČUNI!J49","v":{"$error":"#REF!"}},{"$f":"'PLAN UNOSA'!$F$38*PRORAČUNI!K49","v":{"$error":"#REF!"}}]
[{"$error":"#REF!"},8,"PR",{"$f":"PRORAČUNI!B50","v":{"$error":"#REF!"}},{"$f":"IFERROR(+N52+PRORAČUNI!L50,0)","v":0},{"$f":"IFERROR(+O52+PRORAČUNI!M50,0)","v":0},{"$f":"IFERROR(+P52+PRORAČUNI!N50,0)","v":0},{"$f":"IFERROR(+Q52+PRORAČUNI!O50,0)","v":0},{"$f":"IFERROR(+R52+PRORAČUNI!P50,0)","v":0},{"$f":"IFERROR(+S52+PRORAČUNI!Q50,0)","v":0},{"$f":"IFERROR(+T52+PRORAČUNI!R50,0)","v":0},{"$f":"IFERROR(+U52+PRORAČUNI!S50,0)","v":0},null,0,0,0,0,1724.9638430036807,690.87195594215052,0,2415.8357989458318,null,{"$f":"$Z52*PRORAČUNI!H50","v":{"$error":"#REF!"}},{"$f":"$Z52*PRORAČUNI!I50","v":{"$error":"#REF!"}},{"$f":"$Z52*PRORAČUNI!J50","v":{"$error":"#REF!"}},{"$f":"'PLAN UNOSA'!$F$38*PRORAČUNI!K50","v":{"$error":"#REF!"}}]
[{"$error":"#REF!"},9,"PR",{"$f":"PRORAČUNI!B51","v":{"$error":"#REF!"}},{"$f":"IFERROR(+N53+PRORAČUNI!L51,0)","v":37.691000000000003},{"$f":"IFERROR(+O53+PRORAČUNI!M51,0)","v":183.92600000000002},{"$f":"IFERROR(+P53+PRORAČUNI!N51,0)","v":535.1400000000001},{"$f":"IFERROR(+Q53+PRORAČUNI!O51,0)","v":756.75700000000006},{"$f":"IFERROR(+R53+PRORAČUNI!P51,0)","v":0},{"$f":"IFERROR(+S53+PRORAČUNI!Q51,0)","v":0},{"$f":"IFERROR(+T53+PRORAČUNI!R51,0)","v":0},{"$f":"IFERROR(+U53+PRORAČUNI!S51,0)","v":0},null,37.691000000000003,183.92600000000002,535.1400000000001,756.75700000000006,596.7626985097296,203.49644797764657,1393.3165400060366,2193.5756864934133,null,{"$f":"$Z53*PRORAČUNI!H51","v":{"$error":"#REF!"}},{"$f":"$Z53*PRORAČUNI!I51","v":{"$error":"#REF!"}},{"$f":"$Z53*PRORAČUNI!J51","v":{"$error":"#REF!"}},{"$f":"'PLAN UNOSA'!$F$38*PRORAČUNI!K51","v":{"$error":"#REF!"}}]
[{"$error":"#REF!"},10,"PR",{"$f":"PRORAČUNI!B52","v":{"$error":"#REF!"}},{"$f":"IFERROR(+N54+PRORAČUNI!L52,0)","v":323.89599999999996},{"$f":"IFERROR(+O54+PRORAČUNI!M52,0)","v":156.01800000000003},{"$f":"IFERROR(+P54+PRORAČUNI!N52,0)","v":158.23500000000001},{"$f":"IFERROR(+Q54+PRORAČUNI!O52,0)","v":638.14900000000011},{"$f":"IFERROR(+R54+PRORAČUNI!P52,0)","v":0},{"$f":"IFERROR(+S54+PRORAČUNI!Q52,0)","v":0},{"$f":"IFERROR(+T54+PRORAČUNI!R52,0)","v":0},{"$f":"IFERROR(+U54+PRORAČUNI!S52,0)","v":0},null,323.89599999999996,156.01800000000003,158.23500000000001,638.14900000000011,1476.0705472095315,242.33133788848448,402.2533991711615,2120.6552842691776,null,{"$f":"$Z54*PRORAČUNI!H52","v":{"$error":"#REF!"}},{"$f":"$Z54*PRORAČUNI!I52","v":{"$error":"#REF!"}},{"$f":"$Z54*PRORAČUNI!J52","v":{"$error":"#REF!"}},{"$f":"'PLAN UNOSA'!$F$38*PRORAČUNI!K52","v":{"$error":"#REF!"}}]
[{"$error":"#REF!"},11,"PR",{"$f":"PRORAČUNI!B53","v":{"$error":"#REF!"}},{"$f":"IFERROR(+N55+PRORAČUNI!L53,0)","v":247.53699999999998},{"$f":"IFERROR(+O55+PRORAČUNI!M53,0)","v":0},{"$f":"IFERROR(+P55+PRORAČUNI!N53,0)","v":169.9},{"$f":"IFERROR(+Q55+PRORAČUNI!O53,0)","v":417.43700000000001},{"$f":"IFERROR(+R55+PRORAČUNI!P53,0)","v":0},{"$f":"IFERROR(+S55+PRORAČUNI!Q53,0)","v":0},{"$f":"IFERROR(+T55+PRORAČUNI!R53,0)","v":0},{"$f":"IFERROR(+U55+PRORAČUNI!S53,0)","v":0},null,247.53699999999998,0,169.9,417.43700000000001,1245.4798112690441,20.901213754064795,635.4460826164883,1901.8271076395972,null,{"$f":"$Z55*PRORAČUNI!H53","v":{"$error":"#REF!"}},{"$f":"$Z55*PRORAČUNI!I53","v":{"$error":"#REF!"}},{"$f":"$Z55*PRORAČUNI!J53","v":{"$error":"#REF!"}},{"$f":"'PLAN UNOSA'!$F$38*PRORAČUNI!K53","v":{"$error":"#REF!"}}]
[{"$error":"#REF!"},12,"PR",{"$f":"PRORAČUNI!B54","v":{"$error":"#REF!"}},{"$f":"IFERROR(+N56+PRORAČUNI!L54,0)","v":0},{"$f":"IFERROR(+O56+PRORAČUNI!M54,0)","v":0},{"$f":"IFERROR(+P56+PRORAČUNI!N54,0)","v":429},{"$f":"IFERROR(+Q56+PRORAČUNI!O54,0)","v":429},{"$f":"IFERROR(+R56+PRORAČUNI!P54,0)","v":0},{"$f":"IFERROR(+S56+PRORAČUNI!Q54,0)","v":0},{"$f":"IFERROR(+T56+PRORAČUNI!R54,0)","v":0},{"$f":"IFERROR(+U56+PRORAČUNI!S54,0)","v":0},null,0,0,429,429,0,289.34314974702056,1519.6141935964276,1808.9573433434484,null,{"$f":"$Z56*PRORAČUNI!H54","v":{"$error":"#REF!"}},{"$f":"$Z56*PRORAČUNI!I54","v":{"$error":"#REF!"}},{"$f":"$Z56*PRORAČUNI!J54","v":{"$error":"#REF!"}},{"$f":"'PLAN UNOSA'!$F$38*PRORAČUNI!K54","v":{"$error":"#REF!"}}]
[{"$error":"#REF!"},13,"PR",{"$f":"PRORAČUNI!B55","v":{"$error":"#REF!"}},{"$f":"IFERROR(+N57+PRORAČUNI!L55,0)","v":75.016999999999996},{"$f":"IFERROR(+O57+PRORAČUNI!M55,0)","v":79.078000000000003},{"$f":"IFERROR(+P57+PRORAČUNI!N55,0)","v":59.2},{"$f":"IFERROR(+Q57+PRORAČUNI!O55,0)","v":213.29499999999999},{"$f":"IFERROR(+R57+PRORAČUNI!P55,0)","v":0},{"$f":"IFERROR(+S57+PRORAČUNI!Q55,0)","v":0},{"$f":"IFERROR(+T57+PRORAČUNI!R55,0)","v":0},{"$f":"IFERROR(+U57+PRORAČUNI!S55,0)","v":0},null,75.016999999999996,79.078000000000003,59.2,213.29499999999999,969.71509474559127,277.94398479227453,345.73953851330668,1593.3986180511724,null,{"$f":"$Z57*PRORAČUNI!H55","v":{"$error":"#REF!"}},{"$f":"$Z57*PRORAČUNI!I55","v":{"$error":"#REF!"}},{"$f":"$Z57*PRORAČUNI!J55","v":{"$error":"#REF!"}},{"$f":"'PLAN UNOSA'!$F$38*PRORAČUNI!K55","v":{"$error":"#REF!"}}]
[{"$error":"#REF!"},14,"PR",{"$f":"PRORAČUNI!B56","v":{"$error":"#REF!"}},{"$f":"IFERROR(+N58+PRORAČUNI!L56,0)","v":0},{"$f":"IFERROR(+O58+PRORAČUNI!M56,0)","v":53.67},{"$f":"IFERROR(+P58+PRORAČUNI!N56,0)","v":441.41800000000001},{"$f":"IFERROR(+Q58+PRORAČUNI!O56,0)","v":495.08799999999997},{"$f":"IFERROR(+R58+PRORAČUNI!P56,0)","v":0},{"$f":"IFERROR(+S58+PRORAČUNI!Q56,0)","v":0},{"$f":"IFERROR(+T58+PRORAČUNI!R56,0)","v":0},{"$f":"IFERROR(+U58+PRORAČUNI!S56,0)","v":0},null,0,53.67,441.41800000000001,495.08799999999997,0,518.48689547173649,974.86519421614082,1493.3520896878774,null,{"$f":"$Z58*PRORAČUNI!H56","v":{"$error":"#REF!"}},{"$f":"$Z58*PRORAČUNI!I56","v":{"$error":"#REF!"}},{"$f":"$Z58*PRORAČUNI!J56","v":{"$error":"#REF!"}},{"$f":"'PLAN UNOSA'!$F$38*PRORAČUNI!K56","v":{"$error":"#REF!"}}]
[{"$error":"#REF!"},15,"PR",{"$f":"PRORAČUNI!B57","v":{"$error":"#REF!"}},{"$f":"IFERROR(+N59+PRORAČUNI!L57,0)","v":0},{"$f":"IFERROR(+O59+PRORAČUNI!M57,0)","v":0},{"$f":"IFERROR(+P59+PRORAČUNI!N57,0)","v":0},{"$f":"IFERROR(+Q59+PRORAČUNI!O57,0)","v":0},{"$f":"IFERROR(+R59+PRORAČUNI!P57,0)","v":0},{"$f":"IFERROR(+S59+PRORAČUNI!Q57,0)","v":0},{"$f":"IFERROR(+T59+PRORAČUNI!R57,0)","v":0},{"$f":"IFERROR(+U59+PRORAČUNI!S57,0)","v":0},null,0,0,0,0,1235.2081568997291,0,0,1235.2081568997291,null,{"$f":"$Z59*PRORAČUNI!H57","v":{"$error":"#REF!"}},{"$f":"$Z59*PRORAČUNI!I57","v":{"$error":"#REF!"}},{"$f":"$Z59*PRORAČUNI!J57","v":{"$error":"#REF!"}},{"$f":"'PLAN UNOSA'!$F$38*PRORAČUNI!K57","v":{"$error":"#REF!"}}]
[{"$error":"#REF!"},16,"PR",{"$f":"PRORAČUNI!B58","v":{"$error":"#REF!"}},{"$f":"IFERROR(+N60+PRORAČUNI!L58,0)","v":0},{"$f":"IFERROR(+O60+PRORAČUNI!M58,0)","v":409.34500000000003},{"$f":"IFERROR(+P60+PRORAČUNI!N58,0)","v":0},{"$f":"IFERROR(+Q60+PRORAČUNI!O58,0)","v":409.34500000000003},{"$f":"IFERROR(+R60+PRORAČUNI!P58,0)","v":0},{"$f":"IFERROR(+S60+PRORAČUNI!Q58,0)","v":0},{"$f":"IFERROR(+T60+PRORAČUNI!R58,0)","v":0},{"$f":"IFERROR(+U60+PRORAČUNI!S58,0)","v":0},null,0,409.34500000000003,0,409.34500000000003,0,1102.1586142145018,0,1102.1586142145018,null,{"$f":"$Z60*PRORAČUNI!H58","v":{"$error":"#REF!"}},{"$f":"$Z60*PRORAČUNI!I58","v":{"$error":"#REF!"}},{"$f":"$Z60*PRORAČUNI!J58","v":{"$error":"#REF!"}},{"$f":"'PLAN UNOSA'!$F$38*PRORAČUNI!K58","v":{"$error":"#REF!"}}]
[{"$error":"#REF!"},17,"PR",{"$f":"PRORAČUNI!B59","v":{"$error":"#REF!"}},{"$f":"IFERROR(+N61+PRORAČUNI!L59,0)","v":0},{"$f":"IFERROR(+O61+PRORAČUNI!M59,0)","v":21},{"$f":"IFERROR(+P61+PRORAČUNI!N59,0)","v":271.25400000000002},{"$f":"IFERROR(+Q61+PRORAČUNI!O59,0)","v":292.25400000000002},{"$f":"IFERROR(+R61+PRORAČUNI!P59,0)","v":0},{"$f":"IFERROR(+S61+PRORAČUNI!Q59,0)","v":0},{"$f":"IFERROR(+T61+PRORAČUNI!R59,0)","v":0},{"$f":"IFERROR(+U61+PRORAČUNI!S59,0)","v":0},null,0,21,271.25400000000002,292.25400000000002,406.61083784065841,0,679.59136074711898,1086.2021985877775,null,{"$f":"$Z61*PRORAČUNI!H59","v":{"$error":"#REF!"}},{"$f":"$Z61*PRORAČUNI!I59","v":{"$error":"#REF!"}},{"$f":"$Z61*PRORAČUNI!J59","v":{"$error":"#REF!"}},{"$f":"'PLAN UNOSA'!$F$38*PRORAČUNI!K59","v":{"$error":"#REF!"}}]
[{"$error":"#REF!"},18,"PR",{"$f":"PRORAČUNI!B60","v":{"$error":"#REF!"}},{"$f":"IFERROR(+N62+PRORAČUNI!L60,0)","v":166.875},{"$f":"IFERROR(+O62+PRORAČUNI!M60,0)","v":10.803000000000001},{"$f":"IFERROR(+P62+PRORAČUNI!N60,0)","v":66.099999999999994},{"$f":"IFERROR(+Q62+PRORAČUNI!O60,0)","v":243.77800000000002},{"$f":"IFERROR(+R62+PRORAČUNI!P60,0)","v":0},{"$f":"IFERROR(+S62+PRORAČUNI!Q60,0)","v":0},{"$f":"IFERROR(+T62+PRORAČUNI!R60,0)","v":0},{"$f":"IFERROR(+U62+PRORAČUNI!S60,0)","v":0},null,166.875,10.803000000000001,66.099999999999994,243.77800000000002,620.7928364784749,19.257705140248479,375.58069257619326,1015.6312341949168,null,{"$f":"$Z62*PRORAČUNI!H60","v":{"$error":"#REF!"}},{"$f":"$Z62*PRORAČUNI!I60","v":{"$error":"#REF!"}},{"$f":"$Z62*PRORAČUNI!J60","v":{"$error":"#REF!"}},{"$f":"'PLAN UNOSA'!$F$38*PRORAČUNI!K60","v":{"$error":"#REF!"}}]
[{"$error":"#REF!"},19,"PR",{"$f":"PRORAČUNI!B61","v":{"$error":"#REF!"}},{"$f":"IFERROR(+N63+PRORAČUNI!L61,0)","v":0},{"$f":"IFERROR(+O63+PRORAČUNI!M61,0)","v":215.17400000000001},{"$f":"IFERROR(+P63+PRORAČUNI!N61,0)","v":0},{"$f":"IFERROR(+Q63+PRORAČUNI!O61,0)","v":215.17400000000001},{"$f":"IFERROR(+R63+PRORAČUNI!P61,0)","v":0},{"$f":"IFERROR(+S63+PRORAČUNI!Q61,0)","v":0},{"$f":"IFERROR(+T63+PRORAČUNI!R61,0)","v":0},{"$f":"IFERROR(+U63+PRORAČUNI!S61,0)","v":0},null,0,215.17400000000001,0,215.17400000000001,0,917.45657101970187,0,917.45657101970187,null,{"$f":"$Z63*PRORAČUNI!H61","v":{"$error":"#REF!"}},{"$f":"$Z63*PRORAČUNI!I61","v":{"$error":"#REF!"}},{"$f":"$Z63*PRORAČUNI!J61","v":{"$error":"#REF!"}},{"$f":"'PLAN UNOSA'!$F$38*PRORAČUNI!K61","v":{"$error":"#REF!"}}]
[{"$error":"#REF!"},20,"PR",{"$f":"PRORAČUNI!B62","v":{"$error":"#REF!"}},{"$f":"IFERROR(+N64+PRORAČUNI!L62,0)","v":136.54400000000001},{"$f":"IFERROR(+O64+PRORAČUNI!M62,0)","v":0},{"$f":"IFERROR(+P64+PRORAČUNI!N62,0)","v":0},{"$f":"IFERROR(+Q64+PRORAČUNI!O62,0)","v":136.54400000000001},{"$f":"IFERROR(+R64+PRORAČUNI!P62,0)","v":0},{"$f":"IFERROR(+S64+PRORAČUNI!Q62,0)","v":0},{"$f":"IFERROR(+T64+PRORAČUNI!R62,0)","v":0},{"$f":"IFERROR(+U64+PRORAČUNI!S62,0)","v":0},null,136.54400000000001,0,0,136.54400000000001,745.70607833738791,20.129412447776978,11.527615527769745,777.36310631293463,null,{"$f":"$Z64*PRORAČUNI!H62","v":{"$error":"#REF!"}},{"$f":"$Z64*PRORAČUNI!I62","v":{"$error":"#REF!"}},{"$f":"$Z64*PRORAČUNI!J62","v":{"$error":"#REF!"}},{"$f":"'PLAN UNOSA'!$F$38*PRORAČUNI!K62","v":{"$error":"#REF!"}}]
[{"$f":"A5","v":{"$error":"#REF!"}},{"$f":"B5","v":1},"P",{"$error":"#REF!"},{"$f":"I5","v":0},{"$f":"J5","v":0},0,0]
[{"$f":"A6","v":{"$error":"#REF!"}},2,"P",{"$error":"#REF!"},{"$f":"I6","v":0},{"$f":"J6","v":0},{"$f":"K6","v":0},{"$f":"L6","v":0}]
[{"$f":"A7","v":{"$error":"#REF!"}},3,"P",{"$error":"#REF!"},0,0,0,0]
[{"$f":"A8","v":{"$error":"#REF!"}},4,"P",{"$error":"#REF!"},0,0,0,0]
[{"$f":"A9","v":{"$error":"#REF!"}},5,"P",{"$error":"#REF!"},0,0,0,0]
[{"$f":"A10","v":{"$error":"#REF!"}},6,"P",{"$error":"#REF!"},0,0,0,0]
[{"$f":"A11","v":{"$error":"#REF!"}},7,"P",{"$error":"#REF!"},0,0,0,0]
[{"$f":"A12","v":{"$error":"#REF!"}},8,"P",{"$error":"#REF!"},0,0,0,0]
[{"$f":"A13","v":{"$error":"#REF!"}},9,"P",{"$error":"#REF!"},0,0,0,0]
[{"$f":"A14","v":{"$error":"#REF!"}},10,"P",{"$error":"#REF!"},0,0,0,0]
[{"$f":"A15","v":{"$error":"#REF!"}},11,"P",{"$error":"#REF!"},0,0,0,0]
[{"$f":"A16","v":{"$error":"#REF!"}},12,"P",{"$error":"#REF!"},0,0,0,0]
[{"$f":"A17","v":{"$error":"#REF!"}},13,"P",{"$error":"#REF!"},0,0,0,0]
[{"$f":"A18","v":{"$error":"#REF!"}},14,"P",{"$error":"#REF!"},0,0,0,0]
[{"$f":"A19","v":{"$error":"#REF!"}},15,"P",{"$error":"#REF!"},0,0,0,0]
[{"$f":"A20","v":{"$error":"#REF!"}},16,"P",{"$error":"#REF!"},0,0,0,0]
[{"$f":"A21","v":{"$error":"#REF!"}},17,"P",{"$error":"#REF!"},0,0,0,0]
[{"$f":"A22","v":{"$error":"#REF!"}},18,"P",{"$error":"#REF!"},0,0,0,0]
[{"$f":"A23","v":{"$error":"#REF!"}},19,"P",{"$error":"#REF!"},0,0,0,0]
[{"$f":"A24","v":{"$error":"#REF!"}},20,"P",{"$error":"#REF!"},0,0,0,0]
[{"$f":"A25","v":{"$error":"#REF!"}},1,"P",{"$error":"#REF!"},0,0,0,0]
[{"$f":"A26","v":{"$error":"#REF!"}},2,"P",{"$error":"#REF!"},0,0,0,0]
[{"$f":"A27","v":{"$error":"#REF!"}},3,"P",{"$error":"#REF!"},0,0,0,0]
[{"$f":"A28","v":{"$error":"#REF!"}},4,"P",{"$error":"#REF!"},0,0,0,0]
[{"$f":"A29","v":{"$error":"#REF!"}},5,"P",{"$error":"#REF!"},0,0,0,0]
[{"$f":"A30","v":{"$error":"#REF!"}},6,"P",{"$error":"#REF!"},0,0,0,0]
[{"$f":"A31","v":{"$error":"#REF!"}},7,"P",{"$error":"#REF!"},0,0,0,0]
[{"$f":"A32","v":{"$error":"#REF!"}},8,"P",{"$error":"#REF!"},0,0,0,0]
[{"$f":"A33","v":{"$error":"#REF!"}},9,"P",{"$error":"#REF!"},0,0,0,0]
[{"$f":"A34","v":{"$error":"#REF!"}},10,"P",{"$error":"#REF!"},0,0,0,0]
[{"$f":"A35","v":{"$error":"#REF!"}},11,"P",{"$error":"#REF!"},0,0,0,0]
[{"$f":"A36","v":{"$error":"#REF!"}},12,"P",{"$error":"#REF!"},0,0,0,0]
[{"$f":"A37","v":{"$error":"#REF!"}},13,"P",{"$error":"#REF!"},0,0,0,0]
[{"$f":"A38","v":{"$error":"#REF!"}},14,"P",{"$error":"#REF!"},0,0,0,0]
[{"$f":"A39","v":{"$error":"#REF!"}},15,"P",{"$error":"#REF!"},0,0,0,0]
[{"$f":"A40","v":{"$error":"#REF!"}},16,"P",{"$error":"#REF!"},0,0,0,0]
[{"$f":"A41","v":{"$error":"#REF!"}},17,"P",{"$error":"#REF!"},0,0,0,0]
[{"$f":"A42","v":{"$error":"#REF!"}},18,"P",{"$error":"#REF!"},0,0,0,0]
[{"$f":"A43","v":{"$error":"#REF!"}},19,"P",{"$error":"#REF!"},0,0,0,0]
[{"$f":"A44","v":{"$error":"#REF!"}},20,"P",{"$error":"#REF!"},0,0,0,0]
[{"$f":"A45","v":{"$error":"#REF!"}},1,"P",{"$error":"#REF!"},0,0,0,0]
[{"$f":"A46","v":{"$error":"#REF!"}},2,"P",{"$error":"#REF!"},0,0,0,0]
[{"$f":"A47","v":{"$error":"#REF!"}},3,"P",{"$error":"#REF!"},0,0,0,0]
[{"$f":"A48","v":{"$error":"#REF!"}},4,"P",{"$error":"#REF!"},0,0,0,0]
[{"$f":"A49","v":{"$error":"#REF!"}},5,"P",{"$error":"#REF!"},0,0,0,0]
[{"$f":"A50","v":{"$error":"#REF!"}},6,"P",{"$error":"#REF!"},0,0,0,0]
[{"$f":"A51","v":{"$error":"#REF!"}},{"$f":"B51","v":7},"P",{"$error":"#REF!"},0,0,0,0]
[{"$f":"A52","v":{"$error":"#REF!"}},8,"P",{"$error":"#REF!"},0,0,0,0]
[{"$f":"A53","v":{"$error":"#REF!"}},9,"P",{"$error":"#REF!"},0,0,0,0]
[{"$f":"A54","v":{"$error":"#REF!"}},10,"P",{"$error":"#REF!"},0,0,0,0]
[{"$f":"A55","v":{"$error":"#REF!"}},11,"P",{"$error":"#REF!"},0,0,0,0]
[{"$f":"A56","v":{"$error":"#REF!"}},12,"P",{"$error":"#REF!"},0,0,0,0]
[{"$f":"A57","v":{"$error":"#REF!"}},13,"P",{"$error":"#REF!"},0,0,0,0]
[{"$f":"A58","v":{"$error":"#REF!"}},14,"P",{"$error":"#REF!"},0,0,0,0]
[{"$f":"A59","v":{"$error":"#REF!"}},15,"P",{"$error":"#REF!"},0,0,0,0]
[{"$f":"A60","v":{"$error":"#REF!"}},16,"P",{"$error":"#REF!"},0,0,0,0]
[{"$f":"A61","v":{"$error":"#REF!"}},17,"P",{"$error":"#REF!"},0,0,0,0]
[{"$f":"A62","v":{"$error":"#REF!"}},{"$f":"B62","v":18},"P",{"$error":"#REF!"},0,0,0,0]
[{"$f":"A63","v":{"$error":"#REF!"}},19,"P",{"$error":"#REF!"},0,0,0,0]
[{"$f":"A64","v":{"$error":"#REF!"}},20,"P",{"$error":"#REF!"},0,0,0,0]

{"sheet":"KUMULATIV 2","index":4,"n_rows":258,"n_cols":6,"rows_kept":258,"cut":false,"hidden":false,"merged":[]}
[null,null,null,null,"PR/P"]
["KC","RB","KUPAC","Values","PR","P"]
["KC Beograd",1,"DELHAIZE SERBIA DOO","Sum of 1. Sveži proizvodi",16466.732999999997,14494.631583747108]
[null,null,null,"Sum of 2. Smrznuti proizvodi",0,0]
[null,null,null,"Sum of 3. Prepađevine",332.72899999999998,2058.1228929243084]
[null,null,null,"Sum of Grand Total",16799.462,16552.75447667142]
[null,2,"IDEA DOO","Sum of 1. Sveži proizvodi",10500.770000000002,8951.6494666749859]
[null,null,null,"Sum of 2. Smrznuti proizvodi",0,0]
[null,null,null,"Sum of 3. Prepađevine",1496.2550000000001,124.8268914941724]
[null,null,null,"Sum of Grand Total",11997.025000000001,9076.4763581691586]
[null,3,"MERCATOR S","Sum of 1. Sveži proizvodi",3493.5020000000004,4961.429769043003]
[null,null,null,"Sum of 2. Smrznuti proizvodi",46.536000000000001,105.73765303400943]
[null,null,null,"Sum of 3. Prepađevine",598.55700000000002,1033.4605250719551]
[null,null,null,"Sum of Grand Total",4138.5950000000003,6100.627947148967]
[null,4,"ŠTRAND DOO","Sum of 1. Sveži proizvodi",5020.0519999999997,4733.4799287609867]
[null,null,null,"Sum of 2. Smrznuti proizvodi",0,0]
[null,null,null,"Sum of 3. Prepađevine",0,0]
[null,null,null,"Sum of Grand Total",5020.0519999999997,4733.4799287609867]
[null,5,"METRO CASH & CARRY DOO","Sum of 1. Sveži proizvodi",1324.682,3633.4822012378954]
[null,null,null,"Sum of 2. Smrznuti proizvodi",0,44.624538796281669]
[null,null,null,"Sum of 3. Prepađevine",260.5,723.0852642438565]
[null,null,null,"Sum of Grand Total",1585.182,4401.1920042780321]
[null,6,"UNIVEREXPORT DOO","Sum of 1. Sveži proizvodi",4018.2729999999997,3130.5387163377691]
[null,null,null,"Sum of 2. Smrznuti proizvodi",0,0]
[null,null,null,"Sum of 3. Prepađevine",533.9,314.48554554365694]
[null,null,null,"Sum of Grand Total",4552.1729999999998,3445.0242618814264]
[null,7,"AMAN DOO","Sum of 1. Sveži proizvodi",127.49600000000001,2120.6249502013625]
[null,null,null,"Sum of 2. Smrznuti proizvodi",0,0]
[null,null,null,"Sum of 3. Prepađevine",1841.0940000000001,970.87649738602181]
[null,null,null,"Sum of Grand Total",1968.5900000000001,3091.5014475873845]
[null,8,"MESO-MARKET","Sum of 1. Sveži proizvodi",1782.3959999999997,2157.9594355043478]
[null,null,null,"Sum of 2. Smrznuti proizvodi",0,0]
[null,null,null,"Sum of 3. Prepađevine",13.285,23.408623616887809]
[null,null,null,"Sum of Grand Total",1795.6809999999998,2181.368059121236]
[null,9,"MUP UPRAVA ZA POSLOVE ISHRANE I SMEŠTAJA","Sum of 1. Sveži proizvodi",0,0]
[null,null,null,"Sum of 2. Smrznuti proizvodi",1251.989,1239.2472365608749]
[null,null,null,"Sum of 3. Prepađevine",0,0]
[null,null,null,"Sum of Grand Total",1251.989,1239.2472365608749]
[null,10,"ĐERIĆ STR","Sum of 1. Sveži proizvodi",383.33799999999997,1150.9377827293422]
[null,null,null,"Sum of 2. Smrznuti proizvodi",0,0]
[null,null,null,"Sum of 3. Prepađevine",13,0]
[null,null,null,"Sum of Grand Total",396.33799999999997,1150.9377827293422]
[null,11,"TP DOO TREND COMERCCE ŠID","Sum of 1. Sveži proizvodi",0,0]
[null,null,null,"Sum of 2. Smrznuti proizvodi",230.79000000000002,179.80550730820852]
[null,null,null,"Sum of 3. Prepađevine",531.63499999999999,552.61717318773185]
[null,null,null,"Sum of Grand Total",762.42500000000007,732.42268049594009]
[null,12,"VINDIJA D.O.O. LAJKOVAC - VLASTITA POTROŠNJA","Sum of 1. Sveži proizvodi",0,330.48912939923986]
[null,null,null,"Sum of 2. Smrznuti proizvodi",0,204.30403376907049]
[null,null,null,"Sum of 3. Prepađevine",0,146.46024857063151]
[null,null,null,"Sum of Grand Total",0,681.25341173894174]
[null,13,"PODUNAVLJE AD, BEOGRAD","Sum of 1. Sveži proizvodi",459.22899999999998,228.69174838089322]
[null,null,null,"Sum of 2. Smrznuti proizvodi",613.11699999999996,332.95924695196544]
[null,null,null,"Sum of 3. Prepađevine",141.649,69.105608595993644]
[null,null,null,"Sum of Grand Total",1213.9949999999999,630.75660392885243]
[null,14,"POINT MARTINOVIĆ DOO","Sum of 1. Sveži proizvodi",0,582.48172548905154]
[null,null,null,"Sum of 2. Smrznuti proizvodi",0,4.2476610489563793]
[null,null,null,"Sum of 3. Prepađevine",0,0]
[null,null,null,"Sum of Grand Total",0,586.72938653800793]
[null,15,"MIS CHILLI DOO","Sum of 1. Sveži proizvodi",190.82,320.04928704627008]
[null,null,null,"Sum of 2. Smrznuti proizvodi",0,0]
[null,null,null,"Sum of 3. Prepađevine",227.61699999999996,262.16034222442136]
[null,null,null,"Sum of Grand Total",418.43700000000001,582.20962927069149]
[null,16,"VEROPOULOS DOO","Sum of 1. Sveži proizvodi",134.98400000000001,391.7058451259665]
[null,null,null,"Sum of 2. Smrznuti proizvodi",0,3.6488216729845075]
[null,null,null,"Sum of 3. Prepađevine",251.66300000000001,117.9592133021806]
[null,null,null,"Sum of Grand Total",386.64699999999999,513.31388010113164]
[null,17,"JOVANA STR","Sum of 1. Sveži proizvodi",250.92999999999998,377.77391155772864]
[null,null,null,"Sum of 2. Smrznuti proizvodi",0,0]
[null,null,null,"Sum of 3. Prepađevine",48.111000000000004,69.936697463787297]
[null,null,null,"Sum of Grand Total",299.041,447.71060902151589]
[null,18,"SLAVONAC STUR, ISMETA MUJEZINOVIĆA","Sum of 1. Sveži proizvodi",0,400.33019471933579]
[null,null,null,"Sum of 2. Smrznuti proizvodi",0,0]
[null,null,null,"Sum of 3. Prepađevine",0,0]
[null,null,null,"Sum of Grand Total",0,400.33019471933579]
[null,19,"MEDIUS DOO","Sum of 1. Sveži proizvodi",10.173,62.53810907725525]
[null,null,null,"Sum of 2. Smrznuti proizvodi",0,0]
[null,null,null,"Sum of 3. Prepađevine",216.56399999999999,325.64983933435178]
[null,null,null,"Sum of Grand Total",226.73699999999999,388.18794841160707]
[null,20,"FAMOSO","Sum of 1. Sveži proizvodi",0,353.79984391663419]
[null,null,null,"Sum of 2. Smrznuti proizvodi",0,0]
[null,null,null,"Sum of 3. Prepađevine",0,0]
[null,null,null,"Sum of Grand Total",0,353.79984391663419]
["KC Beograd Sum of 1. Sveži proizvodi",null,null,null,44163.378000000004,48382.593628949166]
["KC Beograd Sum of 2. Smrznuti proizvodi",null,null,null,2142.4319999999998,2114.5746991423507]
["KC Beograd Sum of 3. Prepađevine",null,null,null,6506.5590000000002,6792.1553629599575]
["KC Beograd Sum of Grand Total",null,null,null,52812.369000000013,57289.323691051482]
["KC Lajkovac",1,"MERCATOR S","Sum of 1. Sveži proizvodi",2022.1940000000004,2970.3480897778995]
[null,null,null,"Sum of 2. Smrznuti proizvodi",11.108000000000001,35.866076641100406]
[null,null,null,"Sum of 3. Prepađevine",389.99900000000002,345.14260997702445]
[null,null,null,"Sum of Grand Total",2423.3010000000004,3351.3567763960236]
[null,2,"IDEA DOO","Sum of 1. Sveži proizvodi",2605.3720000000003,3215.660539290297]
[null,null,null,"Sum of 2. Smrznuti proizvodi",0,0]
[null,null,null,"Sum of 3. Prepađevine",238.65300000000002,10.358879822768845]
[null,null,null,"Sum of Grand Total",2844.0249999999996,3226.0194191130663]
[null,3,"FORTUNA MARKET DOO","Sum of 1. Sveži proizvodi",652.57400000000007,1257.3830045251975]
[null,null,null,"Sum of 2. Smrznuti proizvodi",0,0]
[null,null,null,"Sum of 3. Prepađevine",717.71100000000001,1189.3982214525672]
[null,null,null,"Sum of Grand Total",1370.2849999999999,2446.7812259777647]
[null,4,"ES KOMERC DOO","Sum of 1. Sveži proizvodi",1041.5740000000001,1582.6231168722084]
[null,null,null,"Sum of 2. Smrznuti proizvodi",91.923999999999992,376.56163768368356]
[null,null,null,"Sum of 3. Prepađevine",390.85,322.94262184316216]
[null,null,null,"Sum of Grand Total",1524.348,2282.1273763990534]
[null,5,"PREHRANA DOO","Sum of 1. Sveži proizvodi",787.49300000000005,1436.6341513867922]
[null,null,null,"Sum of 2. Smrznuti proizvodi",0,27.54480665294356]
[null,null,null,"Sum of 3. Prepađevine",147.31200000000001,84.260218886804182]
[null,null,null,"Sum of Grand Total",934.80500000000006,1548.4391769265399]
[null,6,"EUROPROM DOO","Sum of 1. Sveži proizvodi",414.00899999999996,788.20098673353482]
[null,null,null,"Sum of 2. Smrznuti proizvodi",108.146,304.8233054205358]
[null,null,null,"Sum of 3. Prepađevine",349.31999999999994,361.02331794953034]
[null,null,null,"Sum of Grand Total",871.47499999999991,1454.0476101036013]
[null,7,"TP KVIN DOO","Sum of 1. Sveži proizvodi",0,957.11833316561513]
[null,null,null,"Sum of 2. Smrznuti proizvodi",0,104.81259992464507]
[null,null,null,"Sum of 3. Prepađevine",0,273.86552046809044]
[null,null,null,"Sum of Grand Total",0,1335.7964535583508]
[null,8,"DIVČIBARAC DOO, RAŽANA","Sum of 1. Sveži proizvodi",73.782000000000011,802.73613073748311]
[null,null,null,"Sum of 2. Smrznuti proizvodi",0,3.3784487000925063]
[null,null,null,"Sum of 3. Prepađevine",35.4,47.812591097758869]
[null,null,null,"Sum of Grand Total",109.18200000000002,853.9271705353342]
[null,9,"KMN STKUR","Sum of 1. Sveži proizvodi",283.63599999999997,644.68179627954578]
[null,null,null,"Sum of 2. Smrznuti proizvodi",0,0]
[null,null,null,"Sum of 3. Prepađevine",0,2.1808168047934413]
[null,null,null,"Sum of Grand Total",283.63599999999997,646.86261308433927]
[null,10,"DRAGANA SZTPR","Sum of 1. Sveži proizvodi",97.596999999999994,502.21339605599962]
[null,null,null,"Sum of 2. Smrznuti proizvodi",0,0]
[null,null,null,"Sum of 3. Prepađevine",70.704999999999998,117.06551914237701]
[null,null,null,"Sum of Grand Total",168.30199999999999,619.27891519837669]
[null,11,"GREEN STR","Sum of 1. Sveži proizvodi",374.72899999999998,440.95788670402663]
[null,null,null,"Sum of 2. Smrznuti proizvodi",0,0]
[null,null,null,"Sum of 3. Prepađevine",60.5,174.6972379037183]
[null,null,null,"Sum of Grand Total",435.22899999999998,615.65512460774494]
[null,12,"MRM KOLAREVIĆ DOO","Sum of 1. Sveži proizvodi",266.35400000000004,407.6419118466647]
[null,null,null,"Sum of 2. Smrznuti proizvodi",0,64.009880976427226]
[null,null,null,"Sum of 3. Prepađevine",17.25,25.533730089456544]
[null,null,null,"Sum of Grand Total",283.60400000000004,497.18552291254855]
[null,13,"ĐOKIĆ SZTR","Sum of 1. Sveži proizvodi",24.036999999999999,419.16898253786792]
[null,null,null,"Sum of 2. Smrznuti proizvodi",0,0]
[null,null,null,"Sum of 3. Prepađevine",0,25.247679618561133]
[null,null,null,"Sum of Grand Total",24.036999999999999,444.41666215642908]
[null,14,"NIKOLA TPD DOO","Sum of 1. Sveži proizvodi",99.88,262.34971733037872]
[null,null,null,"Sum of 2. Smrznuti proizvodi",24.317999999999998,73.903156411372677]
[null,null,null,"Sum of 3. Prepađevine",140.14699999999999,95.113780654793672]
[null,null,null,"Sum of Grand Total",264.34500000000003,431.36665439654507]
[null,15,"MIROPROMET DOO","Sum of 1. Sveži proizvodi",0,137.8232604293359]
[null,null,null,"Sum of 2. Smrznuti proizvodi",0,67.734716079014404]
[null,null,null,"Sum of 3. Prepađevine",0,223.85175827536008]
[null,null,null,"Sum of Grand Total",0,429.40973478371041]
[null,16,"ZORNIĆ SZTR","Sum of 1. Sveži proizvodi",0,412.38991350016755]
[null,null,null,"Sum of 2. Smrznuti proizvodi",0,8.9504356363397477]
[null,null,null,"Sum of 3. Prepađevine",0,4.1980723492273739]
[null,null,null,"Sum of Grand Total",0,425.53842148573472]
[null,17,"ZDRAVSTVENI CENTAR VALJEVO","Sum of 1. Sveži proizvodi",217.595,239.33083248631647]
[null,null,null,"Sum of 2. Smrznuti proizvodi",123.068,146.95797508568069]
[null,null,null,"Sum of 3. Prepađevine",0,0]
[null,null,null,"Sum of Grand Total",340.66300000000001,386.28880757199715]
[null,18,"DUĆAN STR LAZAREVAC","Sum of 1. Sveži proizvodi",0,276.40144694259772]
[null,null,null,"Sum of 2. Smrznuti proizvodi",0,0]
[null,null,null,"Sum of 3. Prepađevine",0,85.670480420570627]
[null,null,null,"Sum of Grand Total",0,362.07192736316836]
[null,19,"ŽI-NA-SA STUZR","Sum of 1. Sveži proizvodi",18.712,200.23496615731699]
[null,null,null,"Sum of 2. Smrznuti proizvodi",13.376000000000001,42.019978194760029]
[null,null,null,"Sum of 3. Prepađevine",65.194000000000003,95.563028916581175]
[null,null,null,"Sum of Grand Total",97.282000000000011,337.81797326865819]
[null,20,"METALAC-PROLETER AD","Sum of 1. Sveži proizvodi",6.1520000000000001,3.8044349159621582]
[null,null,null,"Sum of 2. Smrznuti proizvodi",149.04000000000002,276.56936983656692]
[null,null,null,"Sum of 3. Prepađevine",42,43.779897356228332]
[null,null,null,"Sum of Grand Total",197.19200000000001,324.15370210875744]
["KC Lajkovac Sum of 1. Sveži proizvodi",null,null,null,8985.6899999999987,16957.702897675204]
["KC Lajkovac Sum of 2. Smrznuti proizvodi",null,null,null,520.98,1533.1323872431624]
["KC Lajkovac Sum of 3. Prepađevine",null,null,null,2665.0410000000002,3527.7059830293742]
["KC Lajkovac Sum of Grand Total",null,null,null,12171.710999999999,22018.541267947741]
["KC Niš",1,"PRIMA NOVA DOO","Sum of 1. Sveži proizvodi",183.41000000000003,5312.8679379772329]
[null,null,null,"Sum of 2. Smrznuti proizvodi",60,150.37390202124709]
[null,null,null,"Sum of 3. Prepađevine",474.298,2490.285165540703]
[null,null,null,"Sum of Grand Total",717.70799999999986,7953.5270055391848]
[null,2,"IDEA DOO","Sum of 1. Sveži proizvodi",1409.7190000000001,7205.9060621780154]
[null,null,null,"Sum of 2. Smrznuti proizvodi",0,0]
[null,null,null,"Sum of 3. Prepađevine",376.71000000000004,194.3389467979911]
[null,null,null,"Sum of Grand Total",1786.4290000000001,7400.2450089760041]
[null,3,"BIFTEK, RADOJEVIĆ MILOŠ PREDUZETNIK, NIŠ","Sum of 1. Sveži proizvodi",12889.468000000001,6535.3971816206122]
[null,null,null,"Sum of 2. Smrznuti proizvodi",0,0]
[null,null,null,"Sum of 3. Prepađevine",0,0]
[null,null,null,"Sum of Grand Total",12889.468000000001,6535.3971816206122]
[null,4,"NECA SZTR","Sum of 1. Sveži proizvodi",28.513000000000002,151.58045911315358]
[null,null,null,"Sum of 2. Smrznuti proizvodi",231.72599999999997,1121.2950049246717]
[null,null,null,"Sum of 3. Prepađevine",1844.9289999999994,4459.9550352315891]
[null,null,null,"Sum of Grand Total",2105.1679999999997,5732.8304992694138]
[null,5,"INEX-UZOR AD","Sum of 1. Sveži proizvodi",157.21,2355.9833212575068]
[null,null,null,"Sum of 2. Smrznuti proizvodi",40.267000000000003,969.15609688150676]
[null,null,null,"Sum of 3. Prepađevine",104.4,405.70802426900735]
[null,null,null,"Sum of Grand Total",301.87700000000001,3730.8474424080196]
[null,6,"SAMALD-COMERC EXPORT-IMPORT DOO","Sum of 1. Sveži proizvodi",0,2821.804017965324]
[null,null,null,"Sum of 2. Smrznuti proizvodi",0,0]
[null,null,null,"Sum of 3. Prepađevine",0,473.22142587664575]
[null,null,null,"Sum of Grand Total",0,3295.0254438419697]
[null,7,"MERCATOR S","Sum of 1. Sveži proizvodi",331.54700000000003,2744.5075133131159]
[null,null,null,"Sum of 2. Smrznuti proizvodi",0,0]
[null,null,null,"Sum of 3. Prepađevine",42.55,402.21643761026291]
[null,null,null,"Sum of Grand Total",374.09699999999998,3146.7239509233791]
[null,8,"GLIDŽIĆ NIS DOO","Sum of 1. Sveži proizvodi",0,2012.4578168376274]
[null,null,null,"Sum of 2. Smrznuti proizvodi",0,806.01728193250892]
[null,null,null,"Sum of 3. Prepađevine",0,0]
[null,null,null,"Sum of Grand Total",0,2818.4750987701373]
[null,9,"TEKIJANKA DOO","Sum of 1. Sveži proizvodi",37.691000000000003,696.22314826135118]
[null,null,null,"Sum of 2. Smrznuti proizvodi",183.92600000000002,237.41252264058767]
[null,null,null,"Sum of 3. Prepađevine",535.1400000000001,1625.5359633403759]
[null,null,null,"Sum of Grand Total",756.75700000000006,2559.1716342423156]
[null,10,"MIROČ A.D. KLADOVO","Sum of 1. Sveži proizvodi",323.89599999999996,1722.0823050777867]
[null,null,null,"Sum of 2. Smrznuti proizvodi",156.01800000000003,282.71989420323189]
[null,null,null,"Sum of 3. Prepađevine",158.23500000000001,469.29563236635511]
[null,null,null,"Sum of Grand Total",638.14900000000011,2474.0978316473738]
[null,11,"ALF STR","Sum of 1. Sveži proizvodi",247.53699999999998,1453.0597798138849]
[null,null,null,"Sum of 2. Smrznuti proizvodi",0,24.38474937974226]
[null,null,null,"Sum of 3. Prepađevine",169.9,741.35376305256966]
[null,null,null,"Sum of Grand Total",417.43700000000001,2218.798292246197]
[null,12,"TIMOR DOO","Sum of 1. Sveži proizvodi",0,0]
[null,null,null,"Sum of 2. Smrznuti proizvodi",0,337.56700803819064]
[null,null,null,"Sum of 3. Prepađevine",858,1772.8832258624989]
[null,null,null,"Sum of Grand Total",858,2110.4502339006899]
[null,13,"MR.CARDBOX DOO","Sum of 1. Sveži proizvodi",82.230999999999995,1131.3342772031899]
[null,null,null,"Sum of 2. Smrznuti proizvodi",79.078000000000003,324.26798225765361]
[null,null,null,"Sum of 3. Prepađevine",59.2,403.36279493219115]
[null,null,null,"Sum of Grand Total",220.50899999999999,1858.9650543930345]
[null,14,"RIČ DOO PROKUPLJE","Sum of 1. Sveži proizvodi",0,0]
[null,null,null,"Sum of 2. Smrznuti proizvodi",83.097000000000008,604.9013780503592]
[null,null,null,"Sum of 3. Prepađevine",551.78399999999999,1137.3427265854975]
[null,null,null,"Sum of Grand Total",634.88099999999997,1742.244104635857]
[null,15,"DAKOM DOO","Sum of 1. Sveži proizvodi",0,1441.076183049684]
[null,null,null,"Sum of 2. Smrznuti proizvodi",0,0]
[null,null,null,"Sum of 3. Prepađevine",0,0]
[null,null,null,"Sum of Grand Total",0,1441.076183049684]
[null,16,"MUP UPRAVA ZA POSLOVE ISHRANE I SMEŠTAJA","Sum of 1. Sveži proizvodi",0,0]
[null,null,null,"Sum of 2. Smrznuti proizvodi",464.76000000000005,1285.8517165835854]
[null,null,null,"Sum of 3. Prepađevine",0,0]
[null,null,null,"Sum of Grand Total",464.76000000000005,1285.8517165835854]
[null,17,"KTK-KOMERC DOO","Sum of 1. Sveži proizvodi",0,474.37931081410147]
[null,null,null,"Sum of 2. Smrznuti proizvodi",21,0]
[null,null,null,"Sum of 3. Prepađevine",271.25400000000002,792.85658753830546]
[null,null,null,"Sum of Grand Total",292.25400000000002,1267.235898352407]
[null,18,"METRO CASH & CARRY DOO","Sum of 1. Sveži proizvodi",222.98500000000001,724.2583092248874]
[null,null,null,"Sum of 2. Smrznuti proizvodi",21.606000000000002,22.467322663623225]
[null,null,null,"Sum of 3. Prepađevine",66.099999999999994,438.17747467222546]
[null,null,null,"Sum of Grand Total",310.69100000000003,1184.9031065607362]
[null,19,"PROLOM BANJA SB ZA REHABILITACIJU","Sum of 1. Sveži proizvodi",0,0]
[null,null,null,"Sum of 2. Smrznuti proizvodi",430.34800000000001,1070.3659995229855]
[null,null,null,"Sum of 3. Prepađevine",0,0]
[null,null,null,"Sum of Grand Total",430.34800000000001,1070.3659995229855]
[null,20,"DVA BRATA STR","Sum of 1. Sveži proizvodi",136.54400000000001,869.9904247269526]
[null,null,null,"Sum of 2. Smrznuti proizvodi",0,23.484314522406475]
[null,null,null,"Sum of 3. Prepađevine",0,13.448884782398036]
[null,null,null,"Sum of Grand Total",136.54400000000001,906.92362403175707]
["KC Niš Sum of 1. Sveži proizvodi",null,null,null,16050.751000000004,37652.90804843443]
["KC Niš Sum of 2. Smrznuti proizvodi",null,null,null,1771.826,7260.2651736223006]
["KC Niš Sum of 3. Prepađevine",null,null,null,5512.5,15819.982088458613]
["KC Niš Sum of Grand Total",null,null,null,23335.077000000008,60733.155310515343]
["Total Sum of 1. Sveži proizvodi",null,null,null,69199.819000000018,102993.20457505881]
["Total Sum of 2. Smrznuti proizvodi",null,null,null,4435.2380000000012,10907.972260007811]
["Total Sum of 3. Prepađevine",null,null,null,14684.1,26139.843434447957]
["Total Sum of Grand Total",null,null,null,88319.157000000021,140041.02026951459]

{"sheet":"KUMULATIV 3","index":5,"n_rows":258,"n_cols":6,"rows_kept":258,"cut":false,"hidden":false,"merged":[]}
[null,null,null,null,"PR/P"]
["KC","Values","RB","KUPAC","PR","P"]
["KC Beograd","Sum of 1. Sveži proizvodi",1,"DELHAIZE SERBIA DOO",16466.732999999997,14494.631583747108]
[null,null,2,"IDEA DOO",10500.770000000002,8951.6494666749859]
[null,null,3,"MERCATOR S",3493.5020000000004,4961.429769043003]
[null,null,4,"ŠTRAND DOO",5020.0519999999997,4733.4799287609867]
[null,null,5,"METRO CASH & CARRY DOO",1324.682,3633.4822012378954]
[null,null,6,"UNIVEREXPORT DOO",4018.2729999999997,3130.5387163377691]
[null,null,7,"AMAN DOO",127.49600000000001,2120.6249502013625]
[null,null,8,"MESO-MARKET",1782.3959999999997,2157.9594355043478]
[null,null,9,"MUP UPRAVA ZA POSLOVE ISHRANE I SMEŠTAJA",0,0]
[null,null,10,"ĐERIĆ STR",383.33799999999997,1150.9377827293422]
[null,null,11,"TP DOO TREND COMERCCE ŠID",0,0]
[null,null,12,"VINDIJA D.O.O. LAJKOVAC - VLASTITA POTROŠNJA",0,330.48912939923986]
[null,null,13,"PODUNAVLJE AD, BEOGRAD",459.22899999999998,228.69174838089322]
[null,null,14,"POINT MARTINOVIĆ DOO",0,582.48172548905154]
[null,null,15,"MIS CHILLI DOO",190.82,320.04928704627008]
[null,null,16,"VEROPOULOS DOO",134.98400000000001,391.7058451259665]
[null,null,17,"JOVANA STR",250.92999999999998,377.77391155772864]
[null,null,18,"SLAVONAC STUR, ISMETA MUJEZINOVIĆA",0,400.33019471933579]
[null,null,19,"MEDIUS DOO",10.173,62.53810907725525]
[null,null,20,"FAMOSO",0,353.79984391663419]
[null,"Sum of 2. Smrznuti proizvodi",1,"DELHAIZE SERBIA DOO",0,0]
[null,null,2,"IDEA DOO",0,0]
[null,null,3,"MERCATOR S",46.536000000000001,105.73765303400943]
[null,null,4,"ŠTRAND DOO",0,0]
[null,null,5,"METRO CASH & CARRY DOO",0,44.624538796281669]
[null,null,6,"UNIVEREXPORT DOO",0,0]
[null,null,7,"AMAN DOO",0,0]
[null,null,8,"MESO-MARKET",0,0]
[null,null,9,"MUP UPRAVA ZA POSLOVE ISHRANE I SMEŠTAJA",1251.989,1239.2472365608749]
[null,null,10,"ĐERIĆ STR",0,0]
[null,null,11,"TP DOO TREND COMERCCE ŠID",230.79000000000002,179.80550730820852]
[null,null,12,"VINDIJA D.O.O. LAJKOVAC - VLASTITA POTROŠNJA",0,204.30403376907049]
[null,null,13,"PODUNAVLJE AD, BEOGRAD",613.11699999999996,332.95924695196544]
[null,null,14,"POINT MARTINOVIĆ DOO",0,4.2476610489563793]
[null,null,15,"MIS CHILLI DOO",0,0]
[null,null,16,"VEROPOULOS DOO",0,3.6488216729845075]
[null,null,17,"JOVANA STR",0,0]
[null,null,18,"SLAVONAC STUR, ISMETA MUJEZINOVIĆA",0,0]
[null,null,19,"MEDIUS DOO",0,0]
[null,null,20,"FAMOSO",0,0]
[null,"Sum of 3. Prepađevine",1,"DELHAIZE SERBIA DOO",332.72899999999998,2058.1228929243084]
[null,null,2,"IDEA DOO",1496.2550000000001,124.8268914941724]
[null,null,3,"MERCATOR S",598.55700000000002,1033.4605250719551]
[null,null,4,"ŠTRAND DOO",0,0]
[null,null,5,"METRO CASH & CARRY DOO",260.5,723.0852642438565]
[null,null,6,"UNIVEREXPORT DOO",533.9,314.48554554365694]
[null,null,7,"AMAN DOO",1841.0940000000001,970.87649738602181]
[null,null,8,"MESO-MARKET",13.285,23.408623616887809]
[null,null,9,"MUP UPRAVA ZA POSLOVE ISHRANE I SMEŠTAJA",0,0]
[null,null,10,"ĐERIĆ STR",13,0]
[null,null,11,"TP DOO TREND COMERCCE ŠID",531.63499999999999,552.61717318773185]
[null,null,12,"VINDIJA D.O.O. LAJKOVAC - VLASTITA POTROŠNJA",0,146.46024857063151]
[null,null,13,"PODUNAVLJE AD, BEOGRAD",141.649,69.105608595993644]
[null,null,14,"POINT MARTINOVIĆ DOO",0,0]
[null,null,15,"MIS CHILLI DOO",227.61699999999996,262.16034222442136]
[null,null,16,"VEROPOULOS DOO",251.66300000000001,117.9592133021806]
[null,null,17,"JOVANA STR",48.111000000000004,69.936697463787297]
[null,null,18,"SLAVONAC STUR, ISMETA MUJEZINOVIĆA",0,0]
[null,null,19,"MEDIUS DOO",216.56399999999999,325.64983933435178]
[null,null,20,"FAMOSO",0,0]
[null,"Sum of Grand Total",1,"DELHAIZE SERBIA DOO",16799.462,16552.75447667142]
[null,null,2,"IDEA DOO",11997.025000000001,9076.4763581691586]
[null,null,3,"MERCATOR S",4138.5950000000003,6100.627947148967]
[null,null,4,"ŠTRAND DOO",5020.0519999999997,4733.4799287609867]
[null,null,5,"METRO CASH & CARRY DOO",1585.182,4401.1920042780321]
[null,null,6,"UNIVEREXPORT DOO",4552.1729999999998,3445.0242618814264]
[null,null,7,"AMAN DOO",1968.5900000000001,3091.5014475873845]
[null,null,8,"MESO-MARKET",1795.6809999999998,2181.368059121236]
[null,null,9,"MUP UPRAVA ZA POSLOVE ISHRANE I SMEŠTAJA",1251.989,1239.2472365608749]
[null,null,10,"ĐERIĆ STR",396.33799999999997,1150.9377827293422]
[null,null,11,"TP DOO TREND COMERCCE ŠID",762.42500000000007,732.42268049594009]
[null,null,12,"VINDIJA D.O.O. LAJKOVAC - VLASTITA POTROŠNJA",0,681.25341173894174]
[null,null,13,"PODUNAVLJE AD, BEOGRAD",1213.9949999999999,630.75660392885243]
[null,null,14,"POINT MARTINOVIĆ DOO",0,586.72938653800793]
[null,null,15,"MIS CHILLI DOO",418.43700000000001,582.20962927069149]
[null,null,16,"VEROPOULOS DOO",386.64699999999999,513.31388010113164]
[null,null,17,"JOVANA STR",299.041,447.71060902151589]
[null,null,18,"SLAVONAC STUR, ISMETA MUJEZINOVIĆA",0,400.33019471933579]
[null,null,19,"MEDIUS DOO",226.73699999999999,388.18794841160707]
[null,null,20,"FAMOSO",0,353.79984391663419]
["KC Beograd Sum of 1. Sveži proizvodi",null,null,null,44163.378000000004,48382.593628949166]
["KC Beograd Sum of 2. Smrznuti proizvodi",null,null,null,2142.4319999999998,2114.5746991423507]
["KC Beograd Sum of 3. Prepađevine",null,null,null,6506.5590000000002,6792.1553629599575]
["KC Beograd Sum of Grand Total",null,null,null,52812.369000000013,57289.323691051482]
["KC Lajkovac","Sum of 1. Sveži proizvodi",1,"MERCATOR S",2022.1940000000004,2970.3480897778995]
[null,null,2,"IDEA DOO",2605.3720000000003,3215.660539290297]
[null,null,3,"FORTUNA MARKET DOO",652.57400000000007,1257.3830045251975]
[null,null,4,"ES KOMERC DOO",1041.5740000000001,1582.6231168722084]
[null,null,5,"PREHRANA DOO",787.49300000000005,1436.6341513867922]
[null,null,6,"EUROPROM DOO",414.00899999999996,788.20098673353482]
[null,null,7,"TP KVIN DOO",0,957.11833316561513]
[null,null,8,"DIVČIBARAC DOO, RAŽANA",73.782000000000011,802.73613073748311]
[null,null,9,"KMN STKUR",283.63599999999997,644.68179627954578]
[null,null,10,"DRAGANA SZTPR",97.596999999999994,502.21339605599962]
[null,null,11,"GREEN STR",374.72899999999998,440.95788670402663]
[null,null,12,"MRM KOLAREVIĆ DOO",266.35400000000004,407.6419118466647]
[null,null,13,"ĐOKIĆ SZTR",24.036999999999999,419.16898253786792]
[null,null,14,"NIKOLA TPD DOO",99.88,262.34971733037872]
[null,null,15,"MIROPROMET DOO",0,137.8232604293359]
[null,null,16,"ZORNIĆ SZTR",0,412.38991350016755]
[null,null,17,"ZDRAVSTVENI CENTAR VALJEVO",217.595,239.33083248631647]
[null,null,18,"DUĆAN STR LAZAREVAC",0,276.40144694259772]
[null,null,19,"ŽI-NA-SA STUZR",18.712,200.23496615731699]
[null,null,20,"METALAC-PROLETER AD",6.1520000000000001,3.8044349159621582]
[null,"Sum of 2. Smrznuti proizvodi",1,"MERCATOR S",11.108000000000001,35.866076641100406]
[null,null,2,"IDEA DOO",0,0]
[null,null,3,"FORTUNA MARKET DOO",0,0]
[null,null,4,"ES KOMERC DOO",91.923999999999992,376.56163768368356]
[null,null,5,"PREHRANA DOO",0,27.54480665294356]
[null,null,6,"EUROPROM DOO",108.146,304.8233054205358]
[null,null,7,"TP KVIN DOO",0,104.81259992464507]
[null,null,8,"DIVČIBARAC DOO, RAŽANA",0,3.3784487000925063]
[null,null,9,"KMN STKUR",0,0]
[null,null,10,"DRAGANA SZTPR",0,0]
[null,null,11,"GREEN STR",0,0]
[null,null,12,"MRM KOLAREVIĆ DOO",0,64.009880976427226]
[null,null,13,"ĐOKIĆ SZTR",0,0]
[null,null,14,"NIKOLA TPD DOO",24.317999999999998,73.903156411372677]
[null,null,15,"MIROPROMET DOO",0,67.734716079014404]
[null,null,16,"ZORNIĆ SZTR",0,8.9504356363397477]
[null,null,17,"ZDRAVSTVENI CENTAR VALJEVO",123.068,146.95797508568069]
[null,null,18,"DUĆAN STR LAZAREVAC",0,0]
[null,null,19,"ŽI-NA-SA STUZR",13.376000000000001,42.019978194760029]
[null,null,20,"METALAC-PROLETER AD",149.04000000000002,276.56936983656692]
[null,"Sum of 3. Prepađevine",1,"MERCATOR S",389.99900000000002,345.14260997702445]
[null,null,2,"IDEA DOO",238.65300000000002,10.358879822768845]
[null,null,3,"FORTUNA MARKET DOO",717.71100000000001,1189.3982214525672]
[null,null,4,"ES KOMERC DOO",390.85,322.94262184316216]
[null,null,5,"PREHRANA DOO",147.31200000000001,84.260218886804182]
[null,null,6,"EUROPROM DOO",349.31999999999994,361.02331794953034]
[null,null,7,"TP KVIN DOO",0,273.86552046809044]
[null,null,8,"DIVČIBARAC DOO, RAŽANA",35.4,47.812591097758869]
[null,null,9,"KMN STKUR",0,2.1808168047934413]
[null,null,10,"DRAGANA SZTPR",70.704999999999998,117.06551914237701]
[null,null,11,"GREEN STR",60.5,174.6972379037183]
[null,null,12,"MRM KOLAREVIĆ DOO",17.25,25.533730089456544]
[null,null,13,"ĐOKIĆ SZTR",0,25.247679618561133]
[null,null,14,"NIKOLA TPD DOO",140.14699999999999,95.113780654793672]
[null,null,15,"MIROPROMET DOO",0,223.85175827536008]
[null,null,16,"ZORNIĆ SZTR",0,4.1980723492273739]
[null,null,17,"ZDRAVSTVENI CENTAR VALJEVO",0,0]
[null,null,18,"DUĆAN STR LAZAREVAC",0,85.670480420570627]
[null,null,19,"ŽI-NA-SA STUZR",65.194000000000003,95.563028916581175]
[null,null,20,"METALAC-PROLETER AD",42,43.779897356228332]
[null,"Sum of Grand Total",1,"MERCATOR S",2423.3010000000004,3351.3567763960236]
[null,null,2,"IDEA DOO",2844.0249999999996,3226.0194191130663]
[null,null,3,"FORTUNA MARKET DOO",1370.2849999999999,2446.7812259777647]
[null,null,4,"ES KOMERC DOO",1524.348,2282.1273763990534]
[null,null,5,"PREHRANA DOO",934.80500000000006,1548.4391769265399]
[null,null,6,"EUROPROM DOO",871.47499999999991,1454.0476101036013]
[null,null,7,"TP KVIN DOO",0,1335.7964535583508]
[null,null,8,"DIVČIBARAC DOO, RAŽANA",109.18200000000002,853.9271705353342]
[null,null,9,"KMN STKUR",283.63599999999997,646.86261308433927]
[null,null,10,"DRAGANA SZTPR",168.30199999999999,619.27891519837669]
[null,null,11,"GREEN STR",435.22899999999998,615.65512460774494]
[null,null,12,"MRM KOLAREVIĆ DOO",283.60400000000004,497.18552291254855]
[null,null,13,"ĐOKIĆ SZTR",24.036999999999999,444.41666215642908]
[null,null,14,"NIKOLA TPD DOO",264.34500000000003,431.36665439654507]
[null,null,15,"MIROPROMET DOO",0,429.40973478371041]
[null,null,16,"ZORNIĆ SZTR",0,425.53842148573472]
[null,null,17,"ZDRAVSTVENI CENTAR VALJEVO",340.66300000000001,386.28880757199715]
[null,null,18,"DUĆAN STR LAZAREVAC",0,362.07192736316836]
[null,null,19,"ŽI-NA-SA STUZR",97.282000000000011,337.81797326865819]
[null,null,20,"METALAC-PROLETER AD",197.19200000000001,324.15370210875744]
["KC Lajkovac Sum of 1. Sveži proizvodi",null,null,null,8985.6899999999987,16957.702897675204]
["KC Lajkovac Sum of 2. Smrznuti proizvodi",null,null,null,520.98,1533.1323872431624]
["KC Lajkovac Sum of 3. Prepađevine",null,null,null,2665.0410000000002,3527.7059830293742]
["KC Lajkovac Sum of Grand Total",null,null,null,12171.710999999999,22018.541267947741]
["KC Niš","Sum of 1. Sveži proizvodi",1,"PRIMA NOVA DOO",183.41000000000003,5312.8679379772329]
[null,null,2,"IDEA DOO",1409.7190000000001,7205.9060621780154]
[null,null,3,"BIFTEK, RADOJEVIĆ MILOŠ PREDUZETNIK, NIŠ",12889.468000000001,6535.3971816206122]
[null,null,4,"NECA SZTR",28.513000000000002,151.58045911315358]
[null,null,5,"INEX-UZOR AD",157.21,2355.9833212575068]
[null,null,6,"SAMALD-COMERC EXPORT-IMPORT DOO",0,2821.804017965324]
[null,null,7,"MERCATOR S",331.54700000000003,2744.5075133131159]
[null,null,8,"GLIDŽIĆ NIS DOO",0,2012.4578168376274]
[null,null,9,"TEKIJANKA DOO",37.691000000000003,696.22314826135118]
[null,null,10,"MIROČ A.D. KLADOVO",323.89599999999996,1722.0823050777867]
[null,null,11,"ALF STR",247.53699999999998,1453.0597798138849]
[null,null,12,"TIMOR DOO",0,0]
[null,null,13,"MR.CARDBOX DOO",82.230999999999995,1131.3342772031899]
[null,null,14,"RIČ DOO PROKUPLJE",0,0]
[null,null,15,"DAKOM DOO",0,1441.076183049684]
[null,null,16,"MUP UPRAVA ZA POSLOVE ISHRANE I SMEŠTAJA",0,0]
[null,null,17,"KTK-KOMERC DOO",0,474.37931081410147]
[null,null,18,"METRO CASH & CARRY DOO",222.98500000000001,724.2583092248874]
[null,null,19,"PROLOM BANJA SB ZA REHABILITACIJU",0,0]
[null,null,20,"DVA BRATA STR",136.54400000000001,869.9904247269526]
[null,"Sum of 2. Smrznuti proizvodi",1,"PRIMA NOVA DOO",60,150.37390202124709]
[null,null,2,"IDEA DOO",0,0]
[null,null,3,"BIFTEK, RADOJEVIĆ MILOŠ PREDUZETNIK, NIŠ",0,0]
[null,null,4,"NECA SZTR",231.72599999999997,1121.2950049246717]
[null,null,5,"INEX-UZOR AD",40.267000000000003,969.15609688150676]
[null,null,6,"SAMALD-COMERC EXPORT-IMPORT DOO",0,0]
[null,null,7,"MERCATOR S",0,0]
[null,null,8,"GLIDŽIĆ NIS DOO",0,806.01728193250892]
[null,null,9,"TEKIJANKA DOO",183.92600000000002,237.41252264058767]
[null,null,10,"MIROČ A.D. KLADOVO",156.01800000000003,282.71989420323189]
[null,null,11,"ALF STR",0,24.38474937974226]
[null,null,12,"TIMOR DOO",0,337.56700803819064]
[null,null,13,"MR.CARDBOX DOO",79.078000000000003,324.26798225765361]
[null,null,14,"RIČ DOO PROKUPLJE",83.097000000000008,604.9013780503592]
[null,null,15,"DAKOM DOO",0,0]
[null,null,16,"MUP UPRAVA ZA POSLOVE ISHRANE I SMEŠTAJA",464.76000000000005,1285.8517165835854]
[null,null,17,"KTK-KOMERC DOO",21,0]
[null,null,18,"METRO CASH & CARRY DOO",21.606000000000002,22.467322663623225]
[null,null,19,"PROLOM BANJA SB ZA REHABILITACIJU",430.34800000000001,1070.3659995229855]
[null,null,20,"DVA BRATA STR",0,23.484314522406475]
[null,"Sum of 3. Prepađevine",1,"PRIMA NOVA DOO",474.298,2490.285165540703]
[null,null,2,"IDEA DOO",376.71000000000004,194.3389467979911]
[null,null,3,"BIFTEK, RADOJEVIĆ MILOŠ PREDUZETNIK, NIŠ",0,0]
[null,null,4,"NECA SZTR",1844.9289999999994,4459.9550352315891]
[null,null,5,"INEX-UZOR AD",104.4,405.70802426900735]
[null,null,6,"SAMALD-COMERC EXPORT-IMPORT DOO",0,473.22142587664575]
[null,null,7,"MERCATOR S",42.55,402.21643761026291]
[null,null,8,"GLIDŽIĆ NIS DOO",0,0]
[null,null,9,"TEKIJANKA DOO",535.1400000000001,1625.5359633403759]
[null,null,10,"MIROČ A.D. KLADOVO",158.23500000000001,469.29563236635511]
[null,null,11,"ALF STR",169.9,741.35376305256966]
[null,null,12,"TIMOR DOO",858,1772.8832258624989]
[null,null,13,"MR.CARDBOX DOO",59.2,403.36279493219115]
[null,null,14,"RIČ DOO PROKUPLJE",551.78399999999999,1137.3427265854975]
[null,null,15,"DAKOM DOO",0,0]
[null,null,16,"MUP UPRAVA ZA POSLOVE ISHRANE I SMEŠTAJA",0,0]
[null,null,17,"KTK-KOMERC DOO",271.25400000000002,792.85658753830546]
[null,null,18,"METRO CASH & CARRY DOO",66.099999999999994,438.17747467222546]
[null,null,19,"PROLOM BANJA SB ZA REHABILITACIJU",0,0]
[null,null,20,"DVA BRATA STR",0,13.448884782398036]
[null,"Sum of Grand Total",1,"PRIMA NOVA DOO",717.70799999999986,7953.5270055391848]
[null,null,2,"IDEA DOO",1786.4290000000001,7400.2450089760041]
[null,null,3,"BIFTEK, RADOJEVIĆ MILOŠ PREDUZETNIK, NIŠ",12889.468000000001,6535.3971816206122]
[null,null,4,"NECA SZTR",2105.1679999999997,5732.8304992694138]
[null,null,5,"INEX-UZOR AD",301.87700000000001,3730.8474424080196]
[null,null,6,"SAMALD-COMERC EXPORT-IMPORT DOO",0,3295.0254438419697]
[null,null,7,"MERCATOR S",374.09699999999998,3146.7239509233791]
[null,null,8,"GLIDŽIĆ NIS DOO",0,2818.4750987701373]
[null,null,9,"TEKIJANKA DOO",756.75700000000006,2559.1716342423156]
[null,null,10,"MIROČ A.D. KLADOVO",638.14900000000011,2474.0978316473738]
[null,null,11,"ALF STR",417.43700000000001,2218.798292246197]
[null,null,12,"TIMOR DOO",858,2110.4502339006899]
[null,null,13,"MR.CARDBOX DOO",220.50899999999999,1858.9650543930345]
[null,null,14,"RIČ DOO PROKUPLJE",634.88099999999997,1742.244104635857]
[null,null,15,"DAKOM DOO",0,1441.076183049684]
[null,null,16,"MUP UPRAVA ZA POSLOVE ISHRANE I SMEŠTAJA",464.76000000000005,1285.8517165835854]
[null,null,17,"KTK-KOMERC DOO",292.25400000000002,1267.235898352407]
[null,null,18,"METRO CASH & CARRY DOO",310.69100000000003,1184.9031065607362]
[null,null,19,"PROLOM BANJA SB ZA REHABILITACIJU",430.34800000000001,1070.3659995229855]
[null,null,20,"DVA BRATA STR",136.54400000000001,906.92362403175707]
["KC Niš Sum of 1. Sveži proizvodi",null,null,null,16050.751000000004,37652.90804843443]
["KC Niš Sum of 2. Smrznuti proizvodi",null,null,null,1771.826,7260.2651736223006]
["KC Niš Sum of 3. Prepađevine",null,null,null,5512.5,15819.982088458613]
["KC Niš Sum of Grand Total",null,null,null,23335.077000000008,60733.155310515343]
["Total Sum of 1. Sveži proizvodi",null,null,null,69199.819000000018,102993.20457505881]
["Total Sum of 2. Smrznuti proizvodi",null,null,null,4435.2380000000012,10907.972260007811]
["Total Sum of 3. Prepađevine",null,null,null,14684.1,26139.843434447957]
["Total Sum of Grand Total",null,null,null,88319.157000000021,140041.02026951459]

{"sheet":"PRORAČUNI","index":6,"n_rows":62,"n_cols":23,"rows_kept":62,"cut":false,"hidden":false,"merged":[]}
[null,null,null,"PROŠLA GODINA",null,null,{"$f":"D1","v":"PROŠLA GODINA"},"Index",null,null,"Index","DNEVNA PRODAJA",null,null,null,"DNEVNI PLAN",null,null,null,"INDEX"]
["KC","KUPAC",null,"1. Sveži proizvodi","2. Smrznuti proizvodi","3. Prepađevine","Grand Total","1. Sveži proizvodi","2. Smrznuti proizvodi","3. Prepađevine","Grand Total","1. Sveži proizvodi","2. Smrznuti proizvodi","3. Prepađevine","Grand Total","1. Sveži proizvodi","2. Smrznuti proizvodi","3. Prepađevine","Grand Total","1. Sveži proizvodi","2. Smrznuti proizvodi","3. Prepađevine","Grand Total"]
[{"$f":"#REF!","v":{"$error":"#REF!"}},{"$f":"#REF!","v":{"$error":"#REF!"}},{"$f":"#REF!","v":{"$error":"#REF!"}},{"$f":"#REF!","v":{"$error":"#REF!"}},{"$f":"#REF!","v":{"$error":"#REF!"}},{"$f":"#REF!","v":{"$error":"#REF!"}},{"$f":"#REF!","v":{"$error":"#REF!"}},{"$f":"D3/$G3","v":{"$error":"#REF!"}},{"$f":"E3/$G3","v":{"$error":"#REF!"}},{"$error":"#REF!"},{"$f":"G3/#REF!","v":{"$error":"#REF!"}},{"$f":"IFERROR(INDEX(#REF!,MATCH(PRORAČUNI!$C3,#REF!,),MATCH(\"1. Sveži proizvodi\",#REF!,)),0)","v":0},{"$f":"IFERROR(INDEX(#REF!,MATCH(PRORAČUNI!$C3,#REF!,),MATCH(\"2. Smrznuti proizvodi\",#REF!,)),0)","v":0},{"$f":"IFERROR(INDEX(#REF!,MATCH(PRORAČUNI!$C3,#REF!,),MATCH(\"3. Prepađevine\",#REF!,)),0)","v":0},{"$f":"SUM(L3:N3)","v":0},{"$f":"KUMULATIV!W5","v":{"$error":"#REF!"}},{"$f":"KUMULATIV!X5","v":{"$error":"#REF!"}},{"$f":"KUMULATIV!Y5","v":{"$error":"#REF!"}},{"$f":"KUMULATIV!Z5","v":{"$error":"#REF!"}},{"$f":"IFERROR(L3/P3,0)","v":0},{"$f":"IFERROR(M3/Q3,0)","v":0},0,0]
[null,{"$f":"#REF!","v":{"$error":"#REF!"}},{"$f":"#REF!","v":{"$error":"#REF!"}},{"$f":"#REF!","v":{"$error":"#REF!"}},{"$f":"#REF!","v":{"$error":"#REF!"}},{"$f":"#REF!","v":{"$error":"#REF!"}},{"$f":"#REF!","v":{"$error":"#REF!"}},{"$f":"D4/$G4","v":{"$error":"#REF!"}},{"$f":"E4/$G4","v":{"$error":"#REF!"}},{"$f":"F4/$G4","v":{"$error":"#REF!"}},{"$f":"G4/#REF!","v":{"$error":"#REF!"}},{"$f":"IFERROR(INDEX(#REF!,MATCH(PRORAČUNI!$C4,#REF!,),MATCH(\"1. Sveži proizvodi\",#REF!,)),0)","v":0},{"$f":"IFERROR(INDEX(#REF!,MATCH(PRORAČUNI!$C4,#REF!,),MATCH(\"2. Smrznuti proizvodi\",#REF!,)),0)","v":0},{"$f":"IFERROR(INDEX(#REF!,MATCH(PRORAČUNI!$C4,#REF!,),MATCH(\"3. Prepađevine\",#REF!,)),0)","v":0},{"$f":"SUM(L4:N4)","v":0},{"$f":"KUMULATIV!W6","v":{"$error":"#REF!"}},{"$f":"KUMULATIV!X6","v":{"$error":"#REF!"}},{"$f":"KUMULATIV!Y6","v":{"$error":"#REF!"}},{"$f":"KUMULATIV!Z6","v":{"$error":"#REF!"}},{"$f":"IFERROR(L4/P4,0)","v":0},{"$f":"IFERROR(M4/Q4,0)","v":0},{"$f":"IFERROR(N4/R4,0)","v":0},{"$f":"IFERROR(O4/S4,0)","v":0}]
[null,{"$f":"#REF!","v":{"$error":"#REF!"}},{"$f":"#REF!","v":{"$error":"#REF!"}},{"$f":"#REF!","v":{"$error":"#REF!"}},{"$f":"#REF!","v":{"$error":"#REF!"}},{"$f":"#REF!","v":{"$error":"#REF!"}},{"$f":"#REF!","v":{"$error":"#REF!"}},{"$error":"#REF!"},{"$error":"#REF!"},{"$error":"#REF!"},{"$f":"G5/#REF!","v":{"$error":"#REF!"}},{"$f":"IFERROR(INDEX(#REF!,MATCH(PRORAČUNI!$C5,#REF!,),MATCH(\"1. Sveži proizvodi\",#REF!,)),0)","v":0},{"$f":"IFERROR(INDEX(#REF!,MATCH(PRORAČUNI!$C5,#REF!,),MATCH(\"2. Smrznuti proizvodi\",#REF!,)),0)","v":0},{"$f":"IFERROR(INDEX(#REF!,MATCH(PRORAČUNI!$C5,#REF!,),MATCH(\"3. Prepađevine\",#REF!,)),0)","v":0},0,{"$f":"KUMULATIV!W7","v":{"$error":"#REF!"}},{"$f":"KUMULATIV!X7","v":{"$error":"#REF!"}},{"$f":"KUMULATIV!Y7","v":{"$error":"#REF!"}},{"$f":"KUMULATIV!Z7","v":{"$error":"#REF!"}},0,0,0,0]
[null,{"$f":"#REF!","v":{"$error":"#REF!"}},{"$f":"#REF!","v":{"$error":"#REF!"}},{"$f":"#REF!","v":{"$error":"#REF!"}},{"$f":"#REF!","v":{"$error":"#REF!"}},{"$f":"#REF!","v":{"$error":"#REF!"}},{"$f":"#REF!","v":{"$error":"#REF!"}},{"$error":"#REF!"},{"$error":"#REF!"},{"$error":"#REF!"},{"$f":"G6/#REF!","v":{"$error":"#REF!"}},{"$f":"IFERROR(INDEX(#REF!,MATCH(PRORAČUNI!$C6,#REF!,),MATCH(\"1. Sveži proizvodi\",#REF!,)),0)","v":0},{"$f":"IFERROR(INDEX(#REF!,MATCH(PRORAČUNI!$C6,#REF!,),MATCH(\"2. Smrznuti proizvodi\",#REF!,)),0)","v":0},{"$f":"IFERROR(INDEX(#REF!,MATCH(PRORAČUNI!$C6,#REF!,),MATCH(\"3. Prepađevine\",#REF!,)),0)","v":0},0,{"$f":"KUMULATIV!W8","v":{"$error":"#REF!"}},{"$f":"KUMULATIV!X8","v":{"$error":"#REF!"}},{"$f":"KUMULATIV!Y8","v":{"$error":"#REF!"}},{"$f":"KUMULATIV!Z8","v":{"$error":"#REF!"}},0,0,0,0]
[null,{"$f":"#REF!","v":{"$error":"#REF!"}},{"$f":"#REF!","v":{"$error":"#REF!"}},{"$f":"#REF!","v":{"$error":"#REF!"}},{"$f":"#REF!","v":{"$error":"#REF!"}},{"$f":"#REF!","v":{"$error":"#REF!"}},{"$f":"#REF!","v":{"$error":"#REF!"}},{"$error":"#REF!"},{"$error":"#REF!"},{"$error":"#REF!"},{"$f":"G7/#REF!","v":{"$error":"#REF!"}},{"$f":"IFERROR(INDEX(#REF!,MATCH(PRORAČUNI!$C7,#REF!,),MATCH(\"1. Sveži proizvodi\",#REF!,)),0)","v":0},{"$f":"IFERROR(INDEX(#REF!,MATCH(PRORAČUNI!$C7,#REF!,),MATCH(\"2. Smrznuti proizvodi\",#REF!,)),0)","v":0},{"$f":"IFERROR(INDEX(#REF!,MATCH(PRORAČUNI!$C7,#REF!,),MATCH(\"3. Prepađevine\",#REF!,)),0)","v":0},0,{"$f":"KUMULATIV!W9","v":{"$error":"#REF!"}},{"$f":"KUMULATIV!X9","v":{"$error":"#REF!"}},{"$f":"KUMULATIV!Y9","v":{"$error":"#REF!"}},{"$f":"KUMULATIV!Z9","v":{"$error":"#REF!"}},0,0,0,0]
[null,{"$f":"#REF!","v":{"$error":"#REF!"}},{"$f":"#REF!","v":{"$error":"#REF!"}},{"$f":"#REF!","v":{"$error":"#REF!"}},{"$f":"#REF!","v":{"$error":"#REF!"}},{"$f":"#REF!","v":{"$error":"#REF!"}},{"$f":"#REF!","v":{"$error":"#REF!"}},{"$error":"#REF!"},{"$error":"#REF!"},{"$error":"#REF!"},{"$f":"G8/#REF!","v":{"$error":"#REF!"}},{"$f":"IFERROR(INDEX(#REF!,MATCH(PRORAČUNI!$C8,#REF!,),MATCH(\"1. Sveži proizvodi\",#REF!,)),0)","v":0},{"$f":"IFERROR(INDEX(#REF!,MATCH(PRORAČUNI!$C8,#REF!,),MATCH(\"2. Smrznuti proizvodi\",#REF!,)),0)","v":0},{"$f":"IFERROR(INDEX(#REF!,MATCH(PRORAČUNI!$C8,#REF!,),MATCH(\"3. Prepađevine\",#REF!,)),0)","v":0},0,{"$f":"KUMULATIV!W10","v":{"$error":"#REF!"}},{"$f":"KUMULATIV!X10","v":{"$error":"#REF!"}},{"$f":"KUMULATIV!Y10","v":{"$error":"#REF!"}},{"$f":"KUMULATIV!Z10","v":{"$error":"#REF!"}},0,0,0,0]
[null,{"$f":"#REF!","v":{"$error":"#REF!"}},{"$f":"#REF!","v":{"$error":"#REF!"}},{"$f":"#REF!","v":{"$error":"#REF!"}},{"$f":"#REF!","v":{"$error":"#REF!"}},{"$f":"#REF!","v":{"$error":"#REF!"}},{"$f":"#REF!","v":{"$error":"#REF!"}},{"$error":"#REF!"},{"$error":"#REF!"},{"$error":"#REF!"},{"$f":"G9/#REF!","v":{"$error":"#REF!"}},{"$f":"IFERROR(INDEX(#REF!,MATCH(PRORAČUNI!$C9,#REF!,),MATCH(\"1. Sveži proizvodi\",#REF!,)),0)","v":0},{"$f":"IFERROR(INDEX(#REF!,MATCH(PRORAČUNI!$C9,#REF!,),MATCH(\"2. Smrznuti proizvodi\",#REF!,)),0)","v":0},{"$f":"IFERROR(INDEX(#REF!,MATCH(PRORAČUNI!$C9,#REF!,),MATCH(\"3. Prepađevine\",#REF!,)),0)","v":0},0,{"$f":"KUMULATIV!W11","v":{"$error":"#REF!"}},{"$f":"KUMULATIV!X11","v":{"$error":"#REF!"}},{"$f":"KUMULATIV!Y11","v":{"$error":"#REF!"}},{"$f":"KUMULATIV!Z11","v":{"$error":"#REF!"}},0,0,0,0]
[null,{"$f":"#REF!","v":{"$error":"#REF!"}},{"$f":"#REF!","v":{"$error":"#REF!"}},{"$f":"#REF!","v":{"$error":"#REF!"}},{"$f":"#REF!","v":{"$error":"#REF!"}},{"$f":"#REF!","v":{"$error":"#REF!"}},{"$f":"#REF!","v":{"$error":"#REF!"}},{"$error":"#REF!"},{"$error":"#REF!"},{"$error":"#REF!"},{"$f":"G10/#REF!","v":{"$error":"#REF!"}},{"$f":"IFERROR(INDEX(#REF!,MATCH(PRORAČUNI!$C10,#REF!,),MATCH(\"1. Sveži proizvodi\",#REF!,)),0)","v":0},{"$f":"IFERROR(INDEX(#REF!,MATCH(PRORAČUNI!$C10,#REF!,),MATCH(\"2. Smrznuti proizvodi\",#REF!,)),0)","v":0},{"$f":"IFERROR(INDEX(#REF!,MATCH(PRORAČUNI!$C10,#REF!,),MATCH(\"3. Prepađevine\",#REF!,)),0)","v":0},0,{"$f":"KUMULATIV!W12","v":{"$error":"#REF!"}},{"$f":"KUMULATIV!X12","v":{"$error":"#REF!"}},{"$f":"KUMULATIV!Y12","v":{"$error":"#REF!"}},{"$f":"KUMULATIV!Z12","v":{"$error":"#REF!"}},0,0,0,0]
[null,{"$f":"#REF!","v":{"$error":"#REF!"}},{"$f":"#REF!","v":{"$error":"#REF!"}},{"$f":"#REF!","v":{"$error":"#REF!"}},{"$f":"#REF!","v":{"$error":"#REF!"}},{"$f":"#REF!","v":{"$error":"#REF!"}},{"$f":"#REF!","v":{"$error":"#REF!"}},{"$error":"#REF!"},{"$error":"#REF!"},{"$error":"#REF!"},{"$f":"G11/#REF!","v":{"$error":"#REF!"}},{"$f":"IFERROR(INDEX(#REF!,MATCH(PRORAČUNI!$C11,#REF!,),MATCH(\"1. Sveži proizvodi\",#REF!,)),0)","v":0},{"$f":"IFERROR(INDEX(#REF!,MATCH(PRORAČUNI!$C11,#REF!,),MATCH(\"2. Smrznuti proizvodi\",#REF!,)),0)","v":0},{"$f":"IFERROR(INDEX(#REF!,MATCH(PRORAČUNI!$C11,#REF!,),MATCH(\"3. Prepađevine\",#REF!,)),0)","v":0},0,{"$f":"KUMULATIV!W13","v":{"$error":"#REF!"}},{"$f":"KUMULATIV!X13","v":{"$error":"#REF!"}},{"$f":"KUMULATIV!Y13","v":{"$error":"#REF!"}},{"$f":"KUMULATIV!Z13","v":{"$error":"#REF!"}},0,0,0,0]
[null,{"$f":"#REF!","v":{"$error":"#REF!"}},{"$f":"#REF!","v":{"$error":"#REF!"}},{"$f":"#REF!","v":{"$error":"#REF!"}},{"$f":"#REF!","v":{"$error":"#REF!"}},{"$f":"#REF!","v":{"$error":"#REF!"}},{"$f":"#REF!","v":{"$error":"#REF!"}},{"$error":"#REF!"},{"$error":"#REF!"},{"$error":"#REF!"},{"$f":"G12/#REF!","v":{"$error":"#REF!"}},{"$f":"IFERROR(INDEX(#REF!,MATCH(PRORAČUNI!$C12,#REF!,),MATCH(\"1. Sveži proizvodi\",#REF!,)),0)","v":0},{"$f":"IFERROR(INDEX(#REF!,MATCH(PRORAČUNI!$C12,#REF!,),MATCH(\"2. Smrznuti proizvodi\",#REF!,)),0)","v":0},{"$f":"IFERROR(INDEX(#REF!,MATCH(PRORAČUNI!$C12,#REF!,),MATCH(\"3. Prepađevine\",#REF!,)),0)","v":0},0,{"$f":"KUMULATIV!W14","v":{"$error":"#REF!"}},{"$f":"KUMULATIV!X14","v":{"$error":"#REF!"}},{"$f":"KUMULATIV!Y14","v":{"$error":"#REF!"}},{"$f":"KUMULATIV!Z14","v":{"$error":"#REF!"}},0,0,0,0]
[null,{"$f":"#REF!","v":{"$error":"#REF!"}},{"$f":"#REF!","v":{"$error":"#REF!"}},{"$f":"#REF!","v":{"$error":"#REF!"}},{"$f":"#REF!","v":{"$error":"#REF!"}},{"$f":"#REF!","v":{"$error":"#REF!"}},{"$f":"#REF!","v":{"$error":"#REF!"}},{"$error":"#REF!"},{"$error":"#REF!"},{"$error":"#REF!"},{"$f":"G13/#REF!","v":{"$error":"#REF!"}},{"$f":"IFERROR(INDEX(#REF!,MATCH(PRORAČUNI!$C13,#REF!,),MATCH(\"1. Sveži proizvodi\",#REF!,)),0)","v":0},{"$f":"IFERROR(INDEX(#REF!,MATCH(PRORAČUNI!$C13,#REF!,),MATCH(\"2. Smrznuti proizvodi\",#REF!,)),0)","v":0},{"$f":"IFERROR(INDEX(#REF!,MATCH(PRORAČUNI!$C13,#REF!,),MATCH(\"3. Prepađevine\",#REF!,)),0)","v":0},0,{"$f":"KUMULATIV!W15","v":{"$error":"#REF!"}},{"$f":"KUMULATIV!X15","v":{"$error":"#REF!"}},{"$f":"KUMULATIV!Y15","v":{"$error":"#REF!"}},{"$f":"KUMULATIV!Z15","v":{"$error":"#REF!"}},0,0,0,0]
[null,{"$f":"#REF!","v":{"$error":"#REF!"}},{"$f":"#REF!","v":{"$error":"#REF!"}},{"$f":"#REF!","v":{"$error":"#REF!"}},{"$f":"#REF!","v":{"$error":"#REF!"}},{"$f":"#REF!","v":{"$error":"#REF!"}},{"$f":"#REF!","v":{"$error":"#REF!"}},{"$error":"#REF!"},{"$error":"#REF!"},{"$error":"#REF!"},{"$f":"G14/#REF!","v":{"$error":"#REF!"}},{"$f":"IFERROR(INDEX(#REF!,MATCH(PRORAČUNI!$C14,#REF!,),MATCH(\"1. Sveži proizvodi\",#REF!,)),0)","v":0},{"$f":"IFERROR(INDEX(#REF!,MATCH(PRORAČUNI!$C14,#REF!,),MATCH(\"2. Smrznuti proizvodi\",#REF!,)),0)","v":0},{"$f":"IFERROR(INDEX(#REF!,MATCH(PRORAČUNI!$C14,#REF!,),MATCH(\"3. Prepađevine\",#REF!,)),0)","v":0},0,{"$f":"KUMULATIV!W16","v":{"$error":"#REF!"}},{"$f":"KUMULATIV!X16","v":{"$error":"#REF!"}},{"$f":"KUMULATIV!Y16","v":{"$error":"#REF!"}},{"$f":"KUMULATIV!Z16","v":{"$error":"#REF!"}},0,0,0,0]
[null,{"$f":"#REF!","v":{"$error":"#REF!"}},{"$f":"#REF!","v":{"$error":"#REF!"}},{"$f":"#REF!","v":{"$error":"#REF!"}},{"$f":"#REF!","v":{"$error":"#REF!"}},{"$f":"#REF!","v":{"$error":"#REF!"}},{"$f":"#REF!","v":{"$error":"#REF!"}},{"$error":"#REF!"},{"$error":"#REF!"},{"$error":"#REF!"},{"$f":"G15/#REF!","v":{"$error":"#REF!"}},{"$f":"IFERROR(INDEX(#REF!,MATCH(PRORAČUNI!$C15,#REF!,),MATCH(\"1. Sveži proizvodi\",#REF!,)),0)","v":0},{"$f":"IFERROR(INDEX(#REF!,MATCH(PRORAČUNI!$C15,#REF!,),MATCH(\"2. Smrznuti proizvodi\",#REF!,)),0)","v":0},{"$f":"IFERROR(INDEX(#REF!,MATCH(PRORAČUNI!$C15,#REF!,),MATCH(\"3. Prepađevine\",#REF!,)),0)","v":0},0,{"$f":"KUMULATIV!W17","v":{"$error":"#REF!"}},{"$f":"KUMULATIV!X17","v":{"$error":"#REF!"}},{"$f":"KUMULATIV!Y17","v":{"$error":"#REF!"}},{"$f":"KUMULATIV!Z17","v":{"$error":"#REF!"}},0,0,0,0]
[null,{"$f":"#REF!","v":{"$error":"#REF!"}},{"$f":"#REF!","v":{"$error":"#REF!"}},{"$f":"#REF!","v":{"$error":"#REF!"}},{"$f":"#REF!","v":{"$error":"#REF!"}},{"$f":"#REF!","v":{"$error":"#REF!"}},{"$f":"#REF!","v":{"$error":"#REF!"}},{"$error":"#REF!"},{"$error":"#REF!"},{"$error":"#REF!"},{"$f":"G16/#REF!","v":{"$error":"#REF!"}},{"$f":"IFERROR(INDEX(#REF!,MATCH(PRORAČUNI!$C16,#REF!,),MATCH(\"1. Sveži proizvodi\",#REF!,)),0)","v":0},{"$f":"IFERROR(INDEX(#REF!,MATCH(PRORAČUNI!$C16,#REF!,),MATCH(\"2. Smrznuti proizvodi\",#REF!,)),0)","v":0},{"$f":"IFERROR(INDEX(#REF!,MATCH(PRORAČUNI!$C16,#REF!,),MATCH(\"3. Prepađevine\",#REF!,)),0)","v":0},0,{"$f":"KUMULATIV!W18","v":{"$error":"#REF!"}},{"$f":"KUMULATIV!X18","v":{"$error":"#REF!"}},{"$f":"KUMULATIV!Y18","v":{"$error":"#REF!"}},{"$f":"KUMULATIV!Z18","v":{"$error":"#REF!"}},0,0,0,0]
[null,{"$f":"#REF!","v":{"$error":"#REF!"}},{"$f":"#REF!","v":{"$error":"#REF!"}},{"$f":"#REF!","v":{"$error":"#REF!"}},{"$f":"#REF!","v":{"$error":"#REF!"}},{"$f":"#REF!","v":{"$error":"#REF!"}},{"$f":"#REF!","v":{"$error":"#REF!"}},{"$error":"#REF!"},{"$error":"#REF!"},{"$error":"#REF!"},{"$f":"G17/#REF!","v":{"$error":"#REF!"}},{"$f":"IFERROR(INDEX(#REF!,MATCH(PRORAČUNI!$C17,#REF!,),MATCH(\"1. Sveži proizvodi\",#REF!,)),0)","v":0},{"$f":"IFERROR(INDEX(#REF!,MATCH(PRORAČUNI!$C17,#REF!,),MATCH(\"2. Smrznuti proizvodi\",#REF!,)),0)","v":0},{"$f":"IFERROR(INDEX(#REF!,MATCH(PRORAČUNI!$C17,#REF!,),MATCH(\"3. Prepađevine\",#REF!,)),0)","v":0},0,{"$f":"KUMULATIV!W19","v":{"$error":"#REF!"}},{"$f":"KUMULATIV!X19","v":{"$error":"#REF!"}},{"$f":"KUMULATIV!Y19","v":{"$error":"#REF!"}},{"$f":"KUMULATIV!Z19","v":{"$error":"#REF!"}},0,0,0,0]
[null,{"$f":"#REF!","v":{"$error":"#REF!"}},{"$f":"#REF!","v":{"$error":"#REF!"}},{"$f":"#REF!","v":{"$error":"#REF!"}},{"$f":"#REF!","v":{"$error":"#REF!"}},{"$f":"#REF!","v":{"$error":"#REF!"}},{"$f":"#REF!","v":{"$error":"#REF!"}},{"$error":"#REF!"},{"$error":"#REF!"},{"$error":"#REF!"},{"$f":"G18/#REF!","v":{"$error":"#REF!"}},{"$f":"IFERROR(INDEX(#REF!,MATCH(PRORAČUNI!$C18,#REF!,),MATCH(\"1. Sveži proizvodi\",#REF!,)),0)","v":0},{"$f":"IFERROR(INDEX(#REF!,MATCH(PRORAČUNI!$C18,#REF!,),MATCH(\"2. Smrznuti proizvodi\",#REF!,)),0)","v":0},{"$f":"IFERROR(INDEX(#REF!,MATCH(PRORAČUNI!$C18,#REF!,),MATCH(\"3. Prepađevine\",#REF!,)),0)","v":0},0,{"$f":"KUMULATIV!W20","v":{"$error":"#REF!"}},{"$f":"KUMULATIV!X20","v":{"$error":"#REF!"}},{"$f":"KUMULATIV!Y20","v":{"$error":"#REF!"}},{"$f":"KUMULATIV!Z20","v":{"$error":"#REF!"}},0,0,0,0]
[null,{"$f":"#REF!","v":{"$error":"#REF!"}},{"$f":"#REF!","v":{"$error":"#REF!"}},{"$f":"#REF!","v":{"$error":"#REF!"}},{"$f":"#REF!","v":{"$error":"#REF!"}},{"$f":"#REF!","v":{"$error":"#REF!"}},{"$f":"#REF!","v":{"$error":"#REF!"}},{"$error":"#REF!"},{"$error":"#REF!"},{"$error":"#REF!"},{"$f":"G19/#REF!","v":{"$error":"#REF!"}},{"$f":"IFERROR(INDEX(#REF!,MATCH(PRORAČUNI!$C19,#REF!,),MATCH(\"1. Sveži proizvodi\",#REF!,)),0)","v":0},{"$f":"IFERROR(INDEX(#REF!,MATCH(PRORAČUNI!$C19,#REF!,),MATCH(\"2. Smrznuti proizvodi\",#REF!,)),0)","v":0},{"$f":"IFERROR(INDEX(#REF!,MATCH(PRORAČUNI!$C19,#REF!,),MATCH(\"3. Prepađevine\",#REF!,)),0)","v":0},0,{"$f":"KUMULATIV!W21","v":{"$error":"#REF!"}},{"$f":"KUMULATIV!X21","v":{"$error":"#REF!"}},{"$f":"KUMULATIV!Y21","v":{"$error":"#REF!"}},{"$f":"KUMULATIV!Z21","v":{"$error":"#REF!"}},0,0,0,0]
[null,{"$f":"#REF!","v":{"$error":"#REF!"}},{"$f":"#REF!","v":{"$error":"#REF!"}},{"$f":"#REF!","v":{"$error":"#REF!"}},{"$f":"#REF!","v":{"$error":"#REF!"}},{"$f":"#REF!","v":{"$error":"#REF!"}},{"$f":"#REF!","v":{"$error":"#REF!"}},{"$error":"#REF!"},{"$error":"#REF!"},{"$error":"#REF!"},{"$f":"G20/#REF!","v":{"$error":"#REF!"}},{"$f":"IFERROR(INDEX(#REF!,MATCH(PRORAČUNI!$C20,#REF!,),MATCH(\"1. Sveži proizvodi\",#REF!,)),0)","v":0},{"$f":"IFERROR(INDEX(#REF!,MATCH(PRORAČUNI!$C20,#REF!,),MATCH(\"2. Smrznuti proizvodi\",#REF!,)),0)","v":0},{"$f":"IFERROR(INDEX(#REF!,MATCH(PRORAČUNI!$C20,#REF!,),MATCH(\"3. Prepađevine\",#REF!,)),0)","v":0},0,{"$f":"KUMULATIV!W22","v":{"$error":"#REF!"}},{"$f":"KUMULATIV!X22","v":{"$error":"#REF!"}},{"$f":"KUMULATIV!Y22","v":{"$error":"#REF!"}},{"$f":"KUMULATIV!Z22","v":{"$error":"#REF!"}},0,0,0,0]
[null,{"$f":"#REF!","v":{"$error":"#REF!"}},{"$f":"#REF!","v":{"$error":"#REF!"}},{"$f":"#REF!","v":{"$error":"#REF!"}},{"$f":"#REF!","v":{"$error":"#REF!"}},{"$f":"#REF!","v":{"$error":"#REF!"}},{"$f":"#REF!","v":{"$error":"#REF!"}},{"$error":"#REF!"},{"$error":"#REF!"},{"$error":"#REF!"},{"$f":"G21/#REF!","v":{"$error":"#REF!"}},{"$f":"IFERROR(INDEX(#REF!,MATCH(PRORAČUNI!$C21,#REF!,),MATCH(\"1. Sveži proizvodi\",#REF!,)),0)","v":0},{"$f":"IFERROR(INDEX(#REF!,MATCH(PRORAČUNI!$C21,#REF!,),MATCH(\"2. Smrznuti proizvodi\",#REF!,)),0)","v":0},{"$f":"IFERROR(INDEX(#REF!,MATCH(PRORAČUNI!$C21,#REF!,),MATCH(\"3. Prepađevine\",#REF!,)),0)","v":0},0,{"$f":"KUMULATIV!W23","v":{"$error":"#REF!"}},{"$f":"KUMULATIV!X23","v":{"$error":"#REF!"}},{"$f":"KUMULATIV!Y23","v":{"$error":"#REF!"}},{"$f":"KUMULATIV!Z23","v":{"$error":"#REF!"}},0,0,0,0]
[null,{"$f":"#REF!","v":{"$error":"#REF!"}},{"$f":"#REF!","v":{"$error":"#REF!"}},{"$f":"#REF!","v":{"$error":"#REF!"}},{"$f":"#REF!","v":{"$error":"#REF!"}},{"$f":"#REF!","v":{"$error":"#REF!"}},{"$f":"#REF!","v":{"$error":"#REF!"}},{"$error":"#REF!"},{"$error":"#REF!"},{"$error":"#REF!"},{"$f":"G22/#REF!","v":{"$error":"#REF!"}},{"$f":"IFERROR(INDEX(#REF!,MATCH(PRORAČUNI!$C22,#REF!,),MATCH(\"1. Sveži proizvodi\",#REF!,)),0)","v":0},{"$f":"IFERROR(INDEX(#REF!,MATCH(PRORAČUNI!$C22,#REF!,),MATCH(\"2. Smrznuti proizvodi\",#REF!,)),0)","v":0},{"$f":"IFERROR(INDEX(#REF!,MATCH(PRORAČUNI!$C22,#REF!,),MATCH(\"3. Prepađevine\",#REF!,)),0)","v":0},0,{"$f":"KUMULATIV!W24","v":{"$error":"#REF!"}},{"$f":"KUMULATIV!X24","v":{"$error":"#REF!"}},{"$f":"KUMULATIV!Y24","v":{"$error":"#REF!"}},{"$f":"KUMULATIV!Z24","v":{"$error":"#REF!"}},0,0,0,0]
[{"$f":"#REF!","v":{"$error":"#REF!"}},{"$f":"#REF!","v":{"$error":"#REF!"}},{"$f":"#REF!","v":{"$error":"#REF!"}},{"$f":"#REF!","v":{"$error":"#REF!"}},{"$f":"#REF!","v":{"$error":"#REF!"}},{"$f":"#REF!","v":{"$error":"#REF!"}},{"$f":"#REF!","v":{"$error":"#REF!"}},{"$error":"#REF!"},{"$error":"#REF!"},{"$error":"#REF!"},{"$f":"PRORAČUNI!G23/#REF!","v":{"$error":"#REF!"}},{"$f":"IFERROR(INDEX(#REF!,MATCH(PRORAČUNI!$C23,#REF!,),MATCH(\"1. Sveži proizvodi\",#REF!,)),0)","v":0},{"$f":"IFERROR(INDEX(#REF!,MATCH(PRORAČUNI!$C23,#REF!,),MATCH(\"2. Smrznuti proizvodi\",#REF!,)),0)","v":0},{"$f":"IFERROR(INDEX(#REF!,MATCH(PRORAČUNI!$C23,#REF!,),MATCH(\"3. Prepađevine\",#REF!,)),0)","v":0},{"$f":"SUM(L23:N23)","v":0},{"$f":"KUMULATIV!W25","v":{"$error":"#REF!"}},{"$f":"KUMULATIV!X25","v":{"$error":"#REF!"}},{"$f":"KUMULATIV!Y25","v":{"$error":"#REF!"}},{"$f":"KUMULATIV!Z25","v":{"$error":"#REF!"}},0,0,0,0]
[null,{"$f":"#REF!","v":{"$error":"#REF!"}},{"$f":"#REF!","v":{"$error":"#REF!"}},{"$f":"#REF!","v":{"$error":"#REF!"}},{"$f":"#REF!","v":{"$error":"#REF!"}},{"$f":"#REF!","v":{"$error":"#REF!"}},{"$f":"#REF!","v":{"$error":"#REF!"}},{"$f":"D24/$G24","v":{"$error":"#REF!"}},{"$f":"E24/$G24","v":{"$error":"#REF!"}},{"$f":"F24/$G24","v":{"$error":"#REF!"}},{"$f":"PRORAČUNI!G24/#REF!","v":{"$error":"#REF!"}},{"$f":"IFERROR(INDEX(#REF!,MATCH(PRORAČUNI!$C24,#REF!,),MATCH(\"1. Sveži proizvodi\",#REF!,)),0)","v":0},{"$f":"IFERROR(INDEX(#REF!,MATCH(PRORAČUNI!$C24,#REF!,),MATCH(\"2. Smrznuti proizvodi\",#REF!,)),0)","v":0},{"$f":"IFERROR(INDEX(#REF!,MATCH(PRORAČUNI!$C24,#REF!,),MATCH(\"3. Prepađevine\",#REF!,)),0)","v":0},{"$f":"SUM(L24:N24)","v":0},{"$f":"KUMULATIV!W26","v":{"$error":"#REF!"}},{"$f":"KUMULATIV!X26","v":{"$error":"#REF!"}},{"$f":"KUMULATIV!Y26","v":{"$error":"#REF!"}},{"$f":"KUMULATIV!Z26","v":{"$error":"#REF!"}},0,0,0,0]
[null,{"$f":"#REF!","v":{"$error":"#REF!"}},{"$f":"#REF!","v":{"$error":"#REF!"}},{"$f":"#REF!","v":{"$error":"#REF!"}},{"$f":"#REF!","v":{"$error":"#REF!"}},{"$f":"#REF!","v":{"$error":"#REF!"}},{"$f":"#REF!","v":{"$error":"#REF!"}},{"$error":"#REF!"},{"$error":"#REF!"},{"$error":"#REF!"},{"$f":"PRORAČUNI!G25/#REF!","v":{"$error":"#REF!"}},{"$f":"IFERROR(INDEX(#REF!,MATCH(PRORAČUNI!$C25,#REF!,),MATCH(\"1. Sveži proizvodi\",#REF!,)),0)","v":0},{"$f":"IFERROR(INDEX(#REF!,MATCH(PRORAČUNI!$C25,#REF!,),MATCH(\"2. Smrznuti proizvodi\",#REF!,)),0)","v":0},{"$f":"IFERROR(INDEX(#REF!,MATCH(PRORAČUNI!$C25,#REF!,),MATCH(\"3. Prepađevine\",#REF!,)),0)","v":0},0,{"$f":"KUMULATIV!W27","v":{"$error":"#REF!"}},{"$f":"KUMULATIV!X27","v":{"$error":"#REF!"}},{"$f":"KUMULATIV!Y27","v":{"$error":"#REF!"}},{"$f":"KUMULATIV!Z27","v":{"$error":"#REF!"}},0,0,0,0]
[null,{"$f":"#REF!","v":{"$error":"#REF!"}},{"$f":"#REF!","v":{"$error":"#REF!"}},{"$f":"#REF!","v":{"$error":"#REF!"}},{"$f":"#REF!","v":{"$error":"#REF!"}},{"$f":"#REF!","v":{"$error":"#REF!"}},{"$f":"#REF!","v":{"$error":"#REF!"}},{"$error":"#REF!"},{"$error":"#REF!"},{"$error":"#REF!"},{"$f":"PRORAČUNI!G26/#REF!","v":{"$error":"#REF!"}},{"$f":"IFERROR(INDEX(#REF!,MATCH(PRORAČUNI!$C26,#REF!,),MATCH(\"1. Sveži proizvodi\",#REF!,)),0)","v":0},{"$f":"IFERROR(INDEX(#REF!,MATCH(PRORAČUNI!$C26,#REF!,),MATCH(\"2. Smrznuti proizvodi\",#REF!,)),0)","v":0},{"$f":"IFERROR(INDEX(#REF!,MATCH(PRORAČUNI!$C26,#REF!,),MATCH(\"3. Prepađevine\",#REF!,)),0)","v":0},0,{"$f":"KUMULATIV!W28","v":{"$error":"#REF!"}},{"$f":"KUMULATIV!X28","v":{"$error":"#REF!"}},{"$f":"KUMULATIV!Y28","v":{"$error":"#REF!"}},{"$f":"KUMULATIV!Z28","v":{"$error":"#REF!"}},0,0,0,0]
[null,{"$f":"#REF!","v":{"$error":"#REF!"}},{"$f":"#REF!","v":{"$error":"#REF!"}},{"$f":"#REF!","v":{"$error":"#REF!"}},{"$f":"#REF!","v":{"$error":"#REF!"}},{"$f":"#REF!","v":{"$error":"#REF!"}},{"$f":"#REF!","v":{"$error":"#REF!"}},{"$error":"#REF!"},{"$error":"#REF!"},{"$error":"#REF!"},{"$f":"PRORAČUNI!G27/#REF!","v":{"$error":"#REF!"}},{"$f":"IFERROR(INDEX(#REF!,MATCH(PRORAČUNI!$C27,#REF!,),MATCH(\"1. Sveži proizvodi\",#REF!,)),0)","v":0},{"$f":"IFERROR(INDEX(#REF!,MATCH(PRORAČUNI!$C27,#REF!,),MATCH(\"2. Smrznuti proizvodi\",#REF!,)),0)","v":0},{"$f":"IFERROR(INDEX(#REF!,MATCH(PRORAČUNI!$C27,#REF!,),MATCH(\"3. Prepađevine\",#REF!,)),0)","v":0},0,{"$f":"KUMULATIV!W29","v":{"$error":"#REF!"}},{"$f":"KUMULATIV!X29","v":{"$error":"#REF!"}},{"$f":"KUMULATIV!Y29","v":{"$error":"#REF!"}},{"$f":"KUMULATIV!Z29","v":{"$error":"#REF!"}},0,0,0,0]
[null,{"$f":"#REF!","v":{"$error":"#REF!"}},{"$f":"#REF!","v":{"$error":"#REF!"}},{"$f":"#REF!","v":{"$error":"#REF!"}},{"$f":"#REF!","v":{"$error":"#REF!"}},{"$f":"#REF!","v":{"$error":"#REF!"}},{"$f":"#REF!","v":{"$error":"#REF!"}},{"$error":"#REF!"},{"$error":"#REF!"},{"$error":"#REF!"},{"$f":"PRORAČUNI!G28/#REF!","v":{"$error":"#REF!"}},{"$f":"IFERROR(INDEX(#REF!,MATCH(PRORAČUNI!$C28,#REF!,),MATCH(\"1. Sveži proizvodi\",#REF!,)),0)","v":0},{"$f":"IFERROR(INDEX(#REF!,MATCH(PRORAČUNI!$C28,#REF!,),MATCH(\"2. Smrznuti proizvodi\",#REF!,)),0)","v":0},{"$f":"IFERROR(INDEX(#REF!,MATCH(PRORAČUNI!$C28,#REF!,),MATCH(\"3. Prepađevine\",#REF!,)),0)","v":0},0,{"$f":"KUMULATIV!W30","v":{"$error":"#REF!"}},{"$f":"KUMULATIV!X30","v":{"$error":"#REF!"}},{"$f":"KUMULATIV!Y30","v":{"$error":"#REF!"}},{"$f":"KUMULATIV!Z30","v":{"$error":"#REF!"}},0,0,0,0]
[null,{"$f":"#REF!","v":{"$error":"#REF!"}},{"$f":"#REF!","v":{"$error":"#REF!"}},{"$f":"#REF!","v":{"$error":"#REF!"}},{"$f":"#REF!","v":{"$error":"#REF!"}},{"$f":"#REF!","v":{"$error":"#REF!"}},{"$f":"#REF!","v":{"$error":"#REF!"}},{"$error":"#REF!"},{"$error":"#REF!"},{"$error":"#REF!"},{"$f":"PRORAČUNI!G29/#REF!","v":{"$error":"#REF!"}},{"$f":"IFERROR(INDEX(#REF!,MATCH(PRORAČUNI!$C29,#REF!,),MATCH(\"1. Sveži proizvodi\",#REF!,)),0)","v":0},{"$f":"IFERROR(INDEX(#REF!,MATCH(PRORAČUNI!$C29,#REF!,),MATCH(\"2. Smrznuti proizvodi\",#REF!,)),0)","v":0},{"$f":"IFERROR(INDEX(#REF!,MATCH(PRORAČUNI!$C29,#REF!,),MATCH(\"3. Prepađevine\",#REF!,)),0)","v":0},0,{"$f":"KUMULATIV!W31","v":{"$error":"#REF!"}},{"$f":"KUMULATIV!X31","v":{"$error":"#REF!"}},{"$f":"KUMULATIV!Y31","v":{"$error":"#REF!"}},{"$f":"KUMULATIV!Z31","v":{"$error":"#REF!"}},0,0,0,0]
[null,{"$f":"#REF!","v":{"$error":"#REF!"}},{"$f":"#REF!","v":{"$error":"#REF!"}},{"$f":"#REF!","v":{"$error":"#REF!"}},{"$f":"#REF!","v":{"$error":"#REF!"}},{"$f":"#REF!","v":{"$error":"#REF!"}},{"$f":"#REF!","v":{"$error":"#REF!"}},{"$error":"#REF!"},{"$error":"#REF!"},{"$error":"#REF!"},{"$f":"PRORAČUNI!G30/#REF!","v":{"$error":"#REF!"}},{"$f":"IFERROR(INDEX(#REF!,MATCH(PRORAČUNI!$C30,#REF!,),MATCH(\"1. Sveži proizvodi\",#REF!,)),0)","v":0},{"$f":"IFERROR(INDEX(#REF!,MATCH(PRORAČUNI!$C30,#REF!,),MATCH(\"2. Smrznuti proizvodi\",#REF!,)),0)","v":0},{"$f":"IFERROR(INDEX(#REF!,MATCH(PRORAČUNI!$C30,#REF!,),MATCH(\"3. Prepađevine\",#REF!,)),0)","v":0},0,{"$f":"KUMULATIV!W32","v":{"$error":"#REF!"}},{"$f":"KUMULATIV!X32","v":{"$error":"#REF!"}},{"$f":"KUMULATIV!Y32","v":{"$error":"#REF!"}},{"$f":"KUMULATIV!Z32","v":{"$error":"#REF!"}},0,0,0,0]
[null,{"$f":"#REF!","v":{"$error":"#REF!"}},{"$f":"#REF!","v":{"$error":"#REF!"}},{"$f":"#REF!","v":{"$error":"#REF!"}},{"$f":"#REF!","v":{"$error":"#REF!"}},{"$f":"#REF!","v":{"$error":"#REF!"}},{"$f":"#REF!","v":{"$error":"#REF!"}},{"$error":"#REF!"},{"$error":"#REF!"},{"$error":"#REF!"},{"$f":"PRORAČUNI!G31/#REF!","v":{"$error":"#REF!"}},{"$f":"IFERROR(INDEX(#REF!,MATCH(PRORAČUNI!$C31,#REF!,),MATCH(\"1. Sveži proizvodi\",#REF!,)),0)","v":0},{"$f":"IFERROR(INDEX(#REF!,MATCH(PRORAČUNI!$C31,#REF!,),MATCH(\"2. Smrznuti proizvodi\",#REF!,)),0)","v":0},{"$f":"IFERROR(INDEX(#REF!,MATCH(PRORAČUNI!$C31,#REF!,),MATCH(\"3. Prepađevine\",#REF!,)),0)","v":0},0,{"$f":"KUMULATIV!W33","v":{"$error":"#REF!"}},{"$f":"KUMULATIV!X33","v":{"$error":"#REF!"}},{"$f":"KUMULATIV!Y33","v":{"$error":"#REF!"}},{"$f":"KUMULATIV!Z33","v":{"$error":"#REF!"}},0,0,0,0]
[null,{"$f":"#REF!","v":{"$error":"#REF!"}},{"$f":"#REF!","v":{"$error":"#REF!"}},{"$f":"#REF!","v":{"$error":"#REF!"}},{"$f":"#REF!","v":{"$error":"#REF!"}},{"$f":"#REF!","v":{"$error":"#REF!"}},{"$f":"#REF!","v":{"$error":"#REF!"}},{"$error":"#REF!"},{"$error":"#REF!"},{"$error":"#REF!"},{"$f":"PRORAČUNI!G32/#REF!","v":{"$error":"#REF!"}},{"$f":"IFERROR(INDEX(#REF!,MATCH(PRORAČUNI!$C32,#REF!,),MATCH(\"1. Sveži proizvodi\",#REF!,)),0)","v":0},{"$f":"IFERROR(INDEX(#REF!,MATCH(PRORAČUNI!$C32,#REF!,),MATCH(\"2. Smrznuti proizvodi\",#REF!,)),0)","v":0},{"$f":"IFERROR(INDEX(#REF!,MATCH(PRORAČUNI!$C32,#REF!,),MATCH(\"3. Prepađevine\",#REF!,)),0)","v":0},0,{"$f":"KUMULATIV!W34","v":{"$error":"#REF!"}},{"$f":"KUMULATIV!X34","v":{"$error":"#REF!"}},{"$f":"KUMULATIV!Y34","v":{"$error":"#REF!"}},{"$f":"KUMULATIV!Z34","v":{"$error":"#REF!"}},0,0,0,0]
[null,{"$f":"#REF!","v":{"$error":"#REF!"}},{"$f":"#REF!","v":{"$error":"#REF!"}},{"$f":"#REF!","v":{"$error":"#REF!"}},{"$f":"#REF!","v":{"$error":"#REF!"}},{"$f":"#REF!","v":{"$error":"#REF!"}},{"$f":"#REF!","v":{"$error":"#REF!"}},{"$error":"#REF!"},{"$error":"#REF!"},{"$error":"#REF!"},{"$f":"PRORAČUNI!G33/#REF!","v":{"$error":"#REF!"}},{"$f":"IFERROR(INDEX(#REF!,MATCH(PRORAČUNI!$C33,#REF!,),MATCH(\"1. Sveži proizvodi\",#REF!,)),0)","v":0},{"$f":"IFERROR(INDEX(#REF!,MATCH(PRORAČUNI!$C33,#REF!,),MATCH(\"2. Smrznuti proizvodi\",#REF!,)),0)","v":0},{"$f":"IFERROR(INDEX(#REF!,MATCH(PRORAČUNI!$C33,#REF!,),MATCH(\"3. Prepađevine\",#REF!,)),0)","v":0},0,{"$f":"KUMULATIV!W35","v":{"$error":"#REF!"}},{"$f":"KUMULATIV!X35","v":{"$error":"#REF!"}},{"$f":"KUMULATIV!Y35","v":{"$error":"#REF!"}},{"$f":"KUMULATIV!Z35","v":{"$error":"#REF!"}},0,0,0,0]
[null,{"$f":"#REF!","v":{"$error":"#REF!"}},{"$f":"#REF!","v":{"$error":"#REF!"}},{"$f":"#REF!","v":{"$error":"#REF!"}},{"$f":"#REF!","v":{"$error":"#REF!"}},{"$f":"#REF!","v":{"$error":"#REF!"}},{"$f":"#REF!","v":{"$error":"#REF!"}},{"$error":"#REF!"},{"$error":"#REF!"},{"$error":"#REF!"},{"$f":"PRORAČUNI!G34/#REF!","v":{"$error":"#REF!"}},{"$f":"IFERROR(INDEX(#REF!,MATCH(PRORAČUNI!$C34,#REF!,),MATCH(\"1. Sveži proizvodi\",#REF!,)),0)","v":0},{"$f":"IFERROR(INDEX(#REF!,MATCH(PRORAČUNI!$C34,#REF!,),MATCH(\"2. Smrznuti proizvodi\",#REF!,)),0)","v":0},{"$f":"IFERROR(INDEX(#REF!,MATCH(PRORAČUNI!$C34,#REF!,),MATCH(\"3. Prepađevine\",#REF!,)),0)","v":0},0,{"$f":"KUMULATIV!W36","v":{"$error":"#REF!"}},{"$f":"KUMULATIV!X36","v":{"$error":"#REF!"}},{"$f":"KUMULATIV!Y36","v":{"$error":"#REF!"}},{"$f":"KUMULATIV!Z36","v":{"$error":"#REF!"}},0,0,0,0]
[null,{"$f":"#REF!","v":{"$error":"#REF!"}},{"$f":"#REF!","v":{"$error":"#REF!"}},{"$f":"#REF!","v":{"$error":"#REF!"}},{"$f":"#REF!","v":{"$error":"#REF!"}},{"$f":"#REF!","v":{"$error":"#REF!"}},{"$f":"#REF!","v":{"$error":"#REF!"}},{"$error":"#REF!"},{"$error":"#REF!"},{"$error":"#REF!"},{"$f":"PRORAČUNI!G35/#REF!","v":{"$error":"#REF!"}},{"$f":"IFERROR(INDEX(#REF!,MATCH(PRORAČUNI!$C35,#REF!,),MATCH(\"1. Sveži proizvodi\",#REF!,)),0)","v":0},{"$f":"IFERROR(INDEX(#REF!,MATCH(PRORAČUNI!$C35,#REF!,),MATCH(\"2. Smrznuti proizvodi\",#REF!,)),0)","v":0},{"$f":"IFERROR(INDEX(#REF!,MATCH(PRORAČUNI!$C35,#REF!,),MATCH(\"3. Prepađevine\",#REF!,)),0)","v":0},0,{"$f":"KUMULATIV!W37","v":{"$error":"#REF!"}},{"$f":"KUMULATIV!X37","v":{"$error":"#REF!"}},{"$f":"KUMULATIV!Y37","v":{"$error":"#REF!"}},{"$f":"KUMULATIV!Z37","v":{"$error":"#REF!"}},0,0,0,0]
[null,{"$f":"#REF!","v":{"$error":"#REF!"}},{"$f":"#REF!","v":{"$error":"#REF!"}},{"$f":"#REF!","v":{"$error":"#REF!"}},{"$f":"#REF!","v":{"$error":"#REF!"}},{"$f":"#REF!","v":{"$error":"#REF!"}},{"$f":"#REF!","v":{"$error":"#REF!"}},{"$error":"#REF!"},{"$error":"#REF!"},{"$error":"#REF!"},{"$f":"PRORAČUNI!G36/#REF!","v":{"$error":"#REF!"}},{"$f":"IFERROR(INDEX(#REF!,MATCH(PRORAČUNI!$C36,#REF!,),MATCH(\"1. Sveži proizvodi\",#REF!,)),0)","v":0},{"$f":"IFERROR(INDEX(#REF!,MATCH(PRORAČUNI!$C36,#REF!,),MATCH(\"2. Smrznuti proizvodi\",#REF!,)),0)","v":0},{"$f":"IFERROR(INDEX(#REF!,MATCH(PRORAČUNI!$C36,#REF!,),MATCH(\"3. Prepađevine\",#REF!,)),0)","v":0},0,{"$f":"KUMULATIV!W38","v":{"$error":"#REF!"}},{"$f":"KUMULATIV!X38","v":{"$error":"#REF!"}},{"$f":"KUMULATIV!Y38","v":{"$error":"#REF!"}},{"$f":"KUMULATIV!Z38","v":{"$error":"#REF!"}},0,0,0,0]
[null,{"$f":"#REF!","v":{"$error":"#REF!"}},{"$f":"#REF!","v":{"$error":"#REF!"}},{"$f":"#REF!","v":{"$error":"#REF!"}},{"$f":"#REF!","v":{"$error":"#REF!"}},{"$f":"#REF!","v":{"$error":"#REF!"}},{"$f":"#REF!","v":{"$error":"#REF!"}},{"$error":"#REF!"},{"$error":"#REF!"},{"$error":"#REF!"},{"$f":"PRORAČUNI!G37/#REF!","v":{"$error":"#REF!"}},{"$f":"IFERROR(INDEX(#REF!,MATCH(PRORAČUNI!$C37,#REF!,),MATCH(\"1. Sveži proizvodi\",#REF!,)),0)","v":0},{"$f":"IFERROR(INDEX(#REF!,MATCH(PRORAČUNI!$C37,#REF!,),MATCH(\"2. Smrznuti proizvodi\",#REF!,)),0)","v":0},{"$f":"IFERROR(INDEX(#REF!,MATCH(PRORAČUNI!$C37,#REF!,),MATCH(\"3. Prepađevine\",#REF!,)),0)","v":0},0,{"$f":"KUMULATIV!W39","v":{"$error":"#REF!"}},{"$f":"KUMULATIV!X39","v":{"$error":"#REF!"}},{"$f":"KUMULATIV!Y39","v":{"$error":"#REF!"}},{"$f":"KUMULATIV!Z39","v":{"$error":"#REF!"}},0,0,0,0]
[null,{"$f":"#REF!","v":{"$error":"#REF!"}},{"$f":"#REF!","v":{"$error":"#REF!"}},{"$f":"#REF!","v":{"$error":"#REF!"}},{"$f":"#REF!","v":{"$error":"#REF!"}},{"$f":"#REF!","v":{"$error":"#REF!"}},{"$f":"#REF!","v":{"$error":"#REF!"}},{"$error":"#REF!"},{"$error":"#REF!"},{"$error":"#REF!"},{"$f":"PRORAČUNI!G38/#REF!","v":{"$error":"#REF!"}},{"$f":"IFERROR(INDEX(#REF!,MATCH(PRORAČUNI!$C38,#REF!,),MATCH(\"1. Sveži proizvodi\",#REF!,)),0)","v":0},{"$f":"IFERROR(INDEX(#REF!,MATCH(PRORAČUNI!$C38,#REF!,),MATCH(\"2. Smrznuti proizvodi\",#REF!,)),0)","v":0},{"$f":"IFERROR(INDEX(#REF!,MATCH(PRORAČUNI!$C38,#REF!,),MATCH(\"3. Prepađevine\",#REF!,)),0)","v":0},0,{"$f":"KUMULATIV!W40","v":{"$error":"#REF!"}},{"$f":"KUMULATIV!X40","v":{"$error":"#REF!"}},{"$f":"KUMULATIV!Y40","v":{"$error":"#REF!"}},{"$f":"KUMULATIV!Z40","v":{"$error":"#REF!"}},0,0,0,0]
[null,{"$f":"#REF!","v":{"$error":"#REF!"}},{"$f":"#REF!","v":{"$error":"#REF!"}},{"$f":"#REF!","v":{"$error":"#REF!"}},{"$f":"#REF!","v":{"$error":"#REF!"}},{"$f":"#REF!","v":{"$error":"#REF!"}},{"$f":"#REF!","v":{"$error":"#REF!"}},{"$error":"#REF!"},{"$error":"#REF!"},{"$error":"#REF!"},{"$f":"PRORAČUNI!G39/#REF!","v":{"$error":"#REF!"}},{"$f":"IFERROR(INDEX(#REF!,MATCH(PRORAČUNI!$C39,#REF!,),MATCH(\"1. Sveži proizvodi\",#REF!,)),0)","v":0},{"$f":"IFERROR(INDEX(#REF!,MATCH(PRORAČUNI!$C39,#REF!,),MATCH(\"2. Smrznuti proizvodi\",#REF!,)),0)","v":0},{"$f":"IFERROR(INDEX(#REF!,MATCH(PRORAČUNI!$C39,#REF!,),MATCH(\"3. Prepađevine\",#REF!,)),0)","v":0},0,{"$f":"KUMULATIV!W41","v":{"$error":"#REF!"}},{"$f":"KUMULATIV!X41","v":{"$error":"#REF!"}},{"$f":"KUMULATIV!Y41","v":{"$error":"#REF!"}},{"$f":"KUMULATIV!Z41","v":{"$error":"#REF!"}},0,0,0,0]
[null,{"$f":"#REF!","v":{"$error":"#REF!"}},{"$f":"#REF!","v":{"$error":"#REF!"}},{"$f":"#REF!","v":{"$error":"#REF!"}},{"$f":"#REF!","v":{"$error":"#REF!"}},{"$f":"#REF!","v":{"$error":"#REF!"}},{"$f":"#REF!","v":{"$error":"#REF!"}},{"$error":"#REF!"},{"$error":"#REF!"},{"$error":"#REF!"},{"$f":"PRORAČUNI!G40/#REF!","v":{"$error":"#REF!"}},{"$f":"IFERROR(INDEX(#REF!,MATCH(PRORAČUNI!$C40,#REF!,),MATCH(\"1. Sveži proizvodi\",#REF!,)),0)","v":0},{"$f":"IFERROR(INDEX(#REF!,MATCH(PRORAČUNI!$C40,#REF!,),MATCH(\"2. Smrznuti proizvodi\",#REF!,)),0)","v":0},{"$f":"IFERROR(INDEX(#REF!,MATCH(PRORAČUNI!$C40,#REF!,),MATCH(\"3. Prepađevine\",#REF!,)),0)","v":0},0,{"$f":"KUMULATIV!W42","v":{"$error":"#REF!"}},{"$f":"KUMULATIV!X42","v":{"$error":"#REF!"}},{"$f":"KUMULATIV!Y42","v":{"$error":"#REF!"}},{"$f":"KUMULATIV!Z42","v":{"$error":"#REF!"}},0,0,0,0]
[null,{"$f":"#REF!","v":{"$error":"#REF!"}},{"$f":"#REF!","v":{"$error":"#REF!"}},{"$f":"#REF!","v":{"$error":"#REF!"}},{"$f":"#REF!","v":{"$error":"#REF!"}},{"$f":"#REF!","v":{"$error":"#REF!"}},{"$f":"#REF!","v":{"$error":"#REF!"}},{"$error":"#REF!"},{"$error":"#REF!"},{"$error":"#REF!"},{"$f":"PRORAČUNI!G41/#REF!","v":{"$error":"#REF!"}},{"$f":"IFERROR(INDEX(#REF!,MATCH(PRORAČUNI!$C41,#REF!,),MATCH(\"1. Sveži proizvodi\",#REF!,)),0)","v":0},{"$f":"IFERROR(INDEX(#REF!,MATCH(PRORAČUNI!$C41,#REF!,),MATCH(\"2. Smrznuti proizvodi\",#REF!,)),0)","v":0},{"$f":"IFERROR(INDEX(#REF!,MATCH(PRORAČUNI!$C41,#REF!,),MATCH(\"3. Prepađevine\",#REF!,)),0)","v":0},0,{"$f":"KUMULATIV!W43","v":{"$error":"#REF!"}},{"$f":"KUMULATIV!X43","v":{"$error":"#REF!"}},{"$f":"KUMULATIV!Y43","v":{"$error":"#REF!"}},{"$f":"KUMULATIV!Z43","v":{"$error":"#REF!"}},0,0,0,0]
[null,{"$f":"#REF!","v":{"$error":"#REF!"}},{"$f":"#REF!","v":{"$error":"#REF!"}},{"$f":"#REF!","v":{"$error":"#REF!"}},{"$f":"#REF!","v":{"$error":"#REF!"}},{"$f":"#REF!","v":{"$error":"#REF!"}},{"$f":"#REF!","v":{"$error":"#REF!"}},{"$error":"#REF!"},{"$error":"#REF!"},{"$error":"#REF!"},{"$f":"PRORAČUNI!G42/#REF!","v":{"$error":"#REF!"}},{"$f":"IFERROR(INDEX(#REF!,MATCH(PRORAČUNI!$C42,#REF!,),MATCH(\"1. Sveži proizvodi\",#REF!,)),0)","v":0},{"$f":"IFERROR(INDEX(#REF!,MATCH(PRORAČUNI!$C42,#REF!,),MATCH(\"2. Smrznuti proizvodi\",#REF!,)),0)","v":0},{"$f":"IFERROR(INDEX(#REF!,MATCH(PRORAČUNI!$C42,#REF!,),MATCH(\"3. Prepađevine\",#REF!,)),0)","v":0},0,{"$f":"KUMULATIV!W44","v":{"$error":"#REF!"}},{"$f":"KUMULATIV!X44","v":{"$error":"#REF!"}},{"$f":"KUMULATIV!Y44","v":{"$error":"#REF!"}},{"$f":"KUMULATIV!Z44","v":{"$error":"#REF!"}},0,0,0,0]
[{"$f":"#REF!","v":{"$error":"#REF!"}},{"$f":"#REF!","v":{"$error":"#REF!"}},{"$f":"#REF!","v":{"$error":"#REF!"}},{"$f":"#REF!","v":{"$error":"#REF!"}},{"$f":"#REF!","v":{"$error":"#REF!"}},{"$f":"#REF!","v":{"$error":"#REF!"}},{"$f":"#REF!","v":{"$error":"#REF!"}},{"$error":"#REF!"},{"$error":"#REF!"},{"$error":"#REF!"},{"$f":"G43/#REF!","v":{"$error":"#REF!"}},{"$f":"IFERROR(INDEX(#REF!,MATCH(PRORAČUNI!$C43,#REF!,),MATCH(\"1. Sveži proizvodi\",#REF!,)),0)","v":0},{"$f":"IFERROR(INDEX(#REF!,MATCH(PRORAČUNI!$C43,#REF!,),MATCH(\"2. Smrznuti proizvodi\",#REF!,)),0)","v":0},{"$f":"IFERROR(INDEX(#REF!,MATCH(PRORAČUNI!$C43,#REF!,),MATCH(\"3. Prepađevine\",#REF!,)),0)","v":0},{"$f":"SUM(L43:N43)","v":0},{"$f":"KUMULATIV!W45","v":{"$error":"#REF!"}},{"$f":"KUMULATIV!X45","v":{"$error":"#REF!"}},{"$f":"KUMULATIV!Y45","v":{"$error":"#REF!"}},{"$f":"KUMULATIV!Z45","v":{"$error":"#REF!"}},0,0,0,0]
[null,{"$f":"#REF!","v":{"$error":"#REF!"}},{"$f":"#REF!","v":{"$error":"#REF!"}},{"$f":"#REF!","v":{"$error":"#REF!"}},{"$f":"#REF!","v":{"$error":"#REF!"}},{"$f":"#REF!","v":{"$error":"#REF!"}},{"$f":"#REF!","v":{"$error":"#REF!"}},{"$error":"#REF!"},{"$error":"#REF!"},{"$error":"#REF!"},{"$f":"G44/#REF!","v":{"$error":"#REF!"}},{"$f":"IFERROR(INDEX(#REF!,MATCH(PRORAČUNI!$C44,#REF!,),MATCH(\"1. Sveži proizvodi\",#REF!,)),0)","v":0},{"$f":"IFERROR(INDEX(#REF!,MATCH(PRORAČUNI!$C44,#REF!,),MATCH(\"2. Smrznuti proizvodi\",#REF!,)),0)","v":0},{"$f":"IFERROR(INDEX(#REF!,MATCH(PRORAČUNI!$C44,#REF!,),MATCH(\"3. Prepađevine\",#REF!,)),0)","v":0},{"$f":"SUM(L44:N44)","v":0},{"$f":"KUMULATIV!W46","v":{"$error":"#REF!"}},{"$f":"KUMULATIV!X46","v":{"$error":"#REF!"}},{"$f":"KUMULATIV!Y46","v":{"$error":"#REF!"}},{"$f":"KUMULATIV!Z46","v":{"$error":"#REF!"}},0,0,0,0]
[null,{"$f":"#REF!","v":{"$error":"#REF!"}},{"$f":"#REF!","v":{"$error":"#REF!"}},{"$f":"#REF!","v":{"$error":"#REF!"}},{"$f":"#REF!","v":{"$error":"#REF!"}},{"$f":"#REF!","v":{"$error":"#REF!"}},{"$f":"#REF!","v":{"$error":"#REF!"}},{"$error":"#REF!"},{"$error":"#REF!"},{"$error":"#REF!"},{"$f":"G45/#REF!","v":{"$error":"#REF!"}},{"$f":"IFERROR(INDEX(#REF!,MATCH(PRORAČUNI!$C45,#REF!,),MATCH(\"1. Sveži proizvodi\",#REF!,)),0)","v":0},{"$f":"IFERROR(INDEX(#REF!,MATCH(PRORAČUNI!$C45,#REF!,),MATCH(\"2. Smrznuti proizvodi\",#REF!,)),0)","v":0},{"$f":"IFERROR(INDEX(#REF!,MATCH(PRORAČUNI!$C45,#REF!,),MATCH(\"3. Prepađevine\",#REF!,)),0)","v":0},0,{"$f":"KUMULATIV!W47","v":{"$error":"#REF!"}},{"$f":"KUMULATIV!X47","v":{"$error":"#REF!"}},{"$f":"KUMULATIV!Y47","v":{"$error":"#REF!"}},{"$f":"KUMULATIV!Z47","v":{"$error":"#REF!"}},0,0,0,0]
[null,{"$f":"#REF!","v":{"$error":"#REF!"}},{"$f":"#REF!","v":{"$error":"#REF!"}},{"$f":"#REF!","v":{"$error":"#REF!"}},{"$f":"#REF!","v":{"$error":"#REF!"}},{"$f":"#REF!","v":{"$error":"#REF!"}},{"$f":"#REF!","v":{"$error":"#REF!"}},{"$error":"#REF!"},{"$error":"#REF!"},{"$error":"#REF!"},{"$f":"G46/#REF!","v":{"$error":"#REF!"}},{"$f":"IFERROR(INDEX(#REF!,MATCH(PRORAČUNI!$C46,#REF!,),MATCH(\"1. Sveži proizvodi\",#REF!,)),0)","v":0},{"$f":"IFERROR(INDEX(#REF!,MATCH(PRORAČUNI!$C46,#REF!,),MATCH(\"2. Smrznuti proizvodi\",#REF!,)),0)","v":0},{"$f":"IFERROR(INDEX(#REF!,MATCH(PRORAČUNI!$C46,#REF!,),MATCH(\"3. Prepađevine\",#REF!,)),0)","v":0},0,{"$f":"KUMULATIV!W48","v":{"$error":"#REF!"}},{"$f":"KUMULATIV!X48","v":{"$error":"#REF!"}},{"$f":"KUMULATIV!Y48","v":{"$error":"#REF!"}},{"$f":"KUMULATIV!Z48","v":{"$error":"#REF!"}},0,0,0,0]
[null,{"$f":"#REF!","v":{"$error":"#REF!"}},{"$f":"#REF!","v":{"$error":"#REF!"}},{"$f":"#REF!","v":{"$error":"#REF!"}},{"$f":"#REF!","v":{"$error":"#REF!"}},{"$f":"#REF!","v":{"$error":"#REF!"}},{"$f":"#REF!","v":{"$error":"#REF!"}},{"$error":"#REF!"},{"$error":"#REF!"},{"$error":"#REF!"},{"$f":"G47/#REF!","v":{"$error":"#REF!"}},{"$f":"IFERROR(INDEX(#REF!,MATCH(PRORAČUNI!$C47,#REF!,),MATCH(\"1. Sveži proizvodi\",#REF!,)),0)","v":0},{"$f":"IFERROR(INDEX(#REF!,MATCH(PRORAČUNI!$C47,#REF!,),MATCH(\"2. Smrznuti proizvodi\",#REF!,)),0)","v":0},{"$f":"IFERROR(INDEX(#REF!,MATCH(PRORAČUNI!$C47,#REF!,),MATCH(\"3. Prepađevine\",#REF!,)),0)","v":0},0,{"$f":"KUMULATIV!W49","v":{"$error":"#REF!"}},{"$f":"KUMULATIV!X49","v":{"$error":"#REF!"}},{"$f":"KUMULATIV!Y49","v":{"$error":"#REF!"}},{"$f":"KUMULATIV!Z49","v":{"$error":"#REF!"}},0,0,0,0]
[null,{"$f":"#REF!","v":{"$error":"#REF!"}},{"$f":"#REF!","v":{"$error":"#REF!"}},{"$f":"#REF!","v":{"$error":"#REF!"}},{"$f":"#REF!","v":{"$error":"#REF!"}},{"$f":"#REF!","v":{"$error":"#REF!"}},{"$f":"#REF!","v":{"$error":"#REF!"}},{"$error":"#REF!"},{"$error":"#REF!"},{"$error":"#REF!"},{"$f":"G48/#REF!","v":{"$error":"#REF!"}},{"$f":"IFERROR(INDEX(#REF!,MATCH(PRORAČUNI!$C48,#REF!,),MATCH(\"1. Sveži proizvodi\",#REF!,)),0)","v":0},{"$f":"IFERROR(INDEX(#REF!,MATCH(PRORAČUNI!$C48,#REF!,),MATCH(\"2. Smrznuti proizvodi\",#REF!,)),0)","v":0},{"$f":"IFERROR(INDEX(#REF!,MATCH(PRORAČUNI!$C48,#REF!,),MATCH(\"3. Prepađevine\",#REF!,)),0)","v":0},0,{"$f":"KUMULATIV!W50","v":{"$error":"#REF!"}},{"$f":"KUMULATIV!X50","v":{"$error":"#REF!"}},{"$f":"KUMULATIV!Y50","v":{"$error":"#REF!"}},{"$f":"KUMULATIV!Z50","v":{"$error":"#REF!"}},0,0,0,0]
[null,{"$f":"#REF!","v":{"$error":"#REF!"}},{"$f":"#REF!","v":{"$error":"#REF!"}},{"$f":"#REF!","v":{"$error":"#REF!"}},{"$f":"#REF!","v":{"$error":"#REF!"}},{"$f":"#REF!","v":{"$error":"#REF!"}},{"$f":"#REF!","v":{"$error":"#REF!"}},{"$error":"#REF!"},{"$error":"#REF!"},{"$error":"#REF!"},{"$f":"G49/#REF!","v":{"$error":"#REF!"}},{"$f":"IFERROR(INDEX(#REF!,MATCH(PRORAČUNI!$C49,#REF!,),MATCH(\"1. Sveži proizvodi\",#REF!,)),0)","v":0},{"$f":"IFERROR(INDEX(#REF!,MATCH(PRORAČUNI!$C49,#REF!,),MATCH(\"2. Smrznuti proizvodi\",#REF!,)),0)","v":0},{"$f":"IFERROR(INDEX(#REF!,MATCH(PRORAČUNI!$C49,#REF!,),MATCH(\"3. Prepađevine\",#REF!,)),0)","v":0},0,{"$f":"KUMULATIV!W51","v":{"$error":"#REF!"}},{"$f":"KUMULATIV!X51","v":{"$error":"#REF!"}},{"$f":"KUMULATIV!Y51","v":{"$error":"#REF!"}},{"$f":"KUMULATIV!Z51","v":{"$error":"#REF!"}},0,0,0,0]
[null,{"$f":"#REF!","v":{"$error":"#REF!"}},{"$f":"#REF!","v":{"$error":"#REF!"}},{"$f":"#REF!","v":{"$error":"#REF!"}},{"$f":"#REF!","v":{"$error":"#REF!"}},{"$f":"#REF!","v":{"$error":"#REF!"}},{"$f":"#REF!","v":{"$error":"#REF!"}},{"$error":"#REF!"},{"$error":"#REF!"},{"$error":"#REF!"},{"$f":"G50/#REF!","v":{"$error":"#REF!"}},{"$f":"IFERROR(INDEX(#REF!,MATCH(PRORAČUNI!$C50,#REF!,),MATCH(\"1. Sveži proizvodi\",#REF!,)),0)","v":0},{"$f":"IFERROR(INDEX(#REF!,MATCH(PRORAČUNI!$C50,#REF!,),MATCH(\"2. Smrznuti proizvodi\",#REF!,)),0)","v":0},{"$f":"IFERROR(INDEX(#REF!,MATCH(PRORAČUNI!$C50,#REF!,),MATCH(\"3. Prepađevine\",#REF!,)),0)","v":0},0,{"$f":"KUMULATIV!W52","v":{"$error":"#REF!"}},{"$f":"KUMULATIV!X52","v":{"$error":"#REF!"}},{"$f":"KUMULATIV!Y52","v":{"$error":"#REF!"}},{"$f":"KUMULATIV!Z52","v":{"$error":"#REF!"}},0,0,0,0]
[null,{"$f":"#REF!","v":{"$error":"#REF!"}},{"$f":"#REF!","v":{"$error":"#REF!"}},{"$f":"#REF!","v":{"$error":"#REF!"}},{"$f":"#REF!","v":{"$error":"#REF!"}},{"$f":"#REF!","v":{"$error":"#REF!"}},{"$f":"#REF!","v":{"$error":"#REF!"}},{"$error":"#REF!"},{"$error":"#REF!"},{"$error":"#REF!"},{"$f":"G51/#REF!","v":{"$error":"#REF!"}},{"$f":"IFERROR(INDEX(#REF!,MATCH(PRORAČUNI!$C51,#REF!,),MATCH(\"1. Sveži proizvodi\",#REF!,)),0)","v":0},{"$f":"IFERROR(INDEX(#REF!,MATCH(PRORAČUNI!$C51,#REF!,),MATCH(\"2. Smrznuti proizvodi\",#REF!,)),0)","v":0},{"$f":"IFERROR(INDEX(#REF!,MATCH(PRORAČUNI!$C51,#REF!,),MATCH(\"3. Prepađevine\",#REF!,)),0)","v":0},0,{"$f":"KUMULATIV!W53","v":{"$error":"#REF!"}},{"$f":"KUMULATIV!X53","v":{"$error":"#REF!"}},{"$f":"KUMULATIV!Y53","v":{"$error":"#REF!"}},{"$f":"KUMULATIV!Z53","v":{"$error":"#REF!"}},0,0,0,0]
[null,{"$f":"#REF!","v":{"$error":"#REF!"}},{"$f":"#REF!","v":{"$error":"#REF!"}},{"$f":"#REF!","v":{"$error":"#REF!"}},{"$f":"#REF!","v":{"$error":"#REF!"}},{"$f":"#REF!","v":{"$error":"#REF!"}},{"$f":"#REF!","v":{"$error":"#REF!"}},{"$error":"#REF!"},{"$error":"#REF!"},{"$error":"#REF!"},{"$f":"G52/#REF!","v":{"$error":"#REF!"}},{"$f":"IFERROR(INDEX(#REF!,MATCH(PRORAČUNI!$C52,#REF!,),MATCH(\"1. Sveži proizvodi\",#REF!,)),0)","v":0},{"$f":"IFERROR(INDEX(#REF!,MATCH(PRORAČUNI!$C52,#REF!,),MATCH(\"2. Smrznuti proizvodi\",#REF!,)),0)","v":0},{"$f":"IFERROR(INDEX(#REF!,MATCH(PRORAČUNI!$C52,#REF!,),MATCH(\"3. Prepađevine\",#REF!,)),0)","v":0},0,{"$f":"KUMULATIV!W54","v":{"$error":"#REF!"}},{"$f":"KUMULATIV!X54","v":{"$error":"#REF!"}},{"$f":"KUMULATIV!Y54","v":{"$error":"#REF!"}},{"$f":"KUMULATIV!Z54","v":{"$error":"#REF!"}},0,0,0,0]
[null,{"$f":"#REF!","v":{"$error":"#REF!"}},{"$f":"#REF!","v":{"$error":"#REF!"}},{"$f":"#REF!","v":{"$error":"#REF!"}},{"$f":"#REF!","v":{"$error":"#REF!"}},{"$f":"#REF!","v":{"$error":"#REF!"}},{"$f":"#REF!","v":{"$error":"#REF!"}},{"$error":"#REF!"},{"$error":"#REF!"},{"$error":"#REF!"},{"$f":"G53/#REF!","v":{"$error":"#REF!"}},{"$f":"IFERROR(INDEX(#REF!,MATCH(PRORAČUNI!$C53,#REF!,),MATCH(\"1. Sveži proizvodi\",#REF!,)),0)","v":0},{"$f":"IFERROR(INDEX(#REF!,MATCH(PRORAČUNI!$C53,#REF!,),MATCH(\"2. Smrznuti proizvodi\",#REF!,)),0)","v":0},{"$f":"IFERROR(INDEX(#REF!,MATCH(PRORAČUNI!$C53,#REF!,),MATCH(\"3. Prepađevine\",#REF!,)),0)","v":0},0,{"$f":"KUMULATIV!W55","v":{"$error":"#REF!"}},{"$f":"KUMULATIV!X55","v":{"$error":"#REF!"}},{"$f":"KUMULATIV!Y55","v":{"$error":"#REF!"}},{"$f":"KUMULATIV!Z55","v":{"$error":"#REF!"}},0,0,0,0]
[null,{"$f":"#REF!","v":{"$error":"#REF!"}},{"$f":"#REF!","v":{"$error":"#REF!"}},{"$f":"#REF!","v":{"$error":"#REF!"}},{"$f":"#REF!","v":{"$error":"#REF!"}},{"$f":"#REF!","v":{"$error":"#REF!"}},{"$f":"#REF!","v":{"$error":"#REF!"}},{"$error":"#REF!"},{"$error":"#REF!"},{"$error":"#REF!"},{"$f":"G54/#REF!","v":{"$error":"#REF!"}},{"$f":"IFERROR(INDEX(#REF!,MATCH(PRORAČUNI!$C54,#REF!,),MATCH(\"1. Sveži proizvodi\",#REF!,)),0)","v":0},{"$f":"IFERROR(INDEX(#REF!,MATCH(PRORAČUNI!$C54,#REF!,),MATCH(\"2. Smrznuti proizvodi\",#REF!,)),0)","v":0},{"$f":"IFERROR(INDEX(#REF!,MATCH(PRORAČUNI!$C54,#REF!,),MATCH(\"3. Prepađevine\",#REF!,)),0)","v":0},0,{"$f":"KUMULATIV!W56","v":{"$error":"#REF!"}},{"$f":"KUMULATIV!X56","v":{"$error":"#REF!"}},{"$f":"KUMULATIV!Y56","v":{"$error":"#REF!"}},{"$f":"KUMULATIV!Z56","v":{"$error":"#REF!"}},0,0,0,0]
[null,{"$f":"#REF!","v":{"$error":"#REF!"}},{"$f":"#REF!","v":{"$error":"#REF!"}},{"$f":"#REF!","v":{"$error":"#REF!"}},{"$f":"#REF!","v":{"$error":"#REF!"}},{"$f":"#REF!","v":{"$error":"#REF!"}},{"$f":"#REF!","v":{"$error":"#REF!"}},{"$error":"#REF!"},{"$error":"#REF!"},{"$error":"#REF!"},{"$f":"G55/#REF!","v":{"$error":"#REF!"}},{"$f":"IFERROR(INDEX(#REF!,MATCH(PRORAČUNI!$C55,#REF!,),MATCH(\"1. Sveži proizvodi\",#REF!,)),0)","v":0},{"$f":"IFERROR(INDEX(#REF!,MATCH(PRORAČUNI!$C55,#REF!,),MATCH(\"2. Smrznuti proizvodi\",#REF!,)),0)","v":0},{"$f":"IFERROR(INDEX(#REF!,MATCH(PRORAČUNI!$C55,#REF!,),MATCH(\"3. Prepađevine\",#REF!,)),0)","v":0},0,{"$f":"KUMULATIV!W57","v":{"$error":"#REF!"}},{"$f":"KUMULATIV!X57","v":{"$error":"#REF!"}},{"$f":"KUMULATIV!Y57","v":{"$error":"#REF!"}},{"$f":"KUMULATIV!Z57","v":{"$error":"#REF!"}},0,0,0,0]
[null,{"$f":"#REF!","v":{"$error":"#REF!"}},{"$f":"#REF!","v":{"$error":"#REF!"}},{"$f":"#REF!","v":{"$error":"#REF!"}},{"$f":"#REF!","v":{"$error":"#REF!"}},{"$f":"#REF!","v":{"$error":"#REF!"}},{"$f":"#REF!","v":{"$error":"#REF!"}},{"$error":"#REF!"},{"$error":"#REF!"},{"$error":"#REF!"},{"$f":"G56/#REF!","v":{"$error":"#REF!"}},{"$f":"IFERROR(INDEX(#REF!,MATCH(PRORAČUNI!$C56,#REF!,),MATCH(\"1. Sveži proizvodi\",#REF!,)),0)","v":0},{"$f":"IFERROR(INDEX(#REF!,MATCH(PRORAČUNI!$C56,#REF!,),MATCH(\"2. Smrznuti proizvodi\",#REF!,)),0)","v":0},{"$f":"IFERROR(INDEX(#REF!,MATCH(PRORAČUNI!$C56,#REF!,),MATCH(\"3. Prepađevine\",#REF!,)),0)","v":0},0,{"$f":"KUMULATIV!W58","v":{"$error":"#REF!"}},{"$f":"KUMULATIV!X58","v":{"$error":"#REF!"}},{"$f":"KUMULATIV!Y58","v":{"$error":"#REF!"}},{"$f":"KUMULATIV!Z58","v":{"$error":"#REF!"}},0,0,0,0]
[null,{"$f":"#REF!","v":{"$error":"#REF!"}},{"$f":"#REF!","v":{"$error":"#REF!"}},{"$f":"#REF!","v":{"$error":"#REF!"}},{"$f":"#REF!","v":{"$error":"#REF!"}},{"$f":"#REF!","v":{"$error":"#REF!"}},{"$f":"#REF!","v":{"$error":"#REF!"}},{"$error":"#REF!"},{"$error":"#REF!"},{"$error":"#REF!"},{"$f":"G57/#REF!","v":{"$error":"#REF!"}},{"$f":"IFERROR(INDEX(#REF!,MATCH(PRORAČUNI!$C57,#REF!,),MATCH(\"1. Sveži proizvodi\",#REF!,)),0)","v":0},{"$f":"IFERROR(INDEX(#REF!,MATCH(PRORAČUNI!$C57,#REF!,),MATCH(\"2. Smrznuti proizvodi\",#REF!,)),0)","v":0},{"$f":"IFERROR(INDEX(#REF!,MATCH(PRORAČUNI!$C57,#REF!,),MATCH(\"3. Prepađevine\",#REF!,)),0)","v":0},0,{"$f":"KUMULATIV!W59","v":{"$error":"#REF!"}},{"$f":"KUMULATIV!X59","v":{"$error":"#REF!"}},{"$f":"KUMULATIV!Y59","v":{"$error":"#REF!"}},{"$f":"KUMULATIV!Z59","v":{"$error":"#REF!"}},0,0,0,0]
[null,{"$f":"#REF!","v":{"$error":"#REF!"}},{"$f":"#REF!","v":{"$error":"#REF!"}},{"$f":"#REF!","v":{"$error":"#REF!"}},{"$f":"#REF!","v":{"$error":"#REF!"}},{"$f":"#REF!","v":{"$error":"#REF!"}},{"$f":"#REF!","v":{"$error":"#REF!"}},{"$error":"#REF!"},{"$error":"#REF!"},{"$error":"#REF!"},{"$f":"G58/#REF!","v":{"$error":"#REF!"}},{"$f":"IFERROR(INDEX(#REF!,MATCH(PRORAČUNI!$C58,#REF!,),MATCH(\"1. Sveži proizvodi\",#REF!,)),0)","v":0},{"$f":"IFERROR(INDEX(#REF!,MATCH(PRORAČUNI!$C58,#REF!,),MATCH(\"2. Smrznuti proizvodi\",#REF!,)),0)","v":0},{"$f":"IFERROR(INDEX(#REF!,MATCH(PRORAČUNI!$C58,#REF!,),MATCH(\"3. Prepađevine\",#REF!,)),0)","v":0},0,{"$f":"KUMULATIV!W60","v":{"$error":"#REF!"}},{"$f":"KUMULATIV!X60","v":{"$error":"#REF!"}},{"$f":"KUMULATIV!Y60","v":{"$error":"#REF!"}},{"$f":"KUMULATIV!Z60","v":{"$error":"#REF!"}},0,0,0,0]
[null,{"$f":"#REF!","v":{"$error":"#REF!"}},{"$f":"#REF!","v":{"$error":"#REF!"}},{"$f":"#REF!","v":{"$error":"#REF!"}},{"$f":"#REF!","v":{"$error":"#REF!"}},{"$f":"#REF!","v":{"$error":"#REF!"}},{"$f":"#REF!","v":{"$error":"#REF!"}},{"$error":"#REF!"},{"$error":"#REF!"},{"$error":"#REF!"},{"$f":"G59/#REF!","v":{"$error":"#REF!"}},{"$f":"IFERROR(INDEX(#REF!,MATCH(PRORAČUNI!$C59,#REF!,),MATCH(\"1. Sveži proizvodi\",#REF!,)),0)","v":0},{"$f":"IFERROR(INDEX(#REF!,MATCH(PRORAČUNI!$C59,#REF!,),MATCH(\"2. Smrznuti proizvodi\",#REF!,)),0)","v":0},{"$f":"IFERROR(INDEX(#REF!,MATCH(PRORAČUNI!$C59,#REF!,),MATCH(\"3. Prepađevine\",#REF!,)),0)","v":0},0,{"$f":"KUMULATIV!W61","v":{"$error":"#REF!"}},{"$f":"KUMULATIV!X61","v":{"$error":"#REF!"}},{"$f":"KUMULATIV!Y61","v":{"$error":"#REF!"}},{"$f":"KUMULATIV!Z61","v":{"$error":"#REF!"}},0,0,0,0]
[null,{"$f":"#REF!","v":{"$error":"#REF!"}},{"$f":"#REF!","v":{"$error":"#REF!"}},{"$f":"#REF!","v":{"$error":"#REF!"}},{"$f":"#REF!","v":{"$error":"#REF!"}},{"$f":"#REF!","v":{"$error":"#REF!"}},{"$f":"#REF!","v":{"$error":"#REF!"}},{"$error":"#REF!"},{"$error":"#REF!"},{"$error":"#REF!"},{"$f":"G60/#REF!","v":{"$error":"#REF!"}},{"$f":"IFERROR(INDEX(#REF!,MATCH(PRORAČUNI!$C60,#REF!,),MATCH(\"1. Sveži proizvodi\",#REF!,)),0)","v":0},{"$f":"IFERROR(INDEX(#REF!,MATCH(PRORAČUNI!$C60,#REF!,),MATCH(\"2. Smrznuti proizvodi\",#REF!,)),0)","v":0},{"$f":"IFERROR(INDEX(#REF!,MATCH(PRORAČUNI!$C60,#REF!,),MATCH(\"3. Prepađevine\",#REF!,)),0)","v":0},0,{"$f":"KUMULATIV!W62","v":{"$error":"#REF!"}},{"$f":"KUMULATIV!X62","v":{"$error":"#REF!"}},{"$f":"KUMULATIV!Y62","v":{"$error":"#REF!"}},{"$f":"KUMULATIV!Z62","v":{"$error":"#REF!"}},0,0,0,0]
[null,{"$f":"#REF!","v":{"$error":"#REF!"}},{"$f":"#REF!","v":{"$error":"#REF!"}},{"$f":"#REF!","v":{"$error":"#REF!"}},{"$f":"#REF!","v":{"$error":"#REF!"}},{"$f":"#REF!","v":{"$error":"#REF!"}},{"$f":"#REF!","v":{"$error":"#REF!"}},{"$error":"#REF!"},{"$error":"#REF!"},{"$error":"#REF!"},{"$f":"G61/#REF!","v":{"$error":"#REF!"}},{"$f":"IFERROR(INDEX(#REF!,MATCH(PRORAČUNI!$C61,#REF!,),MATCH(\"1. Sveži proizvodi\",#REF!,)),0)","v":0},{"$f":"IFERROR(INDEX(#REF!,MATCH(PRORAČUNI!$C61,#REF!,),MATCH(\"2. Smrznuti proizvodi\",#REF!,)),0)","v":0},{"$f":"IFERROR(INDEX(#REF!,MATCH(PRORAČUNI!$C61,#REF!,),MATCH(\"3. Prepađevine\",#REF!,)),0)","v":0},0,{"$f":"KUMULATIV!W63","v":{"$error":"#REF!"}},{"$f":"KUMULATIV!X63","v":{"$error":"#REF!"}},{"$f":"KUMULATIV!Y63","v":{"$error":"#REF!"}},{"$f":"KUMULATIV!Z63","v":{"$error":"#REF!"}},0,0,0,0]
[null,{"$f":"#REF!","v":{"$error":"#REF!"}},{"$f":"#REF!","v":{"$error":"#REF!"}},{"$f":"#REF!","v":{"$error":"#REF!"}},{"$f":"#REF!","v":{"$error":"#REF!"}},{"$f":"#REF!","v":{"$error":"#REF!"}},{"$f":"#REF!","v":{"$error":"#REF!"}},{"$error":"#REF!"},{"$error":"#REF!"},{"$error":"#REF!"},{"$f":"G62/#REF!","v":{"$error":"#REF!"}},{"$f":"IFERROR(INDEX(#REF!,MATCH(PRORAČUNI!$C62,#REF!,),MATCH(\"1. Sveži proizvodi\",#REF!,)),0)","v":0},{"$f":"IFERROR(INDEX(#REF!,MATCH(PRORAČUNI!$C62,#REF!,),MATCH(\"2. Smrznuti proizvodi\",#REF!,)),0)","v":0},{"$f":"IFERROR(INDEX(#REF!,MATCH(PRORAČUNI!$C62,#REF!,),MATCH(\"3. Prepađevine\",#REF!,)),0)","v":0},0,{"$f":"KUMULATIV!W64","v":{"$error":"#REF!"}},{"$f":"KUMULATIV!X64","v":{"$error":"#REF!"}},{"$f":"KUMULATIV!Y64","v":{"$error":"#REF!"}},{"$f":"KUMULATIV!Z64","v":{"$error":"#REF!"}},0,0,0,0]

{"sheet":"PRORAČUN 2","index":7,"n_rows":90,"n_cols":6,"rows_kept":90,"cut":false,"hidden":false,"merged":[]}
[null,null,null,null,"PROD/PLAN"]
["KC","RB","KUPAC","Values","PRODAJA","PLAN"]
["KC Beograd",1,"DELHAIZE SERBIA DOO","Sum of 1. Sveži proizvodi",1484.7339999999999,2070.6616548210159]
[null,null,null,"Sum of 2. Smrznuti proizvodi",0,0]
[null,null,null,"Sum of 3. Prepađevine",50.921000000000006,294.01755613204404]
[null,null,null,"Sum of Grand Total",1535.655,2364.6792109530597]
[null,2,"IDEA DOO","Sum of 1. Sveži proizvodi",1723.1860000000013,1278.8070666678552]
[null,null,null,"Sum of 2. Smrznuti proizvodi",0,0]
[null,null,null,"Sum of 3. Prepađevine",246.18200000000002,17.832413070596054]
[null,null,null,"Sum of Grand Total",1969.3680000000013,1296.6394797384512]
[null,3,"MERCATOR S","Sum of 1. Sveži proizvodi",493.58500000000009,708.7756812918575]
[null,null,null,"Sum of 2. Smrznuti proizvodi",19.132999999999999,15.10537900485849]
[null,null,null,"Sum of 3. Prepađevine",68.067000000000007,147.63721786742215]
[null,null,null,"Sum of Grand Total",580.78500000000008,871.51827816413822]
[null,4,"ŠTRAND DOO","Sum of 1. Sveži proizvodi",678.83800000000008,676.21141839442669]
[null,null,null,"Sum of 2. Smrznuti proizvodi",0,0]
[null,null,null,"Sum of 3. Prepađevine",0,0]
[null,null,null,"Sum of Grand Total",678.83800000000008,676.21141839442669]
[null,5,"METRO CASH & CARRY DOO","Sum of 1. Sveži proizvodi",162.40500000000003,519.06888589112782]
[null,null,null,"Sum of 2. Smrznuti proizvodi",0,6.3749341137545237]
[null,null,null,"Sum of 3. Prepađevine",0,103.29789489197951]
[null,null,null,"Sum of Grand Total",162.40500000000003,628.74171489686182]
[null,6,"UNIVEREXPORT DOO","Sum of 1. Sveži proizvodi",896.67399999999986,447.2198166196813]
[null,null,null,"Sum of 2. Smrznuti proizvodi",0,0]
[null,null,null,"Sum of 3. Prepađevine",92.25,44.926506506236706]
[null,null,null,"Sum of Grand Total",988.92399999999986,492.14632312591806]
[null,7,"AMAN DOO","Sum of 1. Sveži proizvodi",12.135,302.94642145733746]
[null,null,null,"Sum of 2. Smrznuti proizvodi",0,0]
[null,null,null,"Sum of 3. Prepađevine",236.255,138.69664248371743]
[null,null,null,"Sum of Grand Total",248.39,441.64306394105489]
[null,8,"MESO-MARKET","Sum of 1. Sveži proizvodi",251.47499999999999,308.27991935776402]
[null,null,null,"Sum of 2. Smrznuti proizvodi",0,0]
[null,null,null,"Sum of 3. Prepađevine",0,3.3440890881268306]
[null,null,null,"Sum of Grand Total",251.47499999999999,311.62400844589087]
[null,9,"MUP UPRAVA ZA POSLOVE ISHRANE I SMEŠTAJA","Sum of 1. Sveži proizvodi",0,0]
[null,null,null,"Sum of 2. Smrznuti proizvodi",239.26800000000003,177.0353195086964]
[null,null,null,"Sum of 3. Prepađevine",0,0]
[null,null,null,"Sum of Grand Total",239.26800000000003,177.0353195086964]
[null,10,"ĐERIĆ STR","Sum of 1. Sveži proizvodi",61.096999999999994,164.41968324704888]
[null,null,null,"Sum of 2. Smrznuti proizvodi",0,0]
[null,null,null,"Sum of 3. Prepađevine",0,0]
[null,null,null,"Sum of Grand Total",61.096999999999994,164.41968324704888]
[null,11,"TP DOO TREND COMERCCE ŠID","Sum of 1. Sveži proizvodi",0,0]
[null,null,null,"Sum of 2. Smrznuti proizvodi",60.995000000000005,25.686501044029782]
[null,null,null,"Sum of 3. Prepađevine",141,78.945310455390256]
[null,null,null,"Sum of Grand Total",201.995,104.63181149942002]
[null,12,"VINDIJA D.O.O. LAJKOVAC - VLASTITA POTROŠNJA","Sum of 1. Sveži proizvodi",0,47.212732771319985]
[null,null,null,"Sum of 2. Smrznuti proizvodi",0,29.186290538438641]
[null,null,null,"Sum of 3. Prepađevine",0,20.922892652947361]
[null,null,null,"Sum of Grand Total",0,97.321915962705972]
[null,13,"PODUNAVLJE AD, BEOGRAD","Sum of 1. Sveži proizvodi",7.9859999999999998,32.670249768699037]
[null,null,null,"Sum of 2. Smrznuti proizvodi",136.50900000000001,47.56560670742364]
[null,null,null,"Sum of 3. Prepađevine",29.863,9.8722297994276627]
[null,null,null,"Sum of Grand Total",174.358,90.108086275550335]
[null,14,"POINT MARTINOVIĆ DOO","Sum of 1. Sveži proizvodi",0,83.211675069864512]
[null,null,null,"Sum of 2. Smrznuti proizvodi",0,0.60680872127948282]
[null,null,null,"Sum of 3. Prepađevine",0,0]
[null,null,null,"Sum of Grand Total",0,83.81848379114399]
[null,15,"MIS CHILLI DOO","Sum of 1. Sveži proizvodi",0,45.721326720895732]
[null,null,null,"Sum of 2. Smrznuti proizvodi",0,0]
[null,null,null,"Sum of 3. Prepađevine",0,37.451477460631622]
[null,null,null,"Sum of Grand Total",0,83.172804181527354]
[null,16,"VEROPOULOS DOO","Sum of 1. Sveži proizvodi",12.215,55.957977875138077]
[null,null,null,"Sum of 2. Smrznuti proizvodi",0,0.52126023899778684]
[null,null,null,"Sum of 3. Prepađevine",92.843000000000004,16.851316186025802]
[null,null,null,"Sum of Grand Total",105.05800000000001,73.330554300161666]
[null,17,"JOVANA STR","Sum of 1. Sveži proizvodi",46.153999999999996,53.967701651104086]
[null,null,null,"Sum of 2. Smrznuti proizvodi",0,0]
[null,null,null,"Sum of 3. Prepađevine",7.2,9.990956780541044]
[null,null,null,"Sum of Grand Total",53.353999999999999,63.958658431645134]
[null,18,"SLAVONAC STUR, ISMETA MUJEZINOVIĆA","Sum of 1. Sveži proizvodi",0,57.190027817047969]
[null,null,null,"Sum of 2. Smrznuti proizvodi",0,0]
[null,null,null,"Sum of 3. Prepađevine",0,0]
[null,null,null,"Sum of Grand Total",0,57.190027817047969]
[null,19,"MEDIUS DOO","Sum of 1. Sveži proizvodi",0,8.9340155824650349]
[null,null,null,"Sum of 2. Smrznuti proizvodi",0,0]
[null,null,null,"Sum of 3. Prepađevine",0,46.521405619193111]
[null,null,null,"Sum of Grand Total",0,55.455421201658147]
[null,20,"FAMOSO","Sum of 1. Sveži proizvodi",0,50.54283484523345]
[null,null,null,"Sum of 2. Smrznuti proizvodi",0,0]
[null,null,null,"Sum of 3. Prepađevine",0,0]
[null,null,null,"Sum of Grand Total",0,50.54283484523345]
["KC Beograd Sum of 1. Sveži proizvodi",null,null,null,5830.4840000000004,6911.7990898498801]
["KC Beograd Sum of 2. Smrznuti proizvodi",null,null,null,455.90500000000003,302.08209987747875]
["KC Beograd Sum of 3. Prepađevine",null,null,null,964.58100000000002,970.3079089942795]
["KC Beograd Sum of Grand Total",null,null,null,7250.9700000000012,8184.1890987216393]
["Total Sum of 1. Sveži proizvodi",null,null,null,5830.4840000000004,6911.7990898498801]
["Total Sum of 2. Smrznuti proizvodi",null,null,null,455.90500000000003,302.08209987747875]
["Total Sum of 3. Prepađevine",null,null,null,964.58100000000002,970.3079089942795]
["Total Sum of Grand Total",null,null,null,7250.9700000000012,8184.1890987216393]

{"sheet":"PRORACUN 3","index":8,"n_rows":90,"n_cols":6,"rows_kept":90,"cut":false,"hidden":false,"merged":[]}
[null,null,null,null,"PROD/PLAN"]
["KC","Values","RB","KUPAC","PRODAJA","PLAN"]
["KC Beograd","Sum of 1. Sveži proizvodi",1,"DELHAIZE SERBIA DOO",1484.7339999999999,2070.6616548210159]
[null,null,2,"IDEA DOO",1723.1860000000013,1278.8070666678552]
[null,null,3,"MERCATOR S",493.58500000000009,708.7756812918575]
[null,null,4,"ŠTRAND DOO",678.83800000000008,676.21141839442669]
[null,null,5,"METRO CASH & CARRY DOO",162.40500000000003,519.06888589112782]
[null,null,6,"UNIVEREXPORT DOO",896.67399999999986,447.2198166196813]
[null,null,7,"AMAN DOO",12.135,302.94642145733746]
[null,null,8,"MESO-MARKET",251.47499999999999,308.27991935776402]
[null,null,9,"MUP UPRAVA ZA POSLOVE ISHRANE I SMEŠTAJA",0,0]
[null,null,10,"ĐERIĆ STR",61.096999999999994,164.41968324704888]
[null,null,11,"TP DOO TREND COMERCCE ŠID",0,0]
[null,null,12,"VINDIJA D.O.O. LAJKOVAC - VLASTITA POTROŠNJA",0,47.212732771319985]
[null,null,13,"PODUNAVLJE AD, BEOGRAD",7.9859999999999998,32.670249768699037]
[null,null,14,"POINT MARTINOVIĆ DOO",0,83.211675069864512]
[null,null,15,"MIS CHILLI DOO",0,45.721326720895732]
[null,null,16,"VEROPOULOS DOO",12.215,55.957977875138077]
[null,null,17,"JOVANA STR",46.153999999999996,53.967701651104086]
[null,null,18,"SLAVONAC STUR, ISMETA MUJEZINOVIĆA",0,57.190027817047969]
[null,null,19,"MEDIUS DOO",0,8.9340155824650349]
[null,null,20,"FAMOSO",0,50.54283484523345]
[null,"Sum of 2. Smrznuti proizvodi",1,"DELHAIZE SERBIA DOO",0,0]
[null,null,2,"IDEA DOO",0,0]
[null,null,3,"MERCATOR S",19.132999999999999,15.10537900485849]
[null,null,4,"ŠTRAND DOO",0,0]
[null,null,5,"METRO CASH & CARRY DOO",0,6.3749341137545237]
[null,null,6,"UNIVEREXPORT DOO",0,0]
[null,null,7,"AMAN DOO",0,0]
[null,null,8,"MESO-MARKET",0,0]
[null,null,9,"MUP UPRAVA ZA POSLOVE ISHRANE I SMEŠTAJA",239.26800000000003,177.0353195086964]
[null,null,10,"ĐERIĆ STR",0,0]
[null,null,11,"TP DOO TREND COMERCCE ŠID",60.995000000000005,25.686501044029782]
[null,null,12,"VINDIJA D.O.O. LAJKOVAC - VLASTITA POTROŠNJA",0,29.186290538438641]
[null,null,13,"PODUNAVLJE AD, BEOGRAD",136.50900000000001,47.56560670742364]
[null,null,14,"POINT MARTINOVIĆ DOO",0,0.60680872127948282]
[null,null,15,"MIS CHILLI DOO",0,0]
[null,null,16,"VEROPOULOS DOO",0,0.52126023899778684]
[null,null,17,"JOVANA STR",0,0]
[null,null,18,"SLAVONAC STUR, ISMETA MUJEZINOVIĆA",0,0]
[null,null,19,"MEDIUS DOO",0,0]
[null,null,20,"FAMOSO",0,0]
[null,"Sum of 3. Prepađevine",1,"DELHAIZE SERBIA DOO",50.921000000000006,294.01755613204404]
[null,null,2,"IDEA DOO",246.18200000000002,17.832413070596054]
[null,null,3,"MERCATOR S",68.067000000000007,147.63721786742215]
[null,null,4,"ŠTRAND DOO",0,0]
[null,null,5,"METRO CASH & CARRY DOO",0,103.29789489197951]
[null,null,6,"UNIVEREXPORT DOO",92.25,44.926506506236706]
[null,null,7,"AMAN DOO",236.255,138.69664248371743]
[null,null,8,"MESO-MARKET",0,3.3440890881268306]
[null,null,9,"MUP UPRAVA ZA POSLOVE ISHRANE I SMEŠTAJA",0,0]
[null,null,10,"ĐERIĆ STR",0,0]
[null,null,11,"TP DOO TREND COMERCCE ŠID",141,78.945310455390256]
[null,null,12,"VINDIJA D.O.O. LAJKOVAC - VLASTITA POTROŠNJA",0,20.922892652947361]
[null,null,13,"PODUNAVLJE AD, BEOGRAD",29.863,9.8722297994276627]
[null,null,14,"POINT MARTINOVIĆ DOO",0,0]
[null,null,15,"MIS CHILLI DOO",0,37.451477460631622]
[null,null,16,"VEROPOULOS DOO",92.843000000000004,16.851316186025802]
[null,null,17,"JOVANA STR",7.2,9.990956780541044]
[null,null,18,"SLAVONAC STUR, ISMETA MUJEZINOVIĆA",0,0]
[null,null,19,"MEDIUS DOO",0,46.521405619193111]
[null,null,20,"FAMOSO",0,0]
[null,"Sum of Grand Total",1,"DELHAIZE SERBIA DOO",1535.655,2364.6792109530597]
[null,null,2,"IDEA DOO",1969.3680000000013,1296.6394797384512]
[null,null,3,"MERCATOR S",580.78500000000008,871.51827816413822]
[null,null,4,"ŠTRAND DOO",678.83800000000008,676.21141839442669]
[null,null,5,"METRO CASH & CARRY DOO",162.40500000000003,628.74171489686182]
[null,null,6,"UNIVEREXPORT DOO",988.92399999999986,492.14632312591806]
[null,null,7,"AMAN DOO",248.39,441.64306394105489]
[null,null,8,"MESO-MARKET",251.47499999999999,311.62400844589087]
[null,null,9,"MUP UPRAVA ZA POSLOVE ISHRANE I SMEŠTAJA",239.26800000000003,177.0353195086964]
[null,null,10,"ĐERIĆ STR",61.096999999999994,164.41968324704888]
[null,null,11,"TP DOO TREND COMERCCE ŠID",201.995,104.63181149942002]
[null,null,12,"VINDIJA D.O.O. LAJKOVAC - VLASTITA POTROŠNJA",0,97.321915962705972]
[null,null,13,"PODUNAVLJE AD, BEOGRAD",174.358,90.108086275550335]
[null,null,14,"POINT MARTINOVIĆ DOO",0,83.81848379114399]
[null,null,15,"MIS CHILLI DOO",0,83.172804181527354]
[null,null,16,"VEROPOULOS DOO",105.05800000000001,73.330554300161666]
[null,null,17,"JOVANA STR",53.353999999999999,63.958658431645134]
[null,null,18,"SLAVONAC STUR, ISMETA MUJEZINOVIĆA",0,57.190027817047969]
[null,null,19,"MEDIUS DOO",0,55.455421201658147]
[null,null,20,"FAMOSO",0,50.54283484523345]
["KC Beograd Sum of 1. Sveži proizvodi",null,null,null,5830.4840000000004,6911.7990898498801]
["KC Beograd Sum of 2. Smrznuti proizvodi",null,null,null,455.90500000000003,302.08209987747875]
["KC Beograd Sum of 3. Prepađevine",null,null,null,964.58100000000002,970.3079089942795]
["KC Beograd Sum of Grand Total",null,null,null,7250.9700000000012,8184.1890987216393]
["Total Sum of 1. Sveži proizvodi",null,null,null,5830.4840000000004,6911.7990898498801]
["Total Sum of 2. Smrznuti proizvodi",null,null,null,455.90500000000003,302.08209987747875]
["Total Sum of 3. Prepađevine",null,null,null,964.58100000000002,970.3079089942795]
["Total Sum of Grand Total",null,null,null,7250.9700000000012,8184.1890987216393]

{"sheet":"RAZRADA UKUPNO","index":9,"n_rows":73,"n_cols":11,"rows_kept":73,"cut":false,"hidden":false,"merged":[[2,3,2,4],[2,6,2,7],[0,1,0,8]]}
["VINDIJA",{"$f":"\"Dnevna prodaja od\"&TEXT(A4,\" dd.mm.\")& \" i kumulativ dnevnog plana i prodaje za 01.-\" &TEXT(A4,\" dd.mm.yyyy\")","v":"Dnevna prodaja od 08.08. i kumulativ dnevnog plana i prodaje za 01.- 08.08.2013"}]
[]
[null,{"$f":"Podaci!A2","v":"2013-08-01"},{"$f":"Podaci!A4","v":"2013-08-31"},"Izvještaj za ",null,null,{"$f":"PROPER(TEXT((Podaci!C33),\"MMMM\"))&\"/\"&PROPER(TEXT((Podaci!D33),\"MMMM\"))","v":"Kolovoz/Avgust"},null,null,null,{"$f":"Podaci!A7","v":"2013-01-01"}]
[{"$f":"Podaci!A3","v":"2013-08-08"},null,null,{"$f":"NETWORKDAYS(B3,A4,(K3:K12))","v":6},"dana +",null,{"$f":"NETWORKDAYS(B3,C3,(K3:K12))","v":22},"dana +",null,null,{"$f":"Podaci!A8","v":"2013-01-02"}]
["SRBIJA",null,null,{"$f":"SUM(ISNA(MATCH(ROW(INDIRECT(B3&\":\"&A4)),(R3:R12),0))*\n(WEEKDAY(ROW(INDIRECT(B3&\":\"&A4)))=7))","v":1},{"$f":"IF(OR(D5=2,D5=3,D5=4),\"subote\",\"subota\")","v":"subota"},null,{"$f":"SUM(ISNA(MATCH(ROW(INDIRECT(B3&\":\"&C3)),(K3:K12),0))*\n(WEEKDAY(ROW(INDIRECT(B3&\":\"&C3)))=7))","v":5},{"$f":"IF(OR(G5=2,G5=3,G5=4),\"subote\",\"subota\")","v":"subota"},null,null,{"$f":"Podaci!A9","v":"2013-01-07"}]
["KC BEOGRAD",null,null,null,null,null,null,null,null,null,{"$f":"Podaci!A10","v":"2013-05-06"}]
["NAZIV KUPCA","1:Dnevna prodaja","2:Dnevni plan","IND. prodaja / plan","Razlika 1-2","3: Kum. prodaje 2013","4: Kum. plana 2013","IND. kum. prod 2013 / kum. plana 2013","Razlika 3-4",null,{"$f":"Podaci!A11","v":"2013-05-01"}]
[{"$f":"PRORAČUNI!B3","v":{"$error":"#REF!"}},{"$f":"PRORAČUNI!O3","v":0},{"$f":"PRORAČUNI!S3","v":{"$error":"#REF!"}},{"$f":"B8/C8","v":{"$error":"#REF!"}},{"$f":"B8-C8","v":{"$error":"#REF!"}},{"$f":"KUMULATIV!H5","v":15263.806999999999},{"$f":"KUMULATIV!L5","v":0},{"$f":"F8/G8","v":{"$error":"#DIV/0!"}},{"$f":"F8-G8","v":15263.806999999999},null,{"$f":"Podaci!A12","v":"00:00:00"}]
[{"$f":"PRORAČUNI!B4","v":{"$error":"#REF!"}},{"$f":"PRORAČUNI!O4","v":0},{"$f":"PRORAČUNI!S4","v":{"$error":"#REF!"}},{"$f":"B9/C9","v":{"$error":"#REF!"}},{"$f":"B9-C9","v":{"$error":"#REF!"}},{"$f":"KUMULATIV!H6","v":10027.657000000001},{"$f":"KUMULATIV!L6","v":0},{"$f":"F9/G9","v":{"$error":"#DIV/0!"}},{"$f":"F9-G9","v":10027.657000000001},null,{"$f":"Podaci!A13","v":"00:00:00"}]
[{"$f":"PRORAČUNI!B5","v":{"$error":"#REF!"}},{"$f":"PRORAČUNI!O5","v":0},{"$f":"PRORAČUNI!S5","v":{"$error":"#REF!"}},{"$error":"#REF!"},{"$error":"#REF!"},{"$f":"KUMULATIV!H7","v":3557.8100000000004},{"$f":"KUMULATIV!L7","v":0},{"$error":"#DIV/0!"},3557.8100000000004,null,{"$f":"Podaci!A14","v":"00:00:00"}]
[{"$f":"PRORAČUNI!B6","v":{"$error":"#REF!"}},{"$f":"PRORAČUNI!O6","v":0},{"$f":"PRORAČUNI!S6","v":{"$error":"#REF!"}},{"$error":"#REF!"},{"$error":"#REF!"},{"$f":"KUMULATIV!H8","v":4341.2139999999999},{"$f":"KUMULATIV!L8","v":0},{"$error":"#DIV/0!"},4341.2139999999999,null,{"$f":"Podaci!A15","v":"00:00:00"}]
[{"$f":"PRORAČUNI!B7","v":{"$error":"#REF!"}},{"$f":"PRORAČUNI!O7","v":0},{"$f":"PRORAČUNI!S7","v":{"$error":"#REF!"}},{"$error":"#REF!"},{"$error":"#REF!"},{"$f":"KUMULATIV!H9","v":1422.777},{"$f":"KUMULATIV!L9","v":0},{"$error":"#DIV/0!"},1422.777,null,{"$f":"Podaci!A16","v":"00:00:00"}]
[{"$f":"PRORAČUNI!B8","v":{"$error":"#REF!"}},{"$f":"PRORAČUNI!O8","v":0},{"$f":"PRORAČUNI!S8","v":{"$error":"#REF!"}},{"$error":"#REF!"},{"$error":"#REF!"},{"$f":"KUMULATIV!H10","v":3563.2489999999998},{"$f":"KUMULATIV!L10","v":0},{"$error":"#DIV/0!"},3563.2489999999998]
[{"$f":"PRORAČUNI!B9","v":{"$error":"#REF!"}},{"$f":"PRORAČUNI!O9","v":0},{"$f":"PRORAČUNI!S9","v":{"$error":"#REF!"}},{"$error":"#REF!"},{"$error":"#REF!"},{"$f":"KUMULATIV!H11","v":1720.2000000000003},{"$f":"KUMULATIV!L11","v":0},{"$error":"#DIV/0!"},1720.2000000000003]
[{"$f":"PRORAČUNI!B10","v":{"$error":"#REF!"}},{"$f":"PRORAČUNI!O10","v":0},{"$f":"PRORAČUNI!S10","v":{"$error":"#REF!"}},{"$error":"#REF!"},{"$error":"#REF!"},{"$f":"KUMULATIV!H12","v":1544.2059999999999},{"$f":"KUMULATIV!L12","v":0},{"$error":"#DIV/0!"},1544.2059999999999]
[{"$f":"PRORAČUNI!B11","v":{"$error":"#REF!"}},{"$f":"PRORAČUNI!O11","v":0},{"$f":"PRORAČUNI!S11","v":{"$error":"#REF!"}},{"$error":"#REF!"},{"$error":"#REF!"},{"$f":"KUMULATIV!H13","v":1012.7210000000001},{"$f":"KUMULATIV!L13","v":0},{"$error":"#DIV/0!"},1012.7210000000001]
[{"$f":"PRORAČUNI!B12","v":{"$error":"#REF!"}},{"$f":"PRORAČUNI!O12","v":0},{"$f":"PRORAČUNI!S12","v":{"$error":"#REF!"}},{"$error":"#REF!"},{"$error":"#REF!"},{"$f":"KUMULATIV!H14","v":335.24099999999999},{"$f":"KUMULATIV!L14","v":0},{"$error":"#DIV/0!"},335.24099999999999]
[{"$f":"PRORAČUNI!B13","v":{"$error":"#REF!"}},{"$f":"PRORAČUNI!O13","v":0},{"$f":"PRORAČUNI!S13","v":{"$error":"#REF!"}},{"$error":"#REF!"},{"$error":"#REF!"},{"$f":"KUMULATIV!H15","v":560.43000000000006},{"$f":"KUMULATIV!L15","v":0},{"$error":"#DIV/0!"},560.43000000000006]
[{"$f":"PRORAČUNI!B14","v":{"$error":"#REF!"}},{"$f":"PRORAČUNI!O14","v":0},{"$f":"PRORAČUNI!S14","v":{"$error":"#REF!"}},{"$error":"#REF!"},{"$error":"#REF!"},{"$f":"KUMULATIV!H16","v":0},{"$f":"KUMULATIV!L16","v":0},{"$error":"#DIV/0!"},0]
[{"$f":"PRORAČUNI!B15","v":{"$error":"#REF!"}},{"$f":"PRORAČUNI!O15","v":0},{"$f":"PRORAČUNI!S15","v":{"$error":"#REF!"}},{"$error":"#REF!"},{"$error":"#REF!"},{"$f":"KUMULATIV!H17","v":1039.6369999999999},{"$f":"KUMULATIV!L17","v":0},{"$error":"#DIV/0!"},1039.6369999999999]
[{"$f":"PRORAČUNI!B16","v":{"$error":"#REF!"}},{"$f":"PRORAČUNI!O16","v":0},{"$f":"PRORAČUNI!S16","v":{"$error":"#REF!"}},{"$error":"#REF!"},{"$error":"#REF!"},{"$f":"KUMULATIV!H18","v":0},{"$f":"KUMULATIV!L18","v":0},{"$error":"#DIV/0!"},0]
[{"$f":"PRORAČUNI!B17","v":{"$error":"#REF!"}},{"$f":"PRORAČUNI!O17","v":0},{"$f":"PRORAČUNI!S17","v":{"$error":"#REF!"}},{"$error":"#REF!"},{"$error":"#REF!"},{"$f":"KUMULATIV!H19","v":418.43700000000001},{"$f":"KUMULATIV!L19","v":0},{"$error":"#DIV/0!"},418.43700000000001]
[{"$f":"PRORAČUNI!B18","v":{"$error":"#REF!"}},{"$f":"PRORAČUNI!O18","v":0},{"$f":"PRORAČUNI!S18","v":{"$error":"#REF!"}},{"$error":"#REF!"},{"$error":"#REF!"},{"$f":"KUMULATIV!H20","v":281.589},{"$f":"KUMULATIV!L20","v":0},{"$error":"#DIV/0!"},281.589]
[{"$f":"PRORAČUNI!B19","v":{"$error":"#REF!"}},{"$f":"PRORAČUNI!O19","v":0},{"$f":"PRORAČUNI!S19","v":{"$error":"#REF!"}},{"$error":"#REF!"},{"$error":"#REF!"},{"$f":"KUMULATIV!H21","v":245.68700000000001},{"$f":"KUMULATIV!L21","v":0},{"$error":"#DIV/0!"},245.68700000000001]
[{"$f":"PRORAČUNI!B20","v":{"$error":"#REF!"}},{"$f":"PRORAČUNI!O20","v":0},{"$f":"PRORAČUNI!S20","v":{"$error":"#REF!"}},{"$error":"#REF!"},{"$error":"#REF!"},{"$f":"KUMULATIV!H22","v":0},{"$f":"KUMULATIV!L22","v":0},{"$error":"#DIV/0!"},0]
[{"$f":"PRORAČUNI!B21","v":{"$error":"#REF!"}},{"$f":"PRORAČUNI!O21","v":0},{"$f":"PRORAČUNI!S21","v":{"$error":"#REF!"}},{"$error":"#REF!"},{"$error":"#REF!"},{"$f":"KUMULATIV!H23","v":226.73699999999999},{"$f":"KUMULATIV!L23","v":0},{"$error":"#DIV/0!"},226.73699999999999]
[{"$f":"PRORAČUNI!B22","v":{"$error":"#REF!"}},{"$f":"PRORAČUNI!O22","v":0},{"$f":"PRORAČUNI!S22","v":{"$error":"#REF!"}},{"$error":"#REF!"},{"$error":"#REF!"},{"$f":"KUMULATIV!H24","v":0},{"$f":"KUMULATIV!L24","v":0},{"$error":"#DIV/0!"},0]
[]
["KC LAJKOVAC"]
["NAZIV KUPCA","1:Dnevna prodaja","2:Dnevni plan","IND. prodaja / plan","Razlika 1-2","3: Kum. prodaje 2013","4: Kum. plana 2013","IND. kum. prod 2013 / kum. plana 2013","Razlika 3-4"]
[{"$f":"PRORAČUNI!B23","v":{"$error":"#REF!"}},{"$f":"PRORAČUNI!O23","v":0},{"$f":"PRORAČUNI!S23","v":{"$error":"#REF!"}},{"$f":"B31/C31","v":{"$error":"#REF!"}},{"$f":"B31-C31","v":{"$error":"#REF!"}},{"$f":"KUMULATIV!H25","v":1883.4260000000002},{"$f":"KUMULATIV!L25","v":0},{"$f":"F31/G31","v":{"$error":"#DIV/0!"}},{"$f":"F31-G31","v":1883.4260000000002}]
[{"$f":"PRORAČUNI!B24","v":{"$error":"#REF!"}},{"$f":"PRORAČUNI!O24","v":0},{"$f":"PRORAČUNI!S24","v":{"$error":"#REF!"}},{"$f":"B32/C32","v":{"$error":"#REF!"}},{"$f":"B32-C32","v":{"$error":"#REF!"}},{"$f":"KUMULATIV!H26","v":2344.9259999999995},{"$f":"KUMULATIV!L26","v":0},{"$f":"F32/G32","v":{"$error":"#DIV/0!"}},{"$f":"F32-G32","v":2344.9259999999995}]
[{"$f":"PRORAČUNI!B25","v":{"$error":"#REF!"}},{"$f":"PRORAČUNI!O25","v":0},{"$f":"PRORAČUNI!S25","v":{"$error":"#REF!"}},{"$error":"#REF!"},{"$error":"#REF!"},{"$f":"KUMULATIV!H27","v":1370.2849999999999},{"$f":"KUMULATIV!L27","v":0},{"$error":"#DIV/0!"},1370.2849999999999]
[{"$f":"PRORAČUNI!B26","v":{"$error":"#REF!"}},{"$f":"PRORAČUNI!O26","v":0},{"$f":"PRORAČUNI!S26","v":{"$error":"#REF!"}},{"$error":"#REF!"},{"$error":"#REF!"},{"$f":"KUMULATIV!H28","v":1524.348},{"$f":"KUMULATIV!L28","v":0},{"$error":"#DIV/0!"},1524.348]
[{"$f":"PRORAČUNI!B27","v":{"$error":"#REF!"}},{"$f":"PRORAČUNI!O27","v":0},{"$f":"PRORAČUNI!S27","v":{"$error":"#REF!"}},{"$error":"#REF!"},{"$error":"#REF!"},{"$f":"KUMULATIV!H29","v":764.50800000000004},{"$f":"KUMULATIV!L29","v":0},{"$error":"#DIV/0!"},764.50800000000004]
[{"$f":"PRORAČUNI!B28","v":{"$error":"#REF!"}},{"$f":"PRORAČUNI!O28","v":0},{"$f":"PRORAČUNI!S28","v":{"$error":"#REF!"}},{"$error":"#REF!"},{"$error":"#REF!"},{"$f":"KUMULATIV!H30","v":871.47499999999991},{"$f":"KUMULATIV!L30","v":0},{"$error":"#DIV/0!"},871.47499999999991]
[{"$f":"PRORAČUNI!B29","v":{"$error":"#REF!"}},{"$f":"PRORAČUNI!O29","v":0},{"$f":"PRORAČUNI!S29","v":{"$error":"#REF!"}},{"$error":"#REF!"},{"$error":"#REF!"},{"$f":"KUMULATIV!H31","v":0},{"$f":"KUMULATIV!L31","v":0},{"$error":"#DIV/0!"},0]
[{"$f":"PRORAČUNI!B30","v":{"$error":"#REF!"}},{"$f":"PRORAČUNI!O30","v":0},{"$f":"PRORAČUNI!S30","v":{"$error":"#REF!"}},{"$error":"#REF!"},{"$error":"#REF!"},{"$f":"KUMULATIV!H32","v":109.18200000000002},{"$f":"KUMULATIV!L32","v":0},{"$error":"#DIV/0!"},109.18200000000002]
[{"$f":"PRORAČUNI!B31","v":{"$error":"#REF!"}},{"$f":"PRORAČUNI!O31","v":0},{"$f":"PRORAČUNI!S31","v":{"$error":"#REF!"}},{"$error":"#REF!"},{"$error":"#REF!"},{"$f":"KUMULATIV!H33","v":283.63599999999997},{"$f":"KUMULATIV!L33","v":0},{"$error":"#DIV/0!"},283.63599999999997]
[{"$f":"PRORAČUNI!B32","v":{"$error":"#REF!"}},{"$f":"PRORAČUNI!O32","v":0},{"$f":"PRORAČUNI!S32","v":{"$error":"#REF!"}},{"$error":"#REF!"},{"$error":"#REF!"},{"$f":"KUMULATIV!H34","v":168.30199999999999},{"$f":"KUMULATIV!L34","v":0},{"$error":"#DIV/0!"},168.30199999999999]
[{"$f":"PRORAČUNI!B33","v":{"$error":"#REF!"}},{"$f":"PRORAČUNI!O33","v":0},{"$f":"PRORAČUNI!S33","v":{"$error":"#REF!"}},{"$error":"#REF!"},{"$error":"#REF!"},{"$f":"KUMULATIV!H35","v":341.28},{"$f":"KUMULATIV!L35","v":0},{"$error":"#DIV/0!"},341.28]
[{"$f":"PRORAČUNI!B34","v":{"$error":"#REF!"}},{"$f":"PRORAČUNI!O34","v":0},{"$f":"PRORAČUNI!S34","v":{"$error":"#REF!"}},{"$error":"#REF!"},{"$error":"#REF!"},{"$f":"KUMULATIV!H36","v":202.14700000000002},{"$f":"KUMULATIV!L36","v":0},{"$error":"#DIV/0!"},202.14700000000002]
[{"$f":"PRORAČUNI!B35","v":{"$error":"#REF!"}},{"$f":"PRORAČUNI!O35","v":0},{"$f":"PRORAČUNI!S35","v":{"$error":"#REF!"}},{"$error":"#REF!"},{"$error":"#REF!"},{"$f":"KUMULATIV!H37","v":18.081},{"$f":"KUMULATIV!L37","v":0},{"$error":"#DIV/0!"},18.081]
[{"$f":"PRORAČUNI!B36","v":{"$error":"#REF!"}},{"$f":"PRORAČUNI!O36","v":0},{"$f":"PRORAČUNI!S36","v":{"$error":"#REF!"}},{"$error":"#REF!"},{"$error":"#REF!"},{"$f":"KUMULATIV!H38","v":210.57400000000001},{"$f":"KUMULATIV!L38","v":0},{"$error":"#DIV/0!"},210.57400000000001]
[{"$f":"PRORAČUNI!B37","v":{"$error":"#REF!"}},{"$f":"PRORAČUNI!O37","v":0},{"$f":"PRORAČUNI!S37","v":{"$error":"#REF!"}},{"$error":"#REF!"},{"$error":"#REF!"},{"$f":"KUMULATIV!H39","v":0},{"$f":"KUMULATIV!L39","v":0},{"$error":"#DIV/0!"},0]
[{"$f":"PRORAČUNI!B38","v":{"$error":"#REF!"}},{"$f":"PRORAČUNI!O38","v":0},{"$f":"PRORAČUNI!S38","v":{"$error":"#REF!"}},{"$error":"#REF!"},{"$error":"#REF!"},{"$f":"KUMULATIV!H40","v":0},{"$f":"KUMULATIV!L40","v":0},{"$error":"#DIV/0!"},0]
[{"$f":"PRORAČUNI!B39","v":{"$error":"#REF!"}},{"$f":"PRORAČUNI!O39","v":0},{"$f":"PRORAČUNI!S39","v":{"$error":"#REF!"}},{"$error":"#REF!"},{"$error":"#REF!"},{"$f":"KUMULATIV!H41","v":340.66300000000001},{"$f":"KUMULATIV!L41","v":0},{"$error":"#DIV/0!"},340.66300000000001]
[{"$f":"PRORAČUNI!B40","v":{"$error":"#REF!"}},{"$f":"PRORAČUNI!O40","v":0},{"$f":"PRORAČUNI!S40","v":{"$error":"#REF!"}},{"$error":"#REF!"},{"$error":"#REF!"},{"$f":"KUMULATIV!H42","v":0},{"$f":"KUMULATIV!L42","v":0},{"$error":"#DIV/0!"},0]
[{"$f":"PRORAČUNI!B41","v":{"$error":"#REF!"}},{"$f":"PRORAČUNI!O41","v":0},{"$f":"PRORAČUNI!S41","v":{"$error":"#REF!"}},{"$error":"#REF!"},{"$error":"#REF!"},{"$f":"KUMULATIV!H43","v":97.282000000000011},{"$f":"KUMULATIV!L43","v":0},{"$error":"#DIV/0!"},97.282000000000011]
[{"$f":"PRORAČUNI!B42","v":{"$error":"#REF!"}},{"$f":"PRORAČUNI!O42","v":0},{"$f":"PRORAČUNI!S42","v":{"$error":"#REF!"}},{"$error":"#REF!"},{"$error":"#REF!"},{"$f":"KUMULATIV!H44","v":197.19200000000001},{"$f":"KUMULATIV!L44","v":0},{"$error":"#DIV/0!"},197.19200000000001]
[]
["KC NIŠ"]
["NAZIV KUPCA","1:Dnevna prodaja","2:Dnevni plan","IND. prodaja / plan","Razlika 1-2","3: Kum. prodaje 2013","4: Kum. plana 2013","IND. kum. prod 2013 / kum. plana 2013","Razlika 3-4"]
[{"$f":"PRORAČUNI!B43","v":{"$error":"#REF!"}},{"$f":"PRORAČUNI!O43","v":0},{"$f":"PRORAČUNI!S43","v":{"$error":"#REF!"}},{"$f":"B54/C54","v":{"$error":"#REF!"}},{"$f":"B54-C54","v":{"$error":"#REF!"}},{"$f":"KUMULATIV!H45","v":708.13499999999988},{"$f":"KUMULATIV!L45","v":0},{"$f":"F54/G54","v":{"$error":"#DIV/0!"}},{"$f":"F54-G54","v":708.13499999999988}]
[{"$f":"PRORAČUNI!B44","v":{"$error":"#REF!"}},{"$f":"PRORAČUNI!O44","v":0},{"$f":"PRORAČUNI!S44","v":{"$error":"#REF!"}},{"$f":"B55/C55","v":{"$error":"#REF!"}},{"$f":"B55-C55","v":{"$error":"#REF!"}},{"$f":"KUMULATIV!H46","v":1651.0530000000001},{"$f":"KUMULATIV!L46","v":0},{"$f":"F55/G55","v":{"$error":"#DIV/0!"}},{"$f":"F55-G55","v":1651.0530000000001}]
[{"$f":"PRORAČUNI!B45","v":{"$error":"#REF!"}},{"$f":"PRORAČUNI!O45","v":0},{"$f":"PRORAČUNI!S45","v":{"$error":"#REF!"}},{"$error":"#REF!"},{"$error":"#REF!"},{"$f":"KUMULATIV!H47","v":9453.68},{"$f":"KUMULATIV!L47","v":0},{"$error":"#DIV/0!"},9453.68]
[{"$f":"PRORAČUNI!B46","v":{"$error":"#REF!"}},{"$f":"PRORAČUNI!O46","v":0},{"$f":"PRORAČUNI!S46","v":{"$error":"#REF!"}},{"$error":"#REF!"},{"$error":"#REF!"},{"$f":"KUMULATIV!H48","v":1438.1299999999997},{"$f":"KUMULATIV!L48","v":0},{"$error":"#DIV/0!"},1438.1299999999997]
[{"$f":"PRORAČUNI!B47","v":{"$error":"#REF!"}},{"$f":"PRORAČUNI!O47","v":0},{"$f":"PRORAČUNI!S47","v":{"$error":"#REF!"}},{"$error":"#REF!"},{"$error":"#REF!"},{"$f":"KUMULATIV!H49","v":301.87700000000001},{"$f":"KUMULATIV!L49","v":0},{"$error":"#DIV/0!"},301.87700000000001]
[{"$f":"PRORAČUNI!B48","v":{"$error":"#REF!"}},{"$f":"PRORAČUNI!O48","v":0},{"$f":"PRORAČUNI!S48","v":{"$error":"#REF!"}},{"$error":"#REF!"},{"$error":"#REF!"},{"$f":"KUMULATIV!H50","v":0},{"$f":"KUMULATIV!L50","v":0},{"$error":"#DIV/0!"},0]
[{"$f":"PRORAČUNI!B49","v":{"$error":"#REF!"}},{"$f":"PRORAČUNI!O49","v":0},{"$f":"PRORAČUNI!S49","v":{"$error":"#REF!"}},{"$error":"#REF!"},{"$error":"#REF!"},{"$f":"KUMULATIV!H51","v":270.11},{"$f":"KUMULATIV!L51","v":0},{"$error":"#DIV/0!"},270.11]
[{"$f":"PRORAČUNI!B50","v":{"$error":"#REF!"}},{"$f":"PRORAČUNI!O50","v":0},{"$f":"PRORAČUNI!S50","v":{"$error":"#REF!"}},{"$error":"#REF!"},{"$error":"#REF!"},{"$f":"KUMULATIV!H52","v":0},{"$f":"KUMULATIV!L52","v":0},{"$error":"#DIV/0!"},0]
[{"$f":"PRORAČUNI!B51","v":{"$error":"#REF!"}},{"$f":"PRORAČUNI!O51","v":0},{"$f":"PRORAČUNI!S51","v":{"$error":"#REF!"}},{"$error":"#REF!"},{"$error":"#REF!"},{"$f":"KUMULATIV!H53","v":756.75700000000006},{"$f":"KUMULATIV!L53","v":0},{"$error":"#DIV/0!"},756.75700000000006]
[{"$f":"PRORAČUNI!B52","v":{"$error":"#REF!"}},{"$f":"PRORAČUNI!O52","v":0},{"$f":"PRORAČUNI!S52","v":{"$error":"#REF!"}},{"$error":"#REF!"},{"$error":"#REF!"},{"$f":"KUMULATIV!H54","v":638.14900000000011},{"$f":"KUMULATIV!L54","v":0},{"$error":"#DIV/0!"},638.14900000000011]
[{"$f":"PRORAČUNI!B53","v":{"$error":"#REF!"}},{"$f":"PRORAČUNI!O53","v":0},{"$f":"PRORAČUNI!S53","v":{"$error":"#REF!"}},{"$error":"#REF!"},{"$error":"#REF!"},{"$f":"KUMULATIV!H55","v":417.43700000000001},{"$f":"KUMULATIV!L55","v":0},{"$error":"#DIV/0!"},417.43700000000001]
[{"$f":"PRORAČUNI!B54","v":{"$error":"#REF!"}},{"$f":"PRORAČUNI!O54","v":0},{"$f":"PRORAČUNI!S54","v":{"$error":"#REF!"}},{"$error":"#REF!"},{"$error":"#REF!"},{"$f":"KUMULATIV!H56","v":429},{"$f":"KUMULATIV!L56","v":0},{"$error":"#DIV/0!"},429]
[{"$f":"PRORAČUNI!B55","v":{"$error":"#REF!"}},{"$f":"PRORAČUNI!O55","v":0},{"$f":"PRORAČUNI!S55","v":{"$error":"#REF!"}},{"$error":"#REF!"},{"$error":"#REF!"},{"$f":"KUMULATIV!H57","v":213.29499999999999},{"$f":"KUMULATIV!L57","v":0},{"$error":"#DIV/0!"},213.29499999999999]
[{"$f":"PRORAČUNI!B56","v":{"$error":"#REF!"}},{"$f":"PRORAČUNI!O56","v":0},{"$f":"PRORAČUNI!S56","v":{"$error":"#REF!"}},{"$error":"#REF!"},{"$error":"#REF!"},{"$f":"KUMULATIV!H58","v":495.08799999999997},{"$f":"KUMULATIV!L58","v":0},{"$error":"#DIV/0!"},495.08799999999997]
[{"$f":"PRORAČUNI!B57","v":{"$error":"#REF!"}},{"$f":"PRORAČUNI!O57","v":0},{"$f":"PRORAČUNI!S57","v":{"$error":"#REF!"}},{"$error":"#REF!"},{"$error":"#REF!"},{"$f":"KUMULATIV!H59","v":0},{"$f":"KUMULATIV!L59","v":0},{"$error":"#DIV/0!"},0]
[{"$f":"PRORAČUNI!B58","v":{"$error":"#REF!"}},{"$f":"PRORAČUNI!O58","v":0},{"$f":"PRORAČUNI!S58","v":{"$error":"#REF!"}},{"$error":"#REF!"},{"$error":"#REF!"},{"$f":"KUMULATIV!H60","v":409.34500000000003},{"$f":"KUMULATIV!L60","v":0},{"$error":"#DIV/0!"},409.34500000000003]
[{"$f":"PRORAČUNI!B59","v":{"$error":"#REF!"}},{"$f":"PRORAČUNI!O59","v":0},{"$f":"PRORAČUNI!S59","v":{"$error":"#REF!"}},{"$error":"#REF!"},{"$error":"#REF!"},{"$f":"KUMULATIV!H61","v":292.25400000000002},{"$f":"KUMULATIV!L61","v":0},{"$error":"#DIV/0!"},292.25400000000002]
[{"$f":"PRORAČUNI!B60","v":{"$error":"#REF!"}},{"$f":"PRORAČUNI!O60","v":0},{"$f":"PRORAČUNI!S60","v":{"$error":"#REF!"}},{"$error":"#REF!"},{"$error":"#REF!"},{"$f":"KUMULATIV!H62","v":243.77800000000002},{"$f":"KUMULATIV!L62","v":0},{"$error":"#DIV/0!"},243.77800000000002]
[{"$f":"PRORAČUNI!B61","v":{"$error":"#REF!"}},{"$f":"PRORAČUNI!O61","v":0},{"$f":"PRORAČUNI!S61","v":{"$error":"#REF!"}},{"$error":"#REF!"},{"$error":"#REF!"},{"$f":"KUMULATIV!H63","v":215.17400000000001},{"$f":"KUMULATIV!L63","v":0},{"$error":"#DIV/0!"},215.17400000000001]
[{"$f":"PRORAČUNI!B62","v":{"$error":"#REF!"}},{"$f":"PRORAČUNI!O62","v":0},{"$f":"PRORAČUNI!S62","v":{"$error":"#REF!"}},{"$error":"#REF!"},{"$error":"#REF!"},{"$f":"KUMULATIV!H64","v":136.54400000000001},{"$f":"KUMULATIV!L64","v":0},{"$error":"#DIV/0!"},136.54400000000001]

{"sheet":"RAZRADA KUPCI BG","index":10,"n_rows":87,"n_cols":10,"rows_kept":87,"cut":false,"hidden":false,"merged":[[2,3,2,4],[2,6,2,7],[0,1,0,9]]}
[{"$f":"'RAZRADA UKUPNO'!A1","v":"VINDIJA"},{"$f":"'RAZRADA UKUPNO'!B1:I1","v":"Dnevna prodaja od 08.08. i kumulativ dnevnog plana i prodaje za 01.- 08.08.2013"}]
[]
[null,null,null,{"$f":"'RAZRADA UKUPNO'!D3:E3","v":"Izvještaj za "},null,null,{"$f":"'RAZRADA UKUPNO'!G3:H3","v":"Kolovoz/Avgust"}]
[null,null,null,{"$f":"'RAZRADA UKUPNO'!D4","v":6},{"$f":"'RAZRADA UKUPNO'!E4","v":"dana +"},null,{"$f":"'RAZRADA UKUPNO'!G4","v":22},{"$f":"'RAZRADA UKUPNO'!H4","v":"dana +"}]
["KC BEOGRAD",null,null,{"$f":"'RAZRADA UKUPNO'!D5","v":1},{"$f":"'RAZRADA UKUPNO'!E5","v":"subota"},null,{"$f":"'RAZRADA UKUPNO'!G5","v":5},{"$f":"'RAZRADA UKUPNO'!H5","v":"subota"}]
[]
["KUPAC","GRUPA PROIZVODA","1:Dnevna prodaja","2:Dnevni plan","IND. prodaja / plan","Razlika 1-2","3: Kum. prodaje 2013","4: Kum. plana 2013","IND. kum. prod 2013 / kum. plana 2013","Razlika 3-4"]
[{"$f":"'PRORAČUN 2'!C3","v":"DELHAIZE SERBIA DOO"},"1. Sveži proizvodi",{"$f":"'PRORAČUN 2'!E3","v":1484.7339999999999},{"$f":"'PRORAČUN 2'!F3","v":2070.6616548210159},{"$f":"IFERROR(C8/D8,0)","v":0.71703360930221005},{"$f":"IFERROR(C8-D8,0)","v":-585.92765482101595},{"$f":"'KUMULATIV 2'!E3","v":16466.732999999997},{"$f":"'KUMULATIV 2'!F3","v":14494.631583747108},{"$f":"IFERROR(G8/H8,0)","v":1.1360573675059265},{"$f":"IFERROR(G8-H8,0)","v":1972.1014162528882}]
[null,"2. Smrznuti proizvodi",{"$f":"'PRORAČUN 2'!E4","v":0},{"$f":"'PRORAČUN 2'!F4","v":0},{"$f":"IFERROR(C9/D9,0)","v":0},{"$f":"IFERROR(C9-D9,0)","v":0},{"$f":"'KUMULATIV 2'!E4","v":0},{"$f":"'KUMULATIV 2'!F4","v":0},{"$f":"IFERROR(G9/H9,0)","v":0},{"$f":"IFERROR(G9-H9,0)","v":0}]
[null,"3. Prerađevine",{"$f":"'PRORAČUN 2'!E5","v":50.921000000000006},{"$f":"'PRORAČUN 2'!F5","v":294.01755613204404},0.17319033825698238,-243.09655613204404,{"$f":"'KUMULATIV 2'!E5","v":332.72899999999998},{"$f":"'KUMULATIV 2'!F5","v":2058.1228929243084},0.16166624507404317,-1725.3938929243084]
[null,"Grand Total",{"$f":"'PRORAČUN 2'!E6","v":1535.655},{"$f":"'PRORAČUN 2'!F6","v":2364.6792109530597},0.6494136679880016,-829.02421095305976,{"$f":"'KUMULATIV 2'!E6","v":16799.462},{"$f":"'KUMULATIV 2'!F6","v":16552.75447667142},1.0149043184127617,246.70752332857955]
[{"$f":"'PRORAČUN 2'!C7","v":"IDEA DOO"},{"$f":"$B$8","v":"1. Sveži proizvodi"},{"$f":"'PRORAČUN 2'!E7","v":1723.1860000000013},{"$f":"'PRORAČUN 2'!F7","v":1278.8070666678552},1.3474948996724341,444.37893333214606,{"$f":"'KUMULATIV 2'!E7","v":10500.770000000002},{"$f":"'KUMULATIV 2'!F7","v":8951.6494666749859},1.1730541995742851,1549.1205333250164]
[null,{"$f":"$B$9","v":"2. Smrznuti proizvodi"},{"$f":"'PRORAČUN 2'!E8","v":0},{"$f":"'PRORAČUN 2'!F8","v":0},0,0,{"$f":"'KUMULATIV 2'!E8","v":0},{"$f":"'KUMULATIV 2'!F8","v":0},0,0]
[null,"3. Prerađevine",{"$f":"'PRORAČUN 2'!E9","v":246.18200000000002},{"$f":"'PRORAČUN 2'!F9","v":17.832413070596054},13.805310533431429,228.34958692940396,{"$f":"'KUMULATIV 2'!E9","v":1496.2550000000001},{"$f":"'KUMULATIV 2'!F9","v":124.8268914941724},11.986639914604085,1371.4281085058278]
[null,{"$f":"$B$11","v":"Grand Total"},{"$f":"'PRORAČUN 2'!E10","v":1969.3680000000013},{"$f":"'PRORAČUN 2'!F10","v":1296.6394797384512},1.5188246469228657,672.7285202615501,{"$f":"'KUMULATIV 2'!E10","v":11997.025000000001},{"$f":"'KUMULATIV 2'!F10","v":9076.4763581691586},1.3217711947436785,2920.5486418308428]
[{"$f":"'PRORAČUN 2'!C11","v":"MERCATOR S"},{"$f":"$B$8","v":"1. Sveži proizvodi"},{"$f":"'PRORAČUN 2'!E11","v":493.58500000000009},{"$f":"'PRORAČUN 2'!F11","v":708.7756812918575},0.69639099228173595,-215.1906812918574,{"$f":"'KUMULATIV 2'!E11","v":3493.5020000000004},{"$f":"'KUMULATIV 2'!F11","v":4961.429769043003},0.70413210760289624,-1467.9277690430026]
[null,{"$f":"$B$9","v":"2. Smrznuti proizvodi"},{"$f":"'PRORAČUN 2'!E12","v":19.132999999999999},{"$f":"'PRORAČUN 2'!F12","v":15.10537900485849},1.2666348850860389,4.0276209951415094,{"$f":"'KUMULATIV 2'!E12","v":46.536000000000001},{"$f":"'KUMULATIV 2'!F12","v":105.73765303400943},0.44010812293168805,-59.201653034009425]
[null,{"$f":"$B$10","v":"3. Prerađevine"},{"$f":"'PRORAČUN 2'!E13","v":68.067000000000007},{"$f":"'PRORAČUN 2'!F13","v":147.63721786742215},0.46104228312622364,-79.570217867422144,{"$f":"'KUMULATIV 2'!E13","v":598.55700000000002},{"$f":"'KUMULATIV 2'!F13","v":1033.4605250719551},0.57917741943585632,-434.90352507195507]
[null,{"$f":"$B$11","v":"Grand Total"},{"$f":"'PRORAČUN 2'!E14","v":580.78500000000008},{"$f":"'PRORAČUN 2'!F14","v":871.51827816413822},0.66640598889495395,-290.73327816413814,{"$f":"'KUMULATIV 2'!E14","v":4138.5950000000003},{"$f":"'KUMULATIV 2'!F14","v":6100.627947148967},0.67838836196101882,-1962.0329471489667]
[{"$f":"'PRORAČUN 2'!C15","v":"ŠTRAND DOO"},{"$f":"$B$8","v":"1. Sveži proizvodi"},{"$f":"'PRORAČUN 2'!E15","v":678.83800000000008},{"$f":"'PRORAČUN 2'!F15","v":676.21141839442669},1.0038842609487575,2.6265816055733922,{"$f":"'KUMULATIV 2'!E15","v":5020.0519999999997},{"$f":"'KUMULATIV 2'!F15","v":4733.4799287609867},1.0605415203089337,286.57207123901298]
[null,{"$f":"$B$9","v":"2. Smrznuti proizvodi"},{"$f":"'PRORAČUN 2'!E16","v":0},{"$f":"'PRORAČUN 2'!F16","v":0},0,0,{"$f":"'KUMULATIV 2'!E16","v":0},{"$f":"'KUMULATIV 2'!F16","v":0},0,0]
[null,{"$f":"$B$10","v":"3. Prerađevine"},{"$f":"'PRORAČUN 2'!E17","v":0},{"$f":"'PRORAČUN 2'!F17","v":0},0,0,{"$f":"'KUMULATIV 2'!E17","v":0},{"$f":"'KUMULATIV 2'!F17","v":0},0,0]
[null,{"$f":"$B$11","v":"Grand Total"},{"$f":"'PRORAČUN 2'!E18","v":678.83800000000008},{"$f":"'PRORAČUN 2'!F18","v":676.21141839442669},1.0038842609487575,2.6265816055733922,{"$f":"'KUMULATIV 2'!E18","v":5020.0519999999997},{"$f":"'KUMULATIV 2'!F18","v":4733.4799287609867},1.0605415203089337,286.57207123901298]
[{"$f":"'PRORAČUN 2'!C19","v":"METRO CASH & CARRY DOO"},{"$f":"$B$8","v":"1. Sveži proizvodi"},{"$f":"'PRORAČUN 2'!E19","v":162.40500000000003},{"$f":"'PRORAČUN 2'!F19","v":519.06888589112782},0.31287754749773944,-356.66388589112779,{"$f":"'KUMULATIV 2'!E19","v":1324.682},{"$f":"'KUMULATIV 2'!F19","v":3633.4822012378954},0.36457643842281451,-2308.8002012378956]
[null,{"$f":"$B$9","v":"2. Smrznuti proizvodi"},{"$f":"'PRORAČUN 2'!E20","v":0},{"$f":"'PRORAČUN 2'!F20","v":6.3749341137545237},0,-6.3749341137545237,{"$f":"'KUMULATIV 2'!E20","v":0},{"$f":"'KUMULATIV 2'!F20","v":44.624538796281669},0,-44.624538796281669]
[null,{"$f":"$B$10","v":"3. Prerađevine"},{"$f":"'PRORAČUN 2'!E21","v":0},{"$f":"'PRORAČUN 2'!F21","v":103.29789489197951},0,-103.29789489197951,{"$f":"'KUMULATIV 2'!E21","v":260.5},{"$f":"'KUMULATIV 2'!F21","v":723.0852642438565},0.36026180159045229,-462.5852642438565]
[null,{"$f":"$B$11","v":"Grand Total"},{"$f":"'PRORAČUN 2'!E22","v":162.40500000000003},{"$f":"'PRORAČUN 2'!F22","v":628.74171489686182},0.25830161440241128,-466.33671489686179,{"$f":"'KUMULATIV 2'!E22","v":1585.182},{"$f":"'KUMULATIV 2'!F22","v":4401.1920042780321},0.36017106239836316,-2816.0100042780323]
[{"$f":"'PRORAČUN 2'!C23","v":"UNIVEREXPORT DOO"},{"$f":"$B$8","v":"1. Sveži proizvodi"},{"$f":"'PRORAČUN 2'!E23","v":896.67399999999986},{"$f":"'PRORAČUN 2'!F23","v":447.2198166196813},2.004996126463102,449.45418338031857,{"$f":"'KUMULATIV 2'!E23","v":4018.2729999999997},{"$f":"'KUMULATIV 2'!F23","v":3130.5387163377691},1.2835723701576636,887.73428366223061]
[null,{"$f":"$B$9","v":"2. Smrznuti proizvodi"},{"$f":"'PRORAČUN 2'!E24","v":0},{"$f":"'PRORAČUN 2'!F24","v":0},0,0,{"$f":"'KUMULATIV 2'!E24","v":0},{"$f":"'KUMULATIV 2'!F24","v":0},0,0]
[null,{"$f":"$B$10","v":"3. Prerađevine"},{"$f":"'PRORAČUN 2'!E25","v":92.25},{"$f":"'PRORAČUN 2'!F25","v":44.926506506236706},2.0533535138592143,47.323493493763294,{"$f":"'KUMULATIV 2'!E25","v":533.9},{"$f":"'KUMULATIV 2'!F25","v":314.48554554365694},1.6976932885008664,219.41445445634304]
[null,{"$f":"$B$11","v":"Grand Total"},{"$f":"'PRORAČUN 2'!E26","v":988.92399999999986},{"$f":"'PRORAČUN 2'!F26","v":492.14632312591806},2.0094105218926503,496.77767687408181,{"$f":"'KUMULATIV 2'!E26","v":4552.1729999999998},{"$f":"'KUMULATIV 2'!F26","v":3445.0242618814264},1.3213761802402888,1107.1487381185734]
[{"$f":"'PRORAČUN 2'!C27","v":"AMAN DOO"},{"$f":"$B$8","v":"1. Sveži proizvodi"},{"$f":"'PRORAČUN 2'!E27","v":12.135},{"$f":"'PRORAČUN 2'!F27","v":302.94642145733746},4.0056588031718722E-2,-290.81142145733747,{"$f":"'KUMULATIV 2'!E27","v":127.49600000000001},{"$f":"'KUMULATIV 2'!F27","v":2120.6249502013625},6.0121899437188889E-2,-1993.1289502013624]
[null,{"$f":"$B$9","v":"2. Smrznuti proizvodi"},{"$f":"'PRORAČUN 2'!E28","v":0},{"$f":"'PRORAČUN 2'!F28","v":0},0,0,{"$f":"'KUMULATIV 2'!E28","v":0},{"$f":"'KUMULATIV 2'!F28","v":0},0,0]
[null,{"$f":"$B$10","v":"3. Prerađevine"},{"$f":"'PRORAČUN 2'!E29","v":236.255},{"$f":"'PRORAČUN 2'!F29","v":138.69664248371743},1.7033937936005599,97.55835751628257,{"$f":"'KUMULATIV 2'!E29","v":1841.0940000000001},{"$f":"'KUMULATIV 2'!F29","v":970.87649738602181},1.8963215248869894,870.21750261397824]
[null,{"$f":"$B$11","v":"Grand Total"},{"$f":"'PRORAČUN 2'!E30","v":248.39},{"$f":"'PRORAČUN 2'!F30","v":441.64306394105489},0.56242250876411826,-193.2530639410549,{"$f":"'KUMULATIV 2'!E30","v":1968.5900000000001},{"$f":"'KUMULATIV 2'!F30","v":3091.5014475873845},0.63677473013518815,-1122.9114475873844]
[{"$f":"'PRORAČUN 2'!C31","v":"MESO-MARKET"},{"$f":"$B$8","v":"1. Sveži proizvodi"},{"$f":"'PRORAČUN 2'!E31","v":251.47499999999999},{"$f":"'PRORAČUN 2'!F31","v":308.27991935776402},0.81573590820931496,-56.804919357764021,{"$f":"'KUMULATIV 2'!E31","v":1782.3959999999997},{"$f":"'KUMULATIV 2'!F31","v":2157.9594355043478},0.82596362594898676,-375.56343550434804]
[null,{"$f":"$B$9","v":"2. Smrznuti proizvodi"},{"$f":"'PRORAČUN 2'!E32","v":0},{"$f":"'PRORAČUN 2'!F32","v":0},0,0,{"$f":"'KUMULATIV 2'!E32","v":0},{"$f":"'KUMULATIV 2'!F32","v":0},0,0]
[null,{"$f":"$B$10","v":"3. Prerađevine"},{"$f":"'PRORAČUN 2'!E33","v":0},{"$f":"'PRORAČUN 2'!F33","v":3.3440890881268306},0,-3.3440890881268306,{"$f":"'KUMULATIV 2'!E33","v":13.285},{"$f":"'KUMULATIV 2'!F33","v":23.408623616887809},0.56752589205696535,-10.123623616887809]
[null,{"$f":"$B$11","v":"Grand Total"},{"$f":"'PRORAČUN 2'!E34","v":251.47499999999999},{"$f":"'PRORAČUN 2'!F34","v":311.62400844589087},0.80698211044180534,-60.149008445890871,{"$f":"'KUMULATIV 2'!E34","v":1795.6809999999998},{"$f":"'KUMULATIV 2'!F34","v":2181.368059121236},0.82319028762316704,-385.68705912123619]
[{"$f":"'PRORAČUN 2'!C35","v":"MUP UPRAVA ZA POSLOVE ISHRANE I SMEŠTAJA"},{"$f":"$B$8","v":"1. Sveži proizvodi"},{"$f":"'PRORAČUN 2'!E35","v":0},{"$f":"'PRORAČUN 2'!F35","v":0},0,0,{"$f":"'KUMULATIV 2'!E35","v":0},{"$f":"'KUMULATIV 2'!F35","v":0},0,0]
[null,{"$f":"$B$9","v":"2. Smrznuti proizvodi"},{"$f":"'PRORAČUN 2'!E36","v":239.26800000000003},{"$f":"'PRORAČUN 2'!F36","v":177.0353195086964},1.3515269193967061,62.232680491303626,{"$f":"'KUMULATIV 2'!E36","v":1251.989},{"$f":"'KUMULATIV 2'!F36","v":1239.2472365608749},1.0102818574560519,12.74176343912518]
[null,{"$f":"$B$10","v":"3. Prerađevine"},{"$f":"'PRORAČUN 2'!E37","v":0},{"$f":"'PRORAČUN 2'!F37","v":0},0,0,{"$f":"'KUMULATIV 2'!E37","v":0},{"$f":"'KUMULATIV 2'!F37","v":0},0,0]
[null,{"$f":"$B$11","v":"Grand Total"},{"$f":"'PRORAČUN 2'!E38","v":239.26800000000003},{"$f":"'PRORAČUN 2'!F38","v":177.0353195086964},1.3515269193967061,62.232680491303626,{"$f":"'KUMULATIV 2'!E38","v":1251.989},{"$f":"'KUMULATIV 2'!F38","v":1239.2472365608749},1.0102818574560519,12.74176343912518]
[{"$f":"'PRORAČUN 2'!C39","v":"ĐERIĆ STR"},{"$f":"$B$8","v":"1. Sveži proizvodi"},{"$f":"'PRORAČUN 2'!E39","v":61.096999999999994},{"$f":"'PRORAČUN 2'!F39","v":164.41968324704888},0.37159176318445197,-103.32268324704889,{"$f":"'KUMULATIV 2'!E39","v":383.33799999999997},{"$f":"'KUMULATIV 2'!F39","v":1150.9377827293422},0.33306578839644091,-767.59978272934222]
[null,{"$f":"$B$9","v":"2. Smrznuti proizvodi"},{"$f":"'PRORAČUN 2'!E40","v":0},{"$f":"'PRORAČUN 2'!F40","v":0},0,0,{"$f":"'KUMULATIV 2'!E40","v":0},{"$f":"'KUMULATIV 2'!F40","v":0},0,0]
[null,{"$f":"$B$10","v":"3. Prerađevine"},{"$f":"'PRORAČUN 2'!E41","v":0},{"$f":"'PRORAČUN 2'!F41","v":0},0,0,{"$f":"'KUMULATIV 2'!E41","v":13},{"$f":"'KUMULATIV 2'!F41","v":0},0,13]
[null,{"$f":"$B$11","v":"Grand Total"},{"$f":"'PRORAČUN 2'!E42","v":61.096999999999994},{"$f":"'PRORAČUN 2'!F42","v":164.41968324704888},0.37159176318445197,-103.32268324704889,{"$f":"'KUMULATIV 2'!E42","v":396.33799999999997},{"$f":"'KUMULATIV 2'!F42","v":1150.9377827293422},0.34436092545343427,-754.59978272934222]
[{"$f":"'PRORAČUN 2'!C43","v":"TP DOO TREND COMERCCE ŠID"},{"$f":"$B$8","v":"1. Sveži proizvodi"},{"$f":"'PRORAČUN 2'!E43","v":0},{"$f":"'PRORAČUN 2'!F43","v":0},0,0,{"$f":"'KUMULATIV 2'!E43","v":0},{"$f":"'KUMULATIV 2'!F43","v":0},0,0]
[null,{"$f":"$B$9","v":"2. Smrznuti proizvodi"},{"$f":"'PRORAČUN 2'!E44","v":60.995000000000005},{"$f":"'PRORAČUN 2'!F44","v":25.686501044029782},2.3745935616317366,35.308498955970222,{"$f":"'KUMULATIV 2'!E44","v":230.79000000000002},{"$f":"'KUMULATIV 2'!F44","v":179.80550730820852},1.2835535654889474,50.984492691791502]
[null,{"$f":"$B$10","v":"3. Prerađevine"},{"$f":"'PRORAČUN 2'!E45","v":141},{"$f":"'PRORAČUN 2'!F45","v":78.945310455390256},1.7860465578848421,62.054689544609744,{"$f":"'KUMULATIV 2'!E45","v":531.63499999999999},{"$f":"'KUMULATIV 2'!F45","v":552.61717318773185},0.9620312682888631,-20.98217318773186]
[null,{"$f":"$B$11","v":"Grand Total"},{"$f":"'PRORAČUN 2'!E46","v":201.995},{"$f":"'PRORAČUN 2'!F46","v":104.63181149942002},1.9305314235252409,97.36318850057998,{"$f":"'KUMULATIV 2'!E46","v":762.42500000000007},{"$f":"'KUMULATIV 2'!F46","v":732.42268049594009},1.0409631218461786,30.002319504059983]
[{"$f":"'PRORAČUN 2'!C47","v":"VINDIJA D.O.O. LAJKOVAC - VLASTITA POTROŠNJA"},{"$f":"$B$8","v":"1. Sveži proizvodi"},{"$f":"'PRORAČUN 2'!E47","v":0},{"$f":"'PRORAČUN 2'!F47","v":47.212732771319985},0,-47.212732771319985,{"$f":"'KUMULATIV 2'!E47","v":0},{"$f":"'KUMULATIV 2'!F47","v":330.48912939923986},0,-330.48912939923986]
[null,{"$f":"$B$9","v":"2. Smrznuti proizvodi"},{"$f":"'PRORAČUN 2'!E48","v":0},{"$f":"'PRORAČUN 2'!F48","v":29.186290538438641},0,-29.186290538438641,{"$f":"'KUMULATIV 2'!E48","v":0},{"$f":"'KUMULATIV 2'!F48","v":204.30403376907049},0,-204.30403376907049]
[null,{"$f":"$B$10","v":"3. Prerađevine"},{"$f":"'PRORAČUN 2'!E49","v":0},{"$f":"'PRORAČUN 2'!F49","v":20.922892652947361},0,-20.922892652947361,{"$f":"'KUMULATIV 2'!E49","v":0},{"$f":"'KUMULATIV 2'!F49","v":146.46024857063151},0,-146.46024857063151]
[null,{"$f":"$B$11","v":"Grand Total"},{"$f":"'PRORAČUN 2'!E50","v":0},{"$f":"'PRORAČUN 2'!F50","v":97.321915962705972},0,-97.321915962705972,{"$f":"'KUMULATIV 2'!E50","v":0},{"$f":"'KUMULATIV 2'!F50","v":681.25341173894174},0,-681.25341173894174]
[{"$f":"'PRORAČUN 2'!C51","v":"PODUNAVLJE AD, BEOGRAD"},{"$f":"$B$8","v":"1. Sveži proizvodi"},{"$f":"'PRORAČUN 2'!E51","v":7.9859999999999998},{"$f":"'PRORAČUN 2'!F51","v":32.670249768699037},0.24444257563195271,-24.684249768699036,{"$f":"'KUMULATIV 2'!E51","v":459.22899999999998},{"$f":"'KUMULATIV 2'!F51","v":228.69174838089322},2.0080698287160752,230.53725161910677]
[null,{"$f":"$B$9","v":"2. Smrznuti proizvodi"},{"$f":"'PRORAČUN 2'!E52","v":136.50900000000001},{"$f":"'PRORAČUN 2'!F52","v":47.56560670742364},2.8699097824961588,88.943393292576374,{"$f":"'KUMULATIV 2'!E52","v":613.11699999999996},{"$f":"'KUMULATIV 2'!F52","v":332.95924695196544},1.841417547680998,280.15775304803452]
[null,{"$f":"$B$10","v":"3. Prerađevine"},{"$f":"'PRORAČUN 2'!E53","v":29.863},{"$f":"'PRORAČUN 2'!F53","v":9.8722297994276627},3.0249498448396421,19.990770200572335,{"$f":"'KUMULATIV 2'!E53","v":141.649},{"$f":"'KUMULATIV 2'!F53","v":69.105608595993644},2.0497467988178895,72.543391404006357]
[null,{"$f":"$B$11","v":"Grand Total"},{"$f":"'PRORAČUN 2'!E54","v":174.358},{"$f":"'PRORAČUN 2'!F54","v":90.108086275550335},1.9349872714732128,84.249913724449669,{"$f":"'KUMULATIV 2'!E54","v":1213.9949999999999},{"$f":"'KUMULATIV 2'!F54","v":630.75660392885243},1.9246647477620942,583.23839607114746]
[{"$f":"'PRORAČUN 2'!C55","v":"POINT MARTINOVIĆ DOO"},{"$f":"$B$8","v":"1. Sveži proizvodi"},{"$f":"'PRORAČUN 2'!E55","v":0},{"$f":"'PRORAČUN 2'!F55","v":83.211675069864512},0,-83.211675069864512,{"$f":"'KUMULATIV 2'!E55","v":0},{"$f":"'KUMULATIV 2'!F55","v":582.48172548905154},0,-582.48172548905154]
[null,{"$f":"$B$9","v":"2. Smrznuti proizvodi"},{"$f":"'PRORAČUN 2'!E56","v":0},{"$f":"'PRORAČUN 2'!F56","v":0.60680872127948282},0,-0.60680872127948282,{"$f":"'KUMULATIV 2'!E56","v":0},{"$f":"'KUMULATIV 2'!F56","v":4.2476610489563793},0,-4.2476610489563793]
[null,{"$f":"$B$10","v":"3. Prerađevine"},{"$f":"'PRORAČUN 2'!E57","v":0},{"$f":"'PRORAČUN 2'!F57","v":0},0,0,{"$f":"'KUMULATIV 2'!E57","v":0},{"$f":"'KUMULATIV 2'!F57","v":0},0,0]
[null,{"$f":"$B$11","v":"Grand Total"},{"$f":"'PRORAČUN 2'!E58","v":0},{"$f":"'PRORAČUN 2'!F58","v":83.81848379114399},0,-83.81848379114399,{"$f":"'KUMULATIV 2'!E58","v":0},{"$f":"'KUMULATIV 2'!F58","v":586.72938653800793},0,-586.72938653800793]
[{"$f":"'PRORAČUN 2'!C59","v":"MIS CHILLI DOO"},{"$f":"$B$8","v":"1. Sveži proizvodi"},{"$f":"'PRORAČUN 2'!E59","v":0},{"$f":"'PRORAČUN 2'!F59","v":45.721326720895732},0,-45.721326720895732,{"$f":"'KUMULATIV 2'!E59","v":190.82},{"$f":"'KUMULATIV 2'!F59","v":320.04928704627008},0.59622066888845404,-129.22928704627009]
[null,{"$f":"$B$9","v":"2. Smrznuti proizvodi"},{"$f":"'PRORAČUN 2'!E60","v":0},{"$f":"'PRORAČUN 2'!F60","v":0},0,0,{"$f":"'KUMULATIV 2'!E60","v":0},{"$f":"'KUMULATIV 2'!F60","v":0},0,0]
[null,{"$f":"$B$10","v":"3. Prerađevine"},{"$f":"'PRORAČUN 2'!E61","v":0},{"$f":"'PRORAČUN 2'!F61","v":37.451477460631622},0,-37.451477460631622,{"$f":"'KUMULATIV 2'!E61","v":227.61699999999996},{"$f":"'KUMULATIV 2'!F61","v":262.16034222442136},0.86823582113403441,-34.543342224421394]
[null,{"$f":"$B$11","v":"Grand Total"},{"$f":"'PRORAČUN 2'!E62","v":0},{"$f":"'PRORAČUN 2'!F62","v":83.172804181527354},0,-83.172804181527354,{"$f":"'KUMULATIV 2'!E62","v":418.43700000000001},{"$f":"'KUMULATIV 2'!F62","v":582.20962927069149},0.71870504877110619,-163.77262927069148]
[{"$f":"'PRORAČUN 2'!C63","v":"VEROPOULOS DOO"},{"$f":"$B$8","v":"1. Sveži proizvodi"},{"$f":"'PRORAČUN 2'!E63","v":12.215},{"$f":"'PRORAČUN 2'!F63","v":55.957977875138077},0.21828880284516283,-43.742977875138081,{"$f":"'KUMULATIV 2'!E63","v":134.98400000000001},{"$f":"'KUMULATIV 2'!F63","v":391.7058451259665},0.34460552907141645,-256.72184512596652]
[null,{"$f":"$B$9","v":"2. Smrznuti proizvodi"},{"$f":"'PRORAČUN 2'!E64","v":0},{"$f":"'PRORAČUN 2'!F64","v":0.52126023899778684},0,-0.52126023899778684,{"$f":"'KUMULATIV 2'!E64","v":0},{"$f":"'KUMULATIV 2'!F64","v":3.6488216729845075},0,-3.6488216729845075]
[null,{"$f":"$B$10","v":"3. Prerađevine"},{"$f":"'PRORAČUN 2'!E65","v":92.843000000000004},{"$f":"'PRORAČUN 2'!F65","v":16.851316186025802},5.5095399656076367,75.991683813974205,{"$f":"'KUMULATIV 2'!E65","v":251.66300000000001},{"$f":"'KUMULATIV 2'!F65","v":117.9592133021806},2.1334747236343916,133.7037866978194]
[null,{"$f":"$B$11","v":"Grand Total"},{"$f":"'PRORAČUN 2'!E66","v":105.05800000000001},{"$f":"'PRORAČUN 2'!F66","v":73.330554300161666},1.4326633829872522,31.727445699838341,{"$f":"'KUMULATIV 2'!E66","v":386.64699999999999},{"$f":"'KUMULATIV 2'!F66","v":513.31388010113164},0.7532369861571323,-126.66688010113165]
[{"$f":"'PRORAČUN 2'!C67","v":"JOVANA STR"},{"$f":"$B$8","v":"1. Sveži proizvodi"},{"$f":"'PRORAČUN 2'!E67","v":46.153999999999996},{"$f":"'PRORAČUN 2'!F67","v":53.967701651104086},0.85521522295652119,-7.8137016511040898,{"$f":"'KUMULATIV 2'!E67","v":250.92999999999998},{"$f":"'KUMULATIV 2'!F67","v":377.77391155772864},0.66423326842582853,-126.84391155772866]
[null,{"$f":"$B$9","v":"2. Smrznuti proizvodi"},{"$f":"'PRORAČUN 2'!E68","v":0},{"$f":"'PRORAČUN 2'!F68","v":0},{"$f":"IFERROR(C73/D73,0)","v":0},{"$f":"IFERROR(C73-D73,0)","v":0},{"$f":"'KUMULATIV 2'!E68","v":0},{"$f":"'KUMULATIV 2'!F68","v":0},{"$f":"IFERROR(G73/H73,0)","v":0},{"$f":"IFERROR(G73-H73,0)","v":0}]
[null,{"$f":"$B$10","v":"3. Prerađevine"},{"$f":"'PRORAČUN 2'!E69","v":7.2},{"$f":"'PRORAČUN 2'!F69","v":9.990956780541044},0.72065170114869581,-2.7909567805410438,{"$f":"'KUMULATIV 2'!E69","v":48.111000000000004},{"$f":"'KUMULATIV 2'!F69","v":69.936697463787297},0.68792210305485935,-21.825697463787293]
[null,{"$f":"$B$11","v":"Grand Total"},{"$f":"'PRORAČUN 2'!E70","v":53.353999999999999},{"$f":"'PRORAČUN 2'!F70","v":63.958658431645134},0.83419510834520227,-10.604658431645134,{"$f":"'KUMULATIV 2'!E70","v":299.041},{"$f":"'KUMULATIV 2'!F70","v":447.71060902151589},0.66793369193006724,-148.6696090215159]
[{"$f":"'PRORAČUN 2'!C71","v":"SLAVONAC STUR, ISMETA MUJEZINOVIĆA"},{"$f":"$B$8","v":"1. Sveži proizvodi"},{"$f":"'PRORAČUN 2'!E71","v":0},{"$f":"'PRORAČUN 2'!F71","v":57.190027817047969},0,-57.190027817047969,{"$f":"'KUMULATIV 2'!E71","v":0},{"$f":"'KUMULATIV 2'!F71","v":400.33019471933579},0,-400.33019471933579]
[null,{"$f":"$B$9","v":"2. Smrznuti proizvodi"},{"$f":"'PRORAČUN 2'!E72","v":0},{"$f":"'PRORAČUN 2'!F72","v":0},0,0,{"$f":"'KUMULATIV 2'!E72","v":0},{"$f":"'KUMULATIV 2'!F72","v":0},0,0]
[null,{"$f":"$B$10","v":"3. Prerađevine"},{"$f":"'PRORAČUN 2'!E73","v":0},{"$f":"'PRORAČUN 2'!F73","v":0},0,0,{"$f":"'KUMULATIV 2'!E73","v":0},{"$f":"'KUMULATIV 2'!F73","v":0},0,0]
[null,{"$f":"$B$11","v":"Grand Total"},{"$f":"'PRORAČUN 2'!E74","v":0},{"$f":"'PRORAČUN 2'!F74","v":57.190027817047969},0,-57.190027817047969,{"$f":"'KUMULATIV 2'!E74","v":0},{"$f":"'KUMULATIV 2'!F74","v":400.33019471933579},0,-400.33019471933579]
[{"$f":"'PRORAČUN 2'!C75","v":"MEDIUS DOO"},{"$f":"$B$8","v":"1. Sveži proizvodi"},{"$f":"'PRORAČUN 2'!E75","v":0},{"$f":"'PRORAČUN 2'!F75","v":8.9340155824650349},0,-8.9340155824650349,{"$f":"'KUMULATIV 2'!E75","v":10.173},{"$f":"'KUMULATIV 2'!F75","v":62.53810907725525},0.16266881346592971,-52.365109077255248]
[null,{"$f":"$B$9","v":"2. Smrznuti proizvodi"},{"$f":"'PRORAČUN 2'!E76","v":0},{"$f":"'PRORAČUN 2'!F76","v":0},0,0,{"$f":"'KUMULATIV 2'!E76","v":0},{"$f":"'KUMULATIV 2'!F76","v":0},0,0]
[null,{"$f":"$B$10","v":"3. Prerađevine"},{"$f":"'PRORAČUN 2'!E77","v":0},{"$f":"'PRORAČUN 2'!F77","v":46.521405619193111},0,-46.521405619193111,{"$f":"'KUMULATIV 2'!E77","v":216.56399999999999},{"$f":"'KUMULATIV 2'!F77","v":325.64983933435178},0.6650210558760602,-109.08583933435179]
[null,{"$f":"$B$11","v":"Grand Total"},{"$f":"'PRORAČUN 2'!E78","v":0},{"$f":"'PRORAČUN 2'!F78","v":55.455421201658147},0,-55.455421201658147,{"$f":"'KUMULATIV 2'!E78","v":226.73699999999999},{"$f":"'KUMULATIV 2'!F78","v":388.18794841160707},0.58409077594439929,-161.45094841160707]
[{"$f":"'PRORAČUN 2'!C79","v":"FAMOSO"},{"$f":"$B$8","v":"1. Sveži proizvodi"},{"$f":"'PRORAČUN 2'!E79","v":0},{"$f":"'PRORAČUN 2'!F79","v":50.54283484523345},0,-50.54283484523345,{"$f":"'KUMULATIV 2'!E79","v":0},{"$f":"'KUMULATIV 2'!F79","v":353.79984391663419},0,-353.79984391663419]
[null,{"$f":"$B$9","v":"2. Smrznuti proizvodi"},{"$f":"'PRORAČUN 2'!E80","v":0},{"$f":"'PRORAČUN 2'!F80","v":0},0,0,{"$f":"'KUMULATIV 2'!E80","v":0},{"$f":"'KUMULATIV 2'!F80","v":0},0,0]
[null,{"$f":"$B$10","v":"3. Prerađevine"},{"$f":"'PRORAČUN 2'!E81","v":0},{"$f":"'PRORAČUN 2'!F81","v":0},0,0,{"$f":"'KUMULATIV 2'!E81","v":0},{"$f":"'KUMULATIV 2'!F81","v":0},0,0]
[null,{"$f":"$B$11","v":"Grand Total"},{"$f":"'PRORAČUN 2'!E82","v":0},{"$f":"'PRORAČUN 2'!F82","v":50.54283484523345},0,-50.54283484523345,{"$f":"'KUMULATIV 2'!E82","v":0},{"$f":"'KUMULATIV 2'!F82","v":353.79984391663419},0,-353.79984391663419]

{"sheet":"RAZRADA KUPCI LA","index":11,"n_rows":87,"n_cols":10,"rows_kept":87,"cut":false,"hidden":false,"merged":[[2,3,2,4],[2,6,2,7],[0,1,0,8]]}
[{"$f":"'RAZRADA UKUPNO'!A1","v":"VINDIJA"},{"$f":"'RAZRADA UKUPNO'!B1:I1","v":"Dnevna prodaja od 08.08. i kumulativ dnevnog plana i prodaje za 01.- 08.08.2013"}]
[]
[null,null,null,{"$f":"'RAZRADA UKUPNO'!D3:E3","v":"Izvještaj za "},null,null,{"$f":"'RAZRADA UKUPNO'!G3:H3","v":"Kolovoz/Avgust"}]
[null,null,null,{"$f":"'RAZRADA UKUPNO'!D4","v":6},{"$f":"'RAZRADA UKUPNO'!E4","v":"dana +"},null,{"$f":"'RAZRADA UKUPNO'!G4","v":22},{"$f":"'RAZRADA UKUPNO'!H4","v":"dana +"}]
["KC LAJKOVAC",null,null,{"$f":"'RAZRADA UKUPNO'!D5","v":1},{"$f":"'RAZRADA UKUPNO'!E5","v":"subota"},null,{"$f":"'RAZRADA UKUPNO'!G5","v":5},{"$f":"'RAZRADA UKUPNO'!H5","v":"subota"}]
[]
["KUPAC","GRUPA PROIZVODA","1:Dnevna prodaja","2:Dnevni plan","IND. prodaja / plan","Razlika 1-2","3: Kum. prodaje 2013","4: Kum. plana 2013","IND. kum. prod 2013 / kum. plana 2013","Razlika 3-4"]
[{"$f":"'PRORAČUN 2'!C87","v":0},"1. Sveži proizvodi",{"$f":"'PRORAČUN 2'!E87","v":5830.4840000000004},{"$f":"'PRORAČUN 2'!F87","v":6911.7990898498801},{"$f":"IFERROR(C8/D8,0)","v":0.84355519079861374},{"$f":"IFERROR(C8-D8,0)","v":-1081.3150898498798},{"$f":"'KUMULATIV 2'!E87","v":2022.1940000000004},{"$f":"'KUMULATIV 2'!F87","v":2970.3480897778995},{"$f":"IFERROR(G8/H8,0)","v":0.68079361033783925},{"$f":"IFERROR(G8-H8,0)","v":-948.15408977789912}]
[null,"2. Smrznuti proizvodi",{"$f":"'PRORAČUN 2'!E88","v":455.90500000000003},{"$f":"'PRORAČUN 2'!F88","v":302.08209987747875},{"$f":"IFERROR(C9/D9,0)","v":1.5092089209685386},{"$f":"IFERROR(C9-D9,0)","v":153.82290012252128},{"$f":"'KUMULATIV 2'!E88","v":11.108000000000001},{"$f":"'KUMULATIV 2'!F88","v":35.866076641100406},{"$f":"IFERROR(G9/H9,0)","v":0.30970769708529783},{"$f":"IFERROR(G9-H9,0)","v":-24.758076641100406}]
[null,"3. Prerađevine",{"$f":"'PRORAČUN 2'!E89","v":964.58100000000002},{"$f":"'PRORAČUN 2'!F89","v":970.3079089942795},0.99409784364200904,-5.7269089942794835,{"$f":"'KUMULATIV 2'!E89","v":389.99900000000002},{"$f":"'KUMULATIV 2'!F89","v":345.14260997702445},1.1299647992635902,44.856390022975575]
[null,"Grand Total",{"$f":"'PRORAČUN 2'!E90","v":7250.9700000000012},{"$f":"'PRORAČUN 2'!F90","v":8184.1890987216393},0.88597293055369331,-933.21909872163815,{"$f":"'KUMULATIV 2'!E90","v":2423.3010000000004},{"$f":"'KUMULATIV 2'!F90","v":3351.3567763960236},0.72308057950367366,-928.05577639602325]
[{"$f":"'PRORAČUN 2'!C91","v":0},{"$f":"$B$8","v":"1. Sveži proizvodi"},{"$f":"'PRORAČUN 2'!E91","v":0},{"$f":"'PRORAČUN 2'!F91","v":0},0,0,{"$f":"'KUMULATIV 2'!E91","v":2605.3720000000003},{"$f":"'KUMULATIV 2'!F91","v":3215.660539290297},0.81021363050187234,-610.28853929029674]
[null,{"$f":"$B$9","v":"2. Smrznuti proizvodi"},{"$f":"'PRORAČUN 2'!E92","v":0},{"$f":"'PRORAČUN 2'!F92","v":0},0,0,{"$f":"'KUMULATIV 2'!E92","v":0},{"$f":"'KUMULATIV 2'!F92","v":0},0,0]
[null,{"$f":"$B$10","v":"3. Prerađevine"},{"$f":"'PRORAČUN 2'!E93","v":0},{"$f":"'PRORAČUN 2'!F93","v":0},0,0,{"$f":"'KUMULATIV 2'!E93","v":238.65300000000002},{"$f":"'KUMULATIV 2'!F93","v":10.358879822768845},23.038494903226901,228.29412017723118]
[null,{"$f":"$B$11","v":"Grand Total"},{"$f":"'PRORAČUN 2'!E94","v":0},{"$f":"'PRORAČUN 2'!F94","v":0},0,0,{"$f":"'KUMULATIV 2'!E94","v":2844.0249999999996},{"$f":"'KUMULATIV 2'!F94","v":3226.0194191130663},0.88158954752414698,-381.99441911306667]
[{"$f":"'PRORAČUN 2'!C95","v":0},{"$f":"$B$8","v":"1. Sveži proizvodi"},{"$f":"'PRORAČUN 2'!E95","v":0},{"$f":"'PRORAČUN 2'!F95","v":0},0,0,{"$f":"'KUMULATIV 2'!E95","v":652.57400000000007},{"$f":"'KUMULATIV 2'!F95","v":1257.3830045251975},0.51899381306368109,-604.80900452519745]
[null,{"$f":"$B$9","v":"2. Smrznuti proizvodi"},{"$f":"'PRORAČUN 2'!E96","v":0},{"$f":"'PRORAČUN 2'!F96","v":0},0,0,{"$f":"'KUMULATIV 2'!E96","v":0},{"$f":"'KUMULATIV 2'!F96","v":0},0,0]
[null,{"$f":"$B$10","v":"3. Prerađevine"},{"$f":"'PRORAČUN 2'!E97","v":0},{"$f":"'PRORAČUN 2'!F97","v":0},0,0,{"$f":"'KUMULATIV 2'!E97","v":717.71100000000001},{"$f":"'KUMULATIV 2'!F97","v":1189.3982214525672},0.60342363647011898,-471.6872214525672]
[null,{"$f":"$B$11","v":"Grand Total"},{"$f":"'PRORAČUN 2'!E98","v":0},{"$f":"'PRORAČUN 2'!F98","v":0},0,0,{"$f":"'KUMULATIV 2'!E98","v":1370.2849999999999},{"$f":"'KUMULATIV 2'!F98","v":2446.7812259777647},0.56003576676636324,-1076.4962259777649]
[{"$f":"'PRORAČUN 2'!C99","v":0},{"$f":"$B$8","v":"1. Sveži proizvodi"},{"$f":"'PRORAČUN 2'!E99","v":0},{"$f":"'PRORAČUN 2'!F99","v":0},0,0,{"$f":"'KUMULATIV 2'!E99","v":1041.5740000000001},{"$f":"'KUMULATIV 2'!F99","v":1582.6231168722084},0.65813142048531303,-541.04911687220829]
[null,{"$f":"$B$9","v":"2. Smrznuti proizvodi"},{"$f":"'PRORAČUN 2'!E100","v":0},{"$f":"'PRORAČUN 2'!F100","v":0},0,0,{"$f":"'KUMULATIV 2'!E100","v":91.923999999999992},{"$f":"'KUMULATIV 2'!F100","v":376.56163768368356},0.24411408598455611,-284.63763768368358]
[null,{"$f":"$B$10","v":"3. Prerađevine"},{"$f":"'PRORAČUN 2'!E101","v":0},{"$f":"'PRORAČUN 2'!F101","v":0},0,0,{"$f":"'KUMULATIV 2'!E101","v":390.85},{"$f":"'KUMULATIV 2'!F101","v":322.94262184316216},1.2102769147326029,67.907378156837865]
[null,{"$f":"$B$11","v":"Grand Total"},{"$f":"'PRORAČUN 2'!E102","v":0},{"$f":"'PRORAČUN 2'!F102","v":0},0,0,{"$f":"'KUMULATIV 2'!E102","v":1524.348},{"$f":"'KUMULATIV 2'!F102","v":2282.1273763990534},0.66795044648439117,-757.77937639905349]
[{"$f":"'PRORAČUN 2'!C103","v":0},{"$f":"$B$8","v":"1. Sveži proizvodi"},{"$f":"'PRORAČUN 2'!E103","v":0},{"$f":"'PRORAČUN 2'!F103","v":0},0,0,{"$f":"'KUMULATIV 2'!E103","v":787.49300000000005},{"$f":"'KUMULATIV 2'!F103","v":1436.6341513867922},0.54815138512461781,-649.1411513867921]
[null,{"$f":"$B$9","v":"2. Smrznuti proizvodi"},{"$f":"'PRORAČUN 2'!E104","v":0},{"$f":"'PRORAČUN 2'!F104","v":0},0,0,{"$f":"'KUMULATIV 2'!E104","v":0},{"$f":"'KUMULATIV 2'!F104","v":27.54480665294356},0,-27.54480665294356]
[null,{"$f":"$B$10","v":"3. Prerađevine"},{"$f":"'PRORAČUN 2'!E105","v":0},{"$f":"'PRORAČUN 2'!F105","v":0},0,0,{"$f":"'KUMULATIV 2'!E105","v":147.31200000000001},{"$f":"'KUMULATIV 2'!F105","v":84.260218886804182},1.7482983304126005,63.05178111319583]
[null,{"$f":"$B$11","v":"Grand Total"},{"$f":"'PRORAČUN 2'!E106","v":0},{"$f":"'PRORAČUN 2'!F106","v":0},0,0,{"$f":"'KUMULATIV 2'!E106","v":934.80500000000006},{"$f":"'KUMULATIV 2'!F106","v":1548.4391769265399},0.60370792339126444,-613.63417692653979]
[{"$f":"'PRORAČUN 2'!C107","v":0},{"$f":"$B$8","v":"1. Sveži proizvodi"},{"$f":"'PRORAČUN 2'!E107","v":0},{"$f":"'PRORAČUN 2'!F107","v":0},0,0,{"$f":"'KUMULATIV 2'!E107","v":414.00899999999996},{"$f":"'KUMULATIV 2'!F107","v":788.20098673353482},0.52525815999766434,-374.19198673353486]
[null,{"$f":"$B$9","v":"2. Smrznuti proizvodi"},{"$f":"'PRORAČUN 2'!E108","v":0},{"$f":"'PRORAČUN 2'!F108","v":0},0,0,{"$f":"'KUMULATIV 2'!E108","v":108.146},{"$f":"'KUMULATIV 2'!F108","v":304.8233054205358},0.35478258412952129,-196.67730542053579]
[null,{"$f":"$B$10","v":"3. Prerađevine"},{"$f":"'PRORAČUN 2'!E109","v":0},{"$f":"'PRORAČUN 2'!F109","v":0},0,0,{"$f":"'KUMULATIV 2'!E109","v":349.31999999999994},{"$f":"'KUMULATIV 2'!F109","v":361.02331794953034},0.96758293060957778,-11.703317949530401]
[null,{"$f":"$B$11","v":"Grand Total"},{"$f":"'PRORAČUN 2'!E110","v":0},{"$f":"'PRORAČUN 2'!F110","v":0},0,0,{"$f":"'KUMULATIV 2'!E110","v":871.47499999999991},{"$f":"'KUMULATIV 2'!F110","v":1454.0476101036013},0.5993441988724888,-582.57261010360139]
[{"$f":"'PRORAČUN 2'!C111","v":0},{"$f":"$B$8","v":"1. Sveži proizvodi"},{"$f":"'PRORAČUN 2'!E111","v":0},{"$f":"'PRORAČUN 2'!F111","v":0},0,0,{"$f":"'KUMULATIV 2'!E111","v":0},{"$f":"'KUMULATIV 2'!F111","v":957.11833316561513},0,-957.11833316561513]
[null,{"$f":"$B$9","v":"2. Smrznuti proizvodi"},{"$f":"'PRORAČUN 2'!E112","v":0},{"$f":"'PRORAČUN 2'!F112","v":0},0,0,{"$f":"'KUMULATIV 2'!E112","v":0},{"$f":"'KUMULATIV 2'!F112","v":104.81259992464507},0,-104.81259992464507]
[null,{"$f":"$B$10","v":"3. Prerađevine"},{"$f":"'PRORAČUN 2'!E113","v":0},{"$f":"'PRORAČUN 2'!F113","v":0},0,0,{"$f":"'KUMULATIV 2'!E113","v":0},{"$f":"'KUMULATIV 2'!F113","v":273.86552046809044},0,-273.86552046809044]
[null,{"$f":"$B$11","v":"Grand Total"},{"$f":"'PRORAČUN 2'!E114","v":0},{"$f":"'PRORAČUN 2'!F114","v":0},0,0,{"$f":"'KUMULATIV 2'!E114","v":0},{"$f":"'KUMULATIV 2'!F114","v":1335.7964535583508},0,-1335.7964535583508]
[{"$f":"'PRORAČUN 2'!C115","v":0},{"$f":"$B$8","v":"1. Sveži proizvodi"},{"$f":"'PRORAČUN 2'!E115","v":0},{"$f":"'PRORAČUN 2'!F115","v":0},0,0,{"$f":"'KUMULATIV 2'!E115","v":73.782000000000011},{"$f":"'KUMULATIV 2'!F115","v":802.73613073748311},9.1913142033628936E-2,-728.95413073748307]
[null,{"$f":"$B$9","v":"2. Smrznuti proizvodi"},{"$f":"'PRORAČUN 2'!E116","v":0},{"$f":"'PRORAČUN 2'!F116","v":0},0,0,{"$f":"'KUMULATIV 2'!E116","v":0},{"$f":"'KUMULATIV 2'!F116","v":3.3784487000925063},0,-3.3784487000925063]
[null,{"$f":"$B$10","v":"3. Prerađevine"},{"$f":"'PRORAČUN 2'!E117","v":0},{"$f":"'PRORAČUN 2'!F117","v":0},0,0,{"$f":"'KUMULATIV 2'!E117","v":35.4},{"$f":"'KUMULATIV 2'!F117","v":47.812591097758869},0.74039074618692458,-12.41259109775887]
[null,{"$f":"$B$11","v":"Grand Total"},{"$f":"'PRORAČUN 2'!E118","v":0},{"$f":"'PRORAČUN 2'!F118","v":0},0,0,{"$f":"'KUMULATIV 2'!E118","v":109.18200000000002},{"$f":"'KUMULATIV 2'!F118","v":853.9271705353342},0.12785867901539297,-744.74517053533418]
[{"$f":"'PRORAČUN 2'!C119","v":0},{"$f":"$B$8","v":"1. Sveži proizvodi"},{"$f":"'PRORAČUN 2'!E119","v":0},{"$f":"'PRORAČUN 2'!F119","v":0},0,0,{"$f":"'KUMULATIV 2'!E119","v":283.63599999999997},{"$f":"'KUMULATIV 2'!F119","v":644.68179627954578},0.43996278728026972,-361.04579627954581]
[null,{"$f":"$B$9","v":"2. Smrznuti proizvodi"},{"$f":"'PRORAČUN 2'!E120","v":0},{"$f":"'PRORAČUN 2'!F120","v":0},0,0,{"$f":"'KUMULATIV 2'!E120","v":0},{"$f":"'KUMULATIV 2'!F120","v":0},0,0]
[null,{"$f":"$B$10","v":"3. Prerađevine"},{"$f":"'PRORAČUN 2'!E121","v":0},{"$f":"'PRORAČUN 2'!F121","v":0},0,0,{"$f":"'KUMULATIV 2'!E121","v":0},{"$f":"'KUMULATIV 2'!F121","v":2.1808168047934413},0,-2.1808168047934413]
[null,{"$f":"$B$11","v":"Grand Total"},{"$f":"'PRORAČUN 2'!E122","v":0},{"$f":"'PRORAČUN 2'!F122","v":0},0,0,{"$f":"'KUMULATIV 2'!E122","v":283.63599999999997},{"$f":"'KUMULATIV 2'!F122","v":646.86261308433927},0.43847950749167647,-363.22661308433931]
[{"$f":"'PRORAČUN 2'!C123","v":0},{"$f":"$B$8","v":"1. Sveži proizvodi"},{"$f":"'PRORAČUN 2'!E123","v":0},{"$f":"'PRORAČUN 2'!F123","v":0},0,0,{"$f":"'KUMULATIV 2'!E123","v":97.596999999999994},{"$f":"'KUMULATIV 2'!F123","v":502.21339605599962},0.19433372499907864,-404.61639605599964]
[null,{"$f":"$B$9","v":"2. Smrznuti proizvodi"},{"$f":"'PRORAČUN 2'!E124","v":0},{"$f":"'PRORAČUN 2'!F124","v":0},0,0,{"$f":"'KUMULATIV 2'!E124","v":0},{"$f":"'KUMULATIV 2'!F124","v":0},0,0]
[null,{"$f":"$B$10","v":"3. Prerađevine"},{"$f":"'PRORAČUN 2'!E125","v":0},{"$f":"'PRORAČUN 2'!F125","v":0},0,0,{"$f":"'KUMULATIV 2'!E125","v":70.704999999999998},{"$f":"'KUMULATIV 2'!F125","v":117.06551914237701},0.60397801605447465,-46.360519142377015]
[null,{"$f":"$B$11","v":"Grand Total"},{"$f":"'PRORAČUN 2'!E126","v":0},{"$f":"'PRORAČUN 2'!F126","v":0},0,0,{"$f":"'KUMULATIV 2'!E126","v":168.30199999999999},{"$f":"'KUMULATIV 2'!F126","v":619.27891519837669},0.27177091916020907,-450.97691519837667]
[{"$f":"'PRORAČUN 2'!C127","v":0},{"$f":"$B$8","v":"1. Sveži proizvodi"},{"$f":"'PRORAČUN 2'!E127","v":0},{"$f":"'PRORAČUN 2'!F127","v":0},0,0,{"$f":"'KUMULATIV 2'!E127","v":374.72899999999998},{"$f":"'KUMULATIV 2'!F127","v":440.95788670402663},0.84980677588270503,-66.22888670402665]
[null,{"$f":"$B$9","v":"2. Smrznuti proizvodi"},{"$f":"'PRORAČUN 2'!E128","v":0},{"$f":"'PRORAČUN 2'!F128","v":0},0,0,{"$f":"'KUMULATIV 2'!E128","v":0},{"$f":"'KUMULATIV 2'!F128","v":0},0,0]
[null,{"$f":"$B$10","v":"3. Prerađevine"},{"$f":"'PRORAČUN 2'!E129","v":0},{"$f":"'PRORAČUN 2'!F129","v":0},0,0,{"$f":"'KUMULATIV 2'!E129","v":60.5},{"$f":"'KUMULATIV 2'!F129","v":174.6972379037183},0.34631343188919589,-114.1972379037183]
[null,{"$f":"$B$11","v":"Grand Total"},{"$f":"'PRORAČUN 2'!E130","v":0},{"$f":"'PRORAČUN 2'!F130","v":0},0,0,{"$f":"'KUMULATIV 2'!E130","v":435.22899999999998},{"$f":"'KUMULATIV 2'!F130","v":615.65512460774494},0.70693637168585144,-180.42612460774495]
[{"$f":"'PRORAČUN 2'!C131","v":0},{"$f":"$B$8","v":"1. Sveži proizvodi"},{"$f":"'PRORAČUN 2'!E131","v":0},{"$f":"'PRORAČUN 2'!F131","v":0},0,0,{"$f":"'KUMULATIV 2'!E131","v":266.35400000000004},{"$f":"'KUMULATIV 2'!F131","v":407.6419118466647},0.65340190068628079,-141.28791184666466]
[null,{"$f":"$B$9","v":"2. Smrznuti proizvodi"},{"$f":"'PRORAČUN 2'!E132","v":0},{"$f":"'PRORAČUN 2'!F132","v":0},0,0,{"$f":"'KUMULATIV 2'!E132","v":0},{"$f":"'KUMULATIV 2'!F132","v":64.009880976427226},0,-64.009880976427226]
[null,{"$f":"$B$10","v":"3. Prerađevine"},{"$f":"'PRORAČUN 2'!E133","v":0},{"$f":"'PRORAČUN 2'!F133","v":0},0,0,{"$f":"'KUMULATIV 2'!E133","v":17.25},{"$f":"'KUMULATIV 2'!F133","v":25.533730089456544},0.67557696974023063,-8.2837300894565438]
[null,{"$f":"$B$11","v":"Grand Total"},{"$f":"'PRORAČUN 2'!E134","v":0},{"$f":"'PRORAČUN 2'!F134","v":0},0,0,{"$f":"'KUMULATIV 2'!E134","v":283.60400000000004},{"$f":"'KUMULATIV 2'!F134","v":497.18552291254855},0.57041886163263045,-213.58152291254851]
[{"$f":"'PRORAČUN 2'!C135","v":0},{"$f":"$B$8","v":"1. Sveži proizvodi"},{"$f":"'PRORAČUN 2'!E135","v":0},{"$f":"'PRORAČUN 2'!F135","v":0},0,0,{"$f":"'KUMULATIV 2'!E135","v":24.036999999999999},{"$f":"'KUMULATIV 2'!F135","v":419.16898253786792},5.7344414785816089E-2,-395.13198253786794]
[null,{"$f":"$B$9","v":"2. Smrznuti proizvodi"},{"$f":"'PRORAČUN 2'!E136","v":0},{"$f":"'PRORAČUN 2'!F136","v":0},0,0,{"$f":"'KUMULATIV 2'!E136","v":0},{"$f":"'KUMULATIV 2'!F136","v":0},0,0]
[null,{"$f":"$B$10","v":"3. Prerađevine"},{"$f":"'PRORAČUN 2'!E137","v":0},{"$f":"'PRORAČUN 2'!F137","v":0},0,0,{"$f":"'KUMULATIV 2'!E137","v":0},{"$f":"'KUMULATIV 2'!F137","v":25.247679618561133},0,-25.247679618561133]
[null,{"$f":"$B$11","v":"Grand Total"},{"$f":"'PRORAČUN 2'!E138","v":0},{"$f":"'PRORAČUN 2'!F138","v":0},0,0,{"$f":"'KUMULATIV 2'!E138","v":24.036999999999999},{"$f":"'KUMULATIV 2'!F138","v":444.41666215642908},5.4086630963308208E-2,-420.37966215642911]
[{"$f":"'PRORAČUN 2'!C139","v":0},{"$f":"$B$8","v":"1. Sveži proizvodi"},{"$f":"'PRORAČUN 2'!E139","v":0},{"$f":"'PRORAČUN 2'!F139","v":0},0,0,{"$f":"'KUMULATIV 2'!E139","v":99.88},{"$f":"'KUMULATIV 2'!F139","v":262.34971733037872},0.38071319846028445,-162.46971733037873]
[null,{"$f":"$B$9","v":"2. Smrznuti proizvodi"},{"$f":"'PRORAČUN 2'!E140","v":0},{"$f":"'PRORAČUN 2'!F140","v":0},0,0,{"$f":"'KUMULATIV 2'!E140","v":24.317999999999998},{"$f":"'KUMULATIV 2'!F140","v":73.903156411372677},0.3290522513630797,-49.585156411372679]
[null,{"$f":"$B$10","v":"3. Prerađevine"},{"$f":"'PRORAČUN 2'!E141","v":0},{"$f":"'PRORAČUN 2'!F141","v":0},0,0,{"$f":"'KUMULATIV 2'!E141","v":140.14699999999999},{"$f":"'KUMULATIV 2'!F141","v":95.113780654793672},1.4734668208453416,45.033219345206319]
[null,{"$f":"$B$11","v":"Grand Total"},{"$f":"'PRORAČUN 2'!E142","v":0},{"$f":"'PRORAČUN 2'!F142","v":0},0,0,{"$f":"'KUMULATIV 2'!E142","v":264.34500000000003},{"$f":"'KUMULATIV 2'!F142","v":431.36665439654507},0.61280814663294292,-167.02165439654505]
[{"$f":"'PRORAČUN 2'!C143","v":0},{"$f":"$B$8","v":"1. Sveži proizvodi"},{"$f":"'PRORAČUN 2'!E143","v":0},{"$f":"'PRORAČUN 2'!F143","v":0},0,0,{"$f":"'KUMULATIV 2'!E143","v":0},{"$f":"'KUMULATIV 2'!F143","v":137.8232604293359},0,-137.8232604293359]
[null,{"$f":"$B$9","v":"2. Smrznuti proizvodi"},{"$f":"'PRORAČUN 2'!E144","v":0},{"$f":"'PRORAČUN 2'!F144","v":0},0,0,{"$f":"'KUMULATIV 2'!E144","v":0},{"$f":"'KUMULATIV 2'!F144","v":67.734716079014404},0,-67.734716079014404]
[null,{"$f":"$B$10","v":"3. Prerađevine"},{"$f":"'PRORAČUN 2'!E145","v":0},{"$f":"'PRORAČUN 2'!F145","v":0},0,0,{"$f":"'KUMULATIV 2'!E145","v":0},{"$f":"'KUMULATIV 2'!F145","v":223.85175827536008},0,-223.85175827536008]
[null,{"$f":"$B$11","v":"Grand Total"},{"$f":"'PRORAČUN 2'!E146","v":0},{"$f":"'PRORAČUN 2'!F146","v":0},0,0,{"$f":"'KUMULATIV 2'!E146","v":0},{"$f":"'KUMULATIV 2'!F146","v":429.40973478371041},0,-429.40973478371041]
[{"$f":"'PRORAČUN 2'!C147","v":0},{"$f":"$B$8","v":"1. Sveži proizvodi"},{"$f":"'PRORAČUN 2'!E147","v":0},{"$f":"'PRORAČUN 2'!F147","v":0},0,0,{"$f":"'KUMULATIV 2'!E147","v":0},{"$f":"'KUMULATIV 2'!F147","v":412.38991350016755},0,-412.38991350016755]
[null,{"$f":"$B$9","v":"2. Smrznuti proizvodi"},{"$f":"'PRORAČUN 2'!E148","v":0},{"$f":"'PRORAČUN 2'!F148","v":0},0,0,{"$f":"'KUMULATIV 2'!E148","v":0},{"$f":"'KUMULATIV 2'!F148","v":8.9504356363397477},0,-8.9504356363397477]
[null,{"$f":"$B$10","v":"3. Prerađevine"},{"$f":"'PRORAČUN 2'!E149","v":0},{"$f":"'PRORAČUN 2'!F149","v":0},0,0,{"$f":"'KUMULATIV 2'!E149","v":0},{"$f":"'KUMULATIV 2'!F149","v":4.1980723492273739},0,-4.1980723492273739]
[null,{"$f":"$B$11","v":"Grand Total"},{"$f":"'PRORAČUN 2'!E150","v":0},{"$f":"'PRORAČUN 2'!F150","v":0},0,0,{"$f":"'KUMULATIV 2'!E150","v":0},{"$f":"'KUMULATIV 2'!F150","v":425.53842148573472},0,-425.53842148573472]
[{"$f":"'PRORAČUN 2'!C151","v":0},{"$f":"$B$8","v":"1. Sveži proizvodi"},{"$f":"'PRORAČUN 2'!E151","v":0},{"$f":"'PRORAČUN 2'!F151","v":0},0,0,{"$f":"'KUMULATIV 2'!E151","v":217.595},{"$f":"'KUMULATIV 2'!F151","v":239.33083248631647},0.90918080942387902,-21.735832486316468]
[null,{"$f":"$B$9","v":"2. Smrznuti proizvodi"},{"$f":"'PRORAČUN 2'!E152","v":0},{"$f":"'PRORAČUN 2'!F152","v":0},{"$f":"IFERROR(C73/D73,0)","v":0},{"$f":"IFERROR(C73-D73,0)","v":0},{"$f":"'KUMULATIV 2'!E152","v":123.068},{"$f":"'KUMULATIV 2'!F152","v":146.95797508568069},{"$f":"IFERROR(G73/H73,0)","v":0.83743668846993735},{"$f":"IFERROR(G73-H73,0)","v":-23.889975085680689}]
[null,{"$f":"$B$10","v":"3. Prerađevine"},{"$f":"'PRORAČUN 2'!E153","v":0},{"$f":"'PRORAČUN 2'!F153","v":0},0,0,{"$f":"'KUMULATIV 2'!E153","v":0},{"$f":"'KUMULATIV 2'!F153","v":0},0,0]
[null,{"$f":"$B$11","v":"Grand Total"},{"$f":"'PRORAČUN 2'!E154","v":0},{"$f":"'PRORAČUN 2'!F154","v":0},0,0,{"$f":"'KUMULATIV 2'!E154","v":340.66300000000001},{"$f":"'KUMULATIV 2'!F154","v":386.28880757199715},0.88188679900208256,-45.625807571997143]
[{"$f":"'PRORAČUN 2'!C155","v":0},{"$f":"$B$8","v":"1. Sveži proizvodi"},{"$f":"'PRORAČUN 2'!E155","v":0},{"$f":"'PRORAČUN 2'!F155","v":0},0,0,{"$f":"'KUMULATIV 2'!E155","v":0},{"$f":"'KUMULATIV 2'!F155","v":276.40144694259772},0,-276.40144694259772]
[null,{"$f":"$B$9","v":"2. Smrznuti proizvodi"},{"$f":"'PRORAČUN 2'!E156","v":0},{"$f":"'PRORAČUN 2'!F156","v":0},0,0,{"$f":"'KUMULATIV 2'!E156","v":0},{"$f":"'KUMULATIV 2'!F156","v":0},0,0]
[null,{"$f":"$B$10","v":"3. Prerađevine"},{"$f":"'PRORAČUN 2'!E157","v":0},{"$f":"'PRORAČUN 2'!F157","v":0},0,0,{"$f":"'KUMULATIV 2'!E157","v":0},{"$f":"'KUMULATIV 2'!F157","v":85.670480420570627},0,-85.670480420570627]
[null,{"$f":"$B$11","v":"Grand Total"},{"$f":"'PRORAČUN 2'!E158","v":0},{"$f":"'PRORAČUN 2'!F158","v":0},0,0,{"$f":"'KUMULATIV 2'!E158","v":0},{"$f":"'KUMULATIV 2'!F158","v":362.07192736316836},0,-362.07192736316836]
[{"$f":"'PRORAČUN 2'!C159","v":0},{"$f":"$B$8","v":"1. Sveži proizvodi"},{"$f":"'PRORAČUN 2'!E159","v":0},{"$f":"'PRORAČUN 2'!F159","v":0},0,0,{"$f":"'KUMULATIV 2'!E159","v":18.712},{"$f":"'KUMULATIV 2'!F159","v":200.23496615731699},9.3450211814147852E-2,-181.522966157317]
[null,{"$f":"$B$9","v":"2. Smrznuti proizvodi"},{"$f":"'PRORAČUN 2'!E160","v":0},{"$f":"'PRORAČUN 2'!F160","v":0},0,0,{"$f":"'KUMULATIV 2'!E160","v":13.376000000000001},{"$f":"'KUMULATIV 2'!F160","v":42.019978194760029},0.31832477251661245,-28.643978194760027]
[null,{"$f":"$B$10","v":"3. Prerađevine"},{"$f":"'PRORAČUN 2'!E161","v":0},{"$f":"'PRORAČUN 2'!F161","v":0},0,0,{"$f":"'KUMULATIV 2'!E161","v":65.194000000000003},{"$f":"'KUMULATIV 2'!F161","v":95.563028916581175},0.68220943537598744,-30.369028916581172]
[null,{"$f":"$B$11","v":"Grand Total"},{"$f":"'PRORAČUN 2'!E162","v":0},{"$f":"'PRORAČUN 2'!F162","v":0},0,0,{"$f":"'KUMULATIV 2'!E162","v":97.282000000000011},{"$f":"'KUMULATIV 2'!F162","v":337.81797326865819},0.287971652481125,-240.53597326865818]
[{"$f":"'PRORAČUN 2'!C163","v":0},{"$f":"$B$8","v":"1. Sveži proizvodi"},{"$f":"'PRORAČUN 2'!E163","v":0},{"$f":"'PRORAČUN 2'!F163","v":0},0,0,{"$f":"'KUMULATIV 2'!E163","v":6.1520000000000001},{"$f":"'KUMULATIV 2'!F163","v":3.8044349159621582},1.6170601248001986,2.3475650840378419]
[null,{"$f":"$B$9","v":"2. Smrznuti proizvodi"},{"$f":"'PRORAČUN 2'!E164","v":0},{"$f":"'PRORAČUN 2'!F164","v":0},0,0,{"$f":"'KUMULATIV 2'!E164","v":149.04000000000002},{"$f":"'KUMULATIV 2'!F164","v":276.56936983656692},0.53888830888276673,-127.5293698365669]
[null,{"$f":"$B$10","v":"3. Prerađevine"},{"$f":"'PRORAČUN 2'!E165","v":0},{"$f":"'PRORAČUN 2'!F165","v":0},0,0,{"$f":"'KUMULATIV 2'!E165","v":42},{"$f":"'KUMULATIV 2'!F165","v":43.779897356228332},0.95934441458951669,-1.7798973562283322]
[null,{"$f":"$B$11","v":"Grand Total"},{"$f":"'PRORAČUN 2'!E166","v":0},{"$f":"'PRORAČUN 2'!F166","v":0},0,0,{"$f":"'KUMULATIV 2'!E166","v":197.19200000000001},{"$f":"'KUMULATIV 2'!F166","v":324.15370210875744},0.60832869937064526,-126.96170210875744]

{"sheet":"RAZRADA KUPCI NI","index":12,"n_rows":87,"n_cols":10,"rows_kept":87,"cut":false,"hidden":false,"merged":[[2,3,2,4],[2,6,2,7],[0,1,0,8]]}
[{"$f":"'RAZRADA UKUPNO'!A1","v":"VINDIJA"},{"$f":"'RAZRADA UKUPNO'!B1:I1","v":"Dnevna prodaja od 08.08. i kumulativ dnevnog plana i prodaje za 01.- 08.08.2013"}]
[]
[null,null,null,{"$f":"'RAZRADA UKUPNO'!D3:E3","v":"Izvještaj za "},null,null,{"$f":"'RAZRADA UKUPNO'!G3:H3","v":"Kolovoz/Avgust"}]
[null,null,null,{"$f":"'RAZRADA UKUPNO'!D4","v":6},{"$f":"'RAZRADA UKUPNO'!E4","v":"dana +"},null,{"$f":"'RAZRADA UKUPNO'!G4","v":22},{"$f":"'RAZRADA UKUPNO'!H4","v":"dana +"}]
["KC NIŠ",null,null,{"$f":"'RAZRADA UKUPNO'!D5","v":1},{"$f":"'RAZRADA UKUPNO'!E5","v":"subota"},null,{"$f":"'RAZRADA UKUPNO'!G5","v":5},{"$f":"'RAZRADA UKUPNO'!H5","v":"subota"}]
[]
["KUPAC","GRUPA PROIZVODA","1:Dnevna prodaja","2:Dnevni plan","IND. prodaja / plan","Razlika 1-2","3: Kum. prodaje 2013","4: Kum. plana 2013","IND. kum. prod 2013 / kum. plana 2013","Razlika 3-4"]
[{"$f":"'PRORAČUN 2'!C171","v":0},"1. Sveži proizvodi",{"$f":"'PRORAČUN 2'!E171","v":0},{"$f":"'PRORAČUN 2'!F171","v":0},{"$f":"IFERROR(C8/D8,0)","v":0},{"$f":"IFERROR(C8-D8,0)","v":0},{"$f":"'KUMULATIV 2'!E171","v":183.41000000000003},{"$f":"'KUMULATIV 2'!F171","v":5312.8679379772329},{"$f":"IFERROR(G8/H8,0)","v":3.4521844348690829E-2},{"$f":"IFERROR(G8-H8,0)","v":-5129.4579379772331}]
[null,"2. Smrznuti proizvodi",{"$f":"'PRORAČUN 2'!E172","v":0},{"$f":"'PRORAČUN 2'!F172","v":0},{"$f":"IFERROR(C9/D9,0)","v":0},{"$f":"IFERROR(C9-D9,0)","v":0},{"$f":"'KUMULATIV 2'!E172","v":60},{"$f":"'KUMULATIV 2'!F172","v":150.37390202124709},{"$f":"IFERROR(G9/H9,0)","v":0.39900540714519928},{"$f":"IFERROR(G9-H9,0)","v":-90.37390202124709}]
[null,"3. Prerađevine",{"$f":"'PRORAČUN 2'!E173","v":0},{"$f":"'PRORAČUN 2'!F173","v":0},0,0,{"$f":"'KUMULATIV 2'!E173","v":474.298},{"$f":"'KUMULATIV 2'!F173","v":2490.285165540703},0.19045931227599713,-2015.987165540703]
[null,"Grand Total",{"$f":"'PRORAČUN 2'!E174","v":0},{"$f":"'PRORAČUN 2'!F174","v":0},0,0,{"$f":"'KUMULATIV 2'!E174","v":717.70799999999986},{"$f":"'KUMULATIV 2'!F174","v":7953.5270055391848},9.0237702028314798E-2,-7235.8190055391851]
[{"$f":"'PRORAČUN 2'!C175","v":0},{"$f":"$B$8","v":"1. Sveži proizvodi"},{"$f":"'PRORAČUN 2'!E175","v":0},{"$f":"'PRORAČUN 2'!F175","v":0},0,0,{"$f":"'KUMULATIV 2'!E175","v":1409.7190000000001},{"$f":"'KUMULATIV 2'!F175","v":7205.9060621780154},0.1956338297829415,-5796.1870621780154]
[null,{"$f":"$B$9","v":"2. Smrznuti proizvodi"},{"$f":"'PRORAČUN 2'!E176","v":0},{"$f":"'PRORAČUN 2'!F176","v":0},0,0,{"$f":"'KUMULATIV 2'!E176","v":0},{"$f":"'KUMULATIV 2'!F176","v":0},0,0]
[null,{"$f":"$B$10","v":"3. Prerađevine"},{"$f":"'PRORAČUN 2'!E177","v":0},{"$f":"'PRORAČUN 2'!F177","v":0},0,0,{"$f":"'KUMULATIV 2'!E177","v":376.71000000000004},{"$f":"'KUMULATIV 2'!F177","v":194.3389467979911},1.9384174207323333,182.37105320200894]
[null,{"$f":"$B$11","v":"Grand Total"},{"$f":"'PRORAČUN 2'!E178","v":0},{"$f":"'PRORAČUN 2'!F178","v":0},0,0,{"$f":"'KUMULATIV 2'!E178","v":1786.4290000000001},{"$f":"'KUMULATIV 2'!F178","v":7400.2450089760041},0.24140133169012387,-5613.816008976004]
[{"$f":"'PRORAČUN 2'!C179","v":0},{"$f":"$B$8","v":"1. Sveži proizvodi"},{"$f":"'PRORAČUN 2'!E179","v":0},{"$f":"'PRORAČUN 2'!F179","v":0},0,0,{"$f":"'KUMULATIV 2'!E179","v":12889.468000000001},{"$f":"'KUMULATIV 2'!F179","v":6535.3971816206122},1.9722547294063222,6354.0708183793886]
[null,{"$f":"$B$9","v":"2. Smrznuti proizvodi"},{"$f":"'PRORAČUN 2'!E180","v":0},{"$f":"'PRORAČUN 2'!F180","v":0},0,0,{"$f":"'KUMULATIV 2'!E180","v":0},{"$f":"'KUMULATIV 2'!F180","v":0},0,0]
[null,{"$f":"$B$10","v":"3. Prerađevine"},{"$f":"'PRORAČUN 2'!E181","v":0},{"$f":"'PRORAČUN 2'!F181","v":0},0,0,{"$f":"'KUMULATIV 2'!E181","v":0},{"$f":"'KUMULATIV 2'!F181","v":0},0,0]
[null,{"$f":"$B$11","v":"Grand Total"},{"$f":"'PRORAČUN 2'!E182","v":0},{"$f":"'PRORAČUN 2'!F182","v":0},0,0,{"$f":"'KUMULATIV 2'!E182","v":12889.468000000001},{"$f":"'KUMULATIV 2'!F182","v":6535.3971816206122},1.9722547294063222,6354.0708183793886]
[{"$f":"'PRORAČUN 2'!C183","v":0},{"$f":"$B$8","v":"1. Sveži proizvodi"},{"$f":"'PRORAČUN 2'!E183","v":0},{"$f":"'PRORAČUN 2'!F183","v":0},0,0,{"$f":"'KUMULATIV 2'!E183","v":28.513000000000002},{"$f":"'KUMULATIV 2'!F183","v":151.58045911315358},0.18810472119440724,-123.06745911315357]
[null,{"$f":"$B$9","v":"2. Smrznuti proizvodi"},{"$f":"'PRORAČUN 2'!E184","v":0},{"$f":"'PRORAČUN 2'!F184","v":0},0,0,{"$f":"'KUMULATIV 2'!E184","v":231.72599999999997},{"$f":"'KUMULATIV 2'!F184","v":1121.2950049246717},0.2066592636034861,-889.56900492467173]
[null,{"$f":"$B$10","v":"3. Prerađevine"},{"$f":"'PRORAČUN 2'!E185","v":0},{"$f":"'PRORAČUN 2'!F185","v":0},0,0,{"$f":"'KUMULATIV 2'!E185","v":1844.9289999999994},{"$f":"'KUMULATIV 2'!F185","v":4459.9550352315891},0.41366538124844549,-2615.02603523159]
[null,{"$f":"$B$11","v":"Grand Total"},{"$f":"'PRORAČUN 2'!E186","v":0},{"$f":"'PRORAČUN 2'!F186","v":0},0,0,{"$f":"'KUMULATIV 2'!E186","v":2105.1679999999997},{"$f":"'KUMULATIV 2'!F186","v":5732.8304992694138},0.36721267099529287,-3627.6624992694142]
[{"$f":"'PRORAČUN 2'!C187","v":0},{"$f":"$B$8","v":"1. Sveži proizvodi"},{"$f":"'PRORAČUN 2'!E187","v":0},{"$f":"'PRORAČUN 2'!F187","v":0},0,0,{"$f":"'KUMULATIV 2'!E187","v":157.21},{"$f":"'KUMULATIV 2'!F187","v":2355.9833212575068},6.6727976629346056E-2,-2198.7733212575067]
[null,{"$f":"$B$9","v":"2. Smrznuti proizvodi"},{"$f":"'PRORAČUN 2'!E188","v":0},{"$f":"'PRORAČUN 2'!F188","v":0},0,0,{"$f":"'KUMULATIV 2'!E188","v":40.267000000000003},{"$f":"'KUMULATIV 2'!F188","v":969.15609688150676},4.1548518478673122E-2,-928.8890968815067]
[null,{"$f":"$B$10","v":"3. Prerađevine"},{"$f":"'PRORAČUN 2'!E189","v":0},{"$f":"'PRORAČUN 2'!F189","v":0},0,0,{"$f":"'KUMULATIV 2'!E189","v":104.4},{"$f":"'KUMULATIV 2'!F189","v":405.70802426900735},0.25732791503965152,-301.30802426900732]
[null,{"$f":"$B$11","v":"Grand Total"},{"$f":"'PRORAČUN 2'!E190","v":0},{"$f":"'PRORAČUN 2'!F190","v":0},0,0,{"$f":"'KUMULATIV 2'!E190","v":301.87700000000001},{"$f":"'KUMULATIV 2'!F190","v":3730.8474424080196},8.091378826392269E-2,-3428.9704424080196]
[{"$f":"'PRORAČUN 2'!C191","v":0},{"$f":"$B$8","v":"1. Sveži proizvodi"},{"$f":"'PRORAČUN 2'!E191","v":0},{"$f":"'PRORAČUN 2'!F191","v":0},0,0,{"$f":"'KUMULATIV 2'!E191","v":0},{"$f":"'KUMULATIV 2'!F191","v":2821.804017965324},0,-2821.804017965324]
[null,{"$f":"$B$9","v":"2. Smrznuti proizvodi"},{"$f":"'PRORAČUN 2'!E192","v":0},{"$f":"'PRORAČUN 2'!F192","v":0},0,0,{"$f":"'KUMULATIV 2'!E192","v":0},{"$f":"'KUMULATIV 2'!F192","v":0},0,0]
[null,{"$f":"$B$10","v":"3. Prerađevine"},{"$f":"'PRORAČUN 2'!E193","v":0},{"$f":"'PRORAČUN 2'!F193","v":0},0,0,{"$f":"'KUMULATIV 2'!E193","v":0},{"$f":"'KUMULATIV 2'!F193","v":473.22142587664575},0,-473.22142587664575]
[null,{"$f":"$B$11","v":"Grand Total"},{"$f":"'PRORAČUN 2'!E194","v":0},{"$f":"'PRORAČUN 2'!F194","v":0},0,0,{"$f":"'KUMULATIV 2'!E194","v":0},{"$f":"'KUMULATIV 2'!F194","v":3295.0254438419697},0,-3295.0254438419697]
[{"$f":"'PRORAČUN 2'!C195","v":0},{"$f":"$B$8","v":"1. Sveži proizvodi"},{"$f":"'PRORAČUN 2'!E195","v":0},{"$f":"'PRORAČUN 2'!F195","v":0},0,0,{"$f":"'KUMULATIV 2'!E195","v":331.54700000000003},{"$f":"'KUMULATIV 2'!F195","v":2744.5075133131159},0.12080382305084783,-2412.9605133131158]
[null,{"$f":"$B$9","v":"2. Smrznuti proizvodi"},{"$f":"'PRORAČUN 2'!E196","v":0},{"$f":"'PRORAČUN 2'!F196","v":0},0,0,{"$f":"'KUMULATIV 2'!E196","v":0},{"$f":"'KUMULATIV 2'!F196","v":0},0,0]
[null,{"$f":"$B$10","v":"3. Prerađevine"},{"$f":"'PRORAČUN 2'!E197","v":0},{"$f":"'PRORAČUN 2'!F197","v":0},0,0,{"$f":"'KUMULATIV 2'!E197","v":42.55},{"$f":"'KUMULATIV 2'!F197","v":402.21643761026291},0.10578881423346954,-359.6664376102629]
[null,{"$f":"$B$11","v":"Grand Total"},{"$f":"'PRORAČUN 2'!E198","v":0},{"$f":"'PRORAČUN 2'!F198","v":0},0,0,{"$f":"'KUMULATIV 2'!E198","v":374.09699999999998},{"$f":"'KUMULATIV 2'!F198","v":3146.7239509233791},0.11888459421113963,-2772.6269509233789]
[{"$f":"'PRORAČUN 2'!C199","v":0},{"$f":"$B$8","v":"1. Sveži proizvodi"},{"$f":"'PRORAČUN 2'!E199","v":0},{"$f":"'PRORAČUN 2'!F199","v":0},0,0,{"$f":"'KUMULATIV 2'!E199","v":0},{"$f":"'KUMULATIV 2'!F199","v":2012.4578168376274},0,-2012.4578168376274]
[null,{"$f":"$B$9","v":"2. Smrznuti proizvodi"},{"$f":"'PRORAČUN 2'!E200","v":0},{"$f":"'PRORAČUN 2'!F200","v":0},0,0,{"$f":"'KUMULATIV 2'!E200","v":0},{"$f":"'KUMULATIV 2'!F200","v":806.01728193250892},0,-806.01728193250892]
[null,{"$f":"$B$10","v":"3. Prerađevine"},{"$f":"'PRORAČUN 2'!E201","v":0},{"$f":"'PRORAČUN 2'!F201","v":0},0,0,{"$f":"'KUMULATIV 2'!E201","v":0},{"$f":"'KUMULATIV 2'!F201","v":0},0,0]
[null,{"$f":"$B$11","v":"Grand Total"},{"$f":"'PRORAČUN 2'!E202","v":0},{"$f":"'PRORAČUN 2'!F202","v":0},0,0,{"$f":"'KUMULATIV 2'!E202","v":0},{"$f":"'KUMULATIV 2'!F202","v":2818.4750987701373},0,-2818.4750987701373]
[{"$f":"'PRORAČUN 2'!C203","v":0},{"$f":"$B$8","v":"1. Sveži proizvodi"},{"$f":"'PRORAČUN 2'!E203","v":0},{"$f":"'PRORAČUN 2'!F203","v":0},0,0,{"$f":"'KUMULATIV 2'!E203","v":37.691000000000003},{"$f":"'KUMULATIV 2'!F203","v":696.22314826135118},5.4136378679916282E-2,-658.53214826135115]
[null,{"$f":"$B$9","v":"2. Smrznuti proizvodi"},{"$f":"'PRORAČUN 2'!E204","v":0},{"$f":"'PRORAČUN 2'!F204","v":0},0,0,{"$f":"'KUMULATIV 2'!E204","v":183.92600000000002},{"$f":"'KUMULATIV 2'!F204","v":237.41252264058767},0.77471060900372368,-53.486522640587651]
[null,{"$f":"$B$10","v":"3. Prerađevine"},{"$f":"'PRORAČUN 2'!E205","v":0},{"$f":"'PRORAČUN 2'!F205","v":0},0,0,{"$f":"'KUMULATIV 2'!E205","v":535.1400000000001},{"$f":"'KUMULATIV 2'!F205","v":1625.5359633403759},0.32920834239823304,-1090.3959633403758]
[null,{"$f":"$B$11","v":"Grand Total"},{"$f":"'PRORAČUN 2'!E206","v":0},{"$f":"'PRORAČUN 2'!F206","v":0},0,0,{"$f":"'KUMULATIV 2'!E206","v":756.75700000000006},{"$f":"'KUMULATIV 2'!F206","v":2559.1716342423156},0.29570388709940915,-1802.4146342423155]
[{"$f":"'PRORAČUN 2'!C207","v":0},{"$f":"$B$8","v":"1. Sveži proizvodi"},{"$f":"'PRORAČUN 2'!E207","v":0},{"$f":"'PRORAČUN 2'!F207","v":0},0,0,{"$f":"'KUMULATIV 2'!E207","v":323.89599999999996},{"$f":"'KUMULATIV 2'!F207","v":1722.0823050777867},0.18808392551560973,-1398.1863050777868]
[null,{"$f":"$B$9","v":"2. Smrznuti proizvodi"},{"$f":"'PRORAČUN 2'!E208","v":0},{"$f":"'PRORAČUN 2'!F208","v":0},0,0,{"$f":"'KUMULATIV 2'!E208","v":156.01800000000003},{"$f":"'KUMULATIV 2'!F208","v":282.71989420323189},0.55184655625205914,-126.70189420323186]
[null,{"$f":"$B$10","v":"3. Prerađevine"},{"$f":"'PRORAČUN 2'!E209","v":0},{"$f":"'PRORAČUN 2'!F209","v":0},0,0,{"$f":"'KUMULATIV 2'!E209","v":158.23500000000001},{"$f":"'KUMULATIV 2'!F209","v":469.29563236635511},0.33717552239325771,-311.06063236635509]
[null,{"$f":"$B$11","v":"Grand Total"},{"$f":"'PRORAČUN 2'!E210","v":0},{"$f":"'PRORAČUN 2'!F210","v":0},0,0,{"$f":"'KUMULATIV 2'!E210","v":638.14900000000011},{"$f":"'KUMULATIV 2'!F210","v":2474.0978316473738},0.25793199922700294,-1835.9488316473737]
[{"$f":"'PRORAČUN 2'!C211","v":0},{"$f":"$B$8","v":"1. Sveži proizvodi"},{"$f":"'PRORAČUN 2'!E211","v":0},{"$f":"'PRORAČUN 2'!F211","v":0},0,0,{"$f":"'KUMULATIV 2'!E211","v":247.53699999999998},{"$f":"'KUMULATIV 2'!F211","v":1453.0597798138849},0.1703556890355232,-1205.5227798138849]
[null,{"$f":"$B$9","v":"2. Smrznuti proizvodi"},{"$f":"'PRORAČUN 2'!E212","v":0},{"$f":"'PRORAČUN 2'!F212","v":0},0,0,{"$f":"'KUMULATIV 2'!E212","v":0},{"$f":"'KUMULATIV 2'!F212","v":24.38474937974226},0,-24.38474937974226]
[null,{"$f":"$B$10","v":"3. Prerađevine"},{"$f":"'PRORAČUN 2'!E213","v":0},{"$f":"'PRORAČUN 2'!F213","v":0},0,0,{"$f":"'KUMULATIV 2'!E213","v":169.9},{"$f":"'KUMULATIV 2'!F213","v":741.35376305256966},0.22917533904518986,-571.45376305256968]
[null,{"$f":"$B$11","v":"Grand Total"},{"$f":"'PRORAČUN 2'!E214","v":0},{"$f":"'PRORAČUN 2'!F214","v":0},0,0,{"$f":"'KUMULATIV 2'!E214","v":417.43700000000001},{"$f":"'KUMULATIV 2'!F214","v":2218.798292246197},0.18813652482912646,-1801.3612922461971]
[{"$f":"'PRORAČUN 2'!C215","v":0},{"$f":"$B$8","v":"1. Sveži proizvodi"},{"$f":"'PRORAČUN 2'!E215","v":0},{"$f":"'PRORAČUN 2'!F215","v":0},0,0,{"$f":"'KUMULATIV 2'!E215","v":0},{"$f":"'KUMULATIV 2'!F215","v":0},0,0]
[null,{"$f":"$B$9","v":"2. Smrznuti proizvodi"},{"$f":"'PRORAČUN 2'!E216","v":0},{"$f":"'PRORAČUN 2'!F216","v":0},0,0,{"$f":"'KUMULATIV 2'!E216","v":0},{"$f":"'KUMULATIV 2'!F216","v":337.56700803819064},0,-337.56700803819064]
[null,{"$f":"$B$10","v":"3. Prerađevine"},{"$f":"'PRORAČUN 2'!E217","v":0},{"$f":"'PRORAČUN 2'!F217","v":0},0,0,{"$f":"'KUMULATIV 2'!E217","v":858},{"$f":"'KUMULATIV 2'!F217","v":1772.8832258624989},0.48395742454079976,-914.88322586249888]
[null,{"$f":"$B$11","v":"Grand Total"},{"$f":"'PRORAČUN 2'!E218","v":0},{"$f":"'PRORAČUN 2'!F218","v":0},0,0,{"$f":"'KUMULATIV 2'!E218","v":858},{"$f":"'KUMULATIV 2'!F218","v":2110.4502339006899},0.40654832140447161,-1252.4502339006899]
[{"$f":"'PRORAČUN 2'!C219","v":0},{"$f":"$B$8","v":"1. Sveži proizvodi"},{"$f":"'PRORAČUN 2'!E219","v":0},{"$f":"'PRORAČUN 2'!F219","v":0},0,0,{"$f":"'KUMULATIV 2'!E219","v":82.230999999999995},{"$f":"'KUMULATIV 2'!F219","v":1131.3342772031899},7.2684971769162748E-2,-1049.1032772031899]
[null,{"$f":"$B$9","v":"2. Smrznuti proizvodi"},{"$f":"'PRORAČUN 2'!E220","v":0},{"$f":"'PRORAČUN 2'!F220","v":0},0,0,{"$f":"'KUMULATIV 2'!E220","v":79.078000000000003},{"$f":"'KUMULATIV 2'!F220","v":324.26798225765361},0.24386619810390961,-245.18998225765361]
[null,{"$f":"$B$10","v":"3. Prerađevine"},{"$f":"'PRORAČUN 2'!E221","v":0},{"$f":"'PRORAČUN 2'!F221","v":0},0,0,{"$f":"'KUMULATIV 2'!E221","v":59.2},{"$f":"'KUMULATIV 2'!F221","v":403.36279493219115},0.14676613892947674,-344.16279493219116]
[null,{"$f":"$B$11","v":"Grand Total"},{"$f":"'PRORAČUN 2'!E222","v":0},{"$f":"'PRORAČUN 2'!F222","v":0},0,0,{"$f":"'KUMULATIV 2'!E222","v":220.50899999999999},{"$f":"'KUMULATIV 2'!F222","v":1858.9650543930345},0.11861922819845463,-1638.4560543930345]
[{"$f":"'PRORAČUN 2'!C223","v":0},{"$f":"$B$8","v":"1. Sveži proizvodi"},{"$f":"'PRORAČUN 2'!E223","v":0},{"$f":"'PRORAČUN 2'!F223","v":0},0,0,{"$f":"'KUMULATIV 2'!E223","v":0},{"$f":"'KUMULATIV 2'!F223","v":0},0,0]
[null,{"$f":"$B$9","v":"2. Smrznuti proizvodi"},{"$f":"'PRORAČUN 2'!E224","v":0},{"$f":"'PRORAČUN 2'!F224","v":0},0,0,{"$f":"'KUMULATIV 2'!E224","v":83.097000000000008},{"$f":"'KUMULATIV 2'!F224","v":604.9013780503592},0.13737280656861395,-521.80437805035922]
[null,{"$f":"$B$10","v":"3. Prerađevine"},{"$f":"'PRORAČUN 2'!E225","v":0},{"$f":"'PRORAČUN 2'!F225","v":0},0,0,{"$f":"'KUMULATIV 2'!E225","v":551.78399999999999},{"$f":"'KUMULATIV 2'!F225","v":1137.3427265854975},0.48515191340481195,-585.55872658549754]
[null,{"$f":"$B$11","v":"Grand Total"},{"$f":"'PRORAČUN 2'!E226","v":0},{"$f":"'PRORAČUN 2'!F226","v":0},0,0,{"$f":"'KUMULATIV 2'!E226","v":634.88099999999997},{"$f":"'KUMULATIV 2'!F226","v":1742.244104635857},0.36440416030720058,-1107.3631046358569]
[{"$f":"'PRORAČUN 2'!C227","v":0},{"$f":"$B$8","v":"1. Sveži proizvodi"},{"$f":"'PRORAČUN 2'!E227","v":0},{"$f":"'PRORAČUN 2'!F227","v":0},0,0,{"$f":"'KUMULATIV 2'!E227","v":0},{"$f":"'KUMULATIV 2'!F227","v":1441.076183049684},0,-1441.076183049684]
[null,{"$f":"$B$9","v":"2. Smrznuti proizvodi"},{"$f":"'PRORAČUN 2'!E228","v":0},{"$f":"'PRORAČUN 2'!F228","v":0},0,0,{"$f":"'KUMULATIV 2'!E228","v":0},{"$f":"'KUMULATIV 2'!F228","v":0},0,0]
[null,{"$f":"$B$10","v":"3. Prerađevine"},{"$f":"'PRORAČUN 2'!E229","v":0},{"$f":"'PRORAČUN 2'!F229","v":0},0,0,{"$f":"'KUMULATIV 2'!E229","v":0},{"$f":"'KUMULATIV 2'!F229","v":0},0,0]
[null,{"$f":"$B$11","v":"Grand Total"},{"$f":"'PRORAČUN 2'!E230","v":0},{"$f":"'PRORAČUN 2'!F230","v":0},0,0,{"$f":"'KUMULATIV 2'!E230","v":0},{"$f":"'KUMULATIV 2'!F230","v":1441.076183049684},0,-1441.076183049684]
[{"$f":"'PRORAČUN 2'!C231","v":0},{"$f":"$B$8","v":"1. Sveži proizvodi"},{"$f":"'PRORAČUN 2'!E231","v":0},{"$f":"'PRORAČUN 2'!F231","v":0},0,0,{"$f":"'KUMULATIV 2'!E231","v":0},{"$f":"'KUMULATIV 2'!F231","v":0},0,0]
[null,{"$f":"$B$9","v":"2. Smrznuti proizvodi"},{"$f":"'PRORAČUN 2'!E232","v":0},{"$f":"'PRORAČUN 2'!F232","v":0},0,0,{"$f":"'KUMULATIV 2'!E232","v":464.76000000000005},{"$f":"'KUMULATIV 2'!F232","v":1285.8517165835854},0.36144136528808596,-821.09171658358537]
[null,{"$f":"$B$10","v":"3. Prerađevine"},{"$f":"'PRORAČUN 2'!E233","v":0},{"$f":"'PRORAČUN 2'!F233","v":0},0,0,{"$f":"'KUMULATIV 2'!E233","v":0},{"$f":"'KUMULATIV 2'!F233","v":0},0,0]
[null,{"$f":"$B$11","v":"Grand Total"},{"$f":"'PRORAČUN 2'!E234","v":0},{"$f":"'PRORAČUN 2'!F234","v":0},0,0,{"$f":"'KUMULATIV 2'!E234","v":464.76000000000005},{"$f":"'KUMULATIV 2'!F234","v":1285.8517165835854},0.36144136528808596,-821.09171658358537]
[{"$f":"'PRORAČUN 2'!C235","v":0},{"$f":"$B$8","v":"1. Sveži proizvodi"},{"$f":"'PRORAČUN 2'!E235","v":0},{"$f":"'PRORAČUN 2'!F235","v":0},0,0,{"$f":"'KUMULATIV 2'!E235","v":0},{"$f":"'KUMULATIV 2'!F235","v":474.37931081410147},0,-474.37931081410147]
[null,{"$f":"$B$9","v":"2. Smrznuti proizvodi"},{"$f":"'PRORAČUN 2'!E236","v":0},{"$f":"'PRORAČUN 2'!F236","v":0},{"$f":"IFERROR(C73/D73,0)","v":0},{"$f":"IFERROR(C73-D73,0)","v":0},{"$f":"'KUMULATIV 2'!E236","v":21},{"$f":"'KUMULATIV 2'!F236","v":0},{"$f":"IFERROR(G73/H73,0)","v":0},{"$f":"IFERROR(G73-H73,0)","v":21}]
[null,{"$f":"$B$10","v":"3. Prerađevine"},{"$f":"'PRORAČUN 2'!E237","v":0},{"$f":"'PRORAČUN 2'!F237","v":0},0,0,{"$f":"'KUMULATIV 2'!E237","v":271.25400000000002},{"$f":"'KUMULATIV 2'!F237","v":792.85658753830546},0.34212240178542358,-521.60258753830544]
[null,{"$f":"$B$11","v":"Grand Total"},{"$f":"'PRORAČUN 2'!E238","v":0},{"$f":"'PRORAČUN 2'!F238","v":0},0,0,{"$f":"'KUMULATIV 2'!E238","v":292.25400000000002},{"$f":"'KUMULATIV 2'!F238","v":1267.235898352407},0.23062320155227073,-974.98189835240703]
[{"$f":"'PRORAČUN 2'!C239","v":0},{"$f":"$B$8","v":"1. Sveži proizvodi"},{"$f":"'PRORAČUN 2'!E239","v":0},{"$f":"'PRORAČUN 2'!F239","v":0},0,0,{"$f":"'KUMULATIV 2'!E239","v":222.98500000000001},{"$f":"'KUMULATIV 2'!F239","v":724.2583092248874},0.30788048567732978,-501.27330922488738]
[null,{"$f":"$B$9","v":"2. Smrznuti proizvodi"},{"$f":"'PRORAČUN 2'!E240","v":0},{"$f":"'PRORAČUN 2'!F240","v":0},0,0,{"$f":"'KUMULATIV 2'!E240","v":21.606000000000002},{"$f":"'KUMULATIV 2'!F240","v":22.467322663623225},0.96166331536165683,-0.86132266362322341]
[null,{"$f":"$B$10","v":"3. Prerađevine"},{"$f":"'PRORAČUN 2'!E241","v":0},{"$f":"'PRORAČUN 2'!F241","v":0},0,0,{"$f":"'KUMULATIV 2'!E241","v":66.099999999999994},{"$f":"'KUMULATIV 2'!F241","v":438.17747467222546},0.15085211773938284,-372.07747467222543]
[null,{"$f":"$B$11","v":"Grand Total"},{"$f":"'PRORAČUN 2'!E242","v":0},{"$f":"'PRORAČUN 2'!F242","v":0},0,0,{"$f":"'KUMULATIV 2'!E242","v":310.69100000000003},{"$f":"'KUMULATIV 2'!F242","v":1184.9031065607362},0.26220793774589918,-874.21210656073617]
[{"$f":"'PRORAČUN 2'!C243","v":0},{"$f":"$B$8","v":"1. Sveži proizvodi"},{"$f":"'PRORAČUN 2'!E243","v":0},{"$f":"'PRORAČUN 2'!F243","v":0},0,0,{"$f":"'KUMULATIV 2'!E243","v":0},{"$f":"'KUMULATIV 2'!F243","v":0},0,0]
[null,{"$f":"$B$9","v":"2. Smrznuti proizvodi"},{"$f":"'PRORAČUN 2'!E244","v":0},{"$f":"'PRORAČUN 2'!F244","v":0},0,0,{"$f":"'KUMULATIV 2'!E244","v":430.34800000000001},{"$f":"'KUMULATIV 2'!F244","v":1070.3659995229855},0.4020568667089453,-640.01799952298552]
[null,{"$f":"$B$10","v":"3. Prerađevine"},{"$f":"'PRORAČUN 2'!E245","v":0},{"$f":"'PRORAČUN 2'!F245","v":0},0,0,{"$f":"'KUMULATIV 2'!E245","v":0},{"$f":"'KUMULATIV 2'!F245","v":0},0,0]
[null,{"$f":"$B$11","v":"Grand Total"},{"$f":"'PRORAČUN 2'!E246","v":0},{"$f":"'PRORAČUN 2'!F246","v":0},0,0,{"$f":"'KUMULATIV 2'!E246","v":430.34800000000001},{"$f":"'KUMULATIV 2'!F246","v":1070.3659995229855},0.4020568667089453,-640.01799952298552]
[{"$f":"'PRORAČUN 2'!C247","v":0},{"$f":"$B$8","v":"1. Sveži proizvodi"},{"$f":"'PRORAČUN 2'!E247","v":0},{"$f":"'PRORAČUN 2'!F247","v":0},0,0,{"$f":"'KUMULATIV 2'!E247","v":136.54400000000001},{"$f":"'KUMULATIV 2'!F247","v":869.9904247269526},0.15694885382543663,-733.44642472695261]
[null,{"$f":"$B$9","v":"2. Smrznuti proizvodi"},{"$f":"'PRORAČUN 2'!E248","v":0},{"$f":"'PRORAČUN 2'!F248","v":0},0,0,{"$f":"'KUMULATIV 2'!E248","v":0},{"$f":"'KUMULATIV 2'!F248","v":23.484314522406475},0,-23.484314522406475]
[null,{"$f":"$B$10","v":"3. Prerađevine"},{"$f":"'PRORAČUN 2'!E249","v":0},{"$f":"'PRORAČUN 2'!F249","v":0},0,0,{"$f":"'KUMULATIV 2'!E249","v":0},{"$f":"'KUMULATIV 2'!F249","v":13.448884782398036},0,-13.448884782398036]
[null,{"$f":"$B$11","v":"Grand Total"},{"$f":"'PRORAČUN 2'!E250","v":0},{"$f":"'PRORAČUN 2'!F250","v":0},0,0,{"$f":"'KUMULATIV 2'!E250","v":136.54400000000001},{"$f":"'KUMULATIV 2'!F250","v":906.92362403175707},0.15055733071875382,-770.37962403175709]

{"sheet":"RAZRADA GRUPA BG","index":13,"n_rows":70,"n_cols":10,"rows_kept":70,"cut":false,"hidden":false,"merged":[[2,3,2,4],[2,6,2,7],[0,1,0,8]]}
[{"$f":"'RAZRADA UKUPNO'!A1","v":"VINDIJA"},{"$f":"'RAZRADA UKUPNO'!B1:I1","v":"Dnevna prodaja od 08.08. i kumulativ dnevnog plana i prodaje za 01.- 08.08.2013"}]
[]
[null,null,null,{"$f":"'RAZRADA UKUPNO'!D3:E3","v":"Izvještaj za "},null,null,{"$f":"'RAZRADA UKUPNO'!G3:H3","v":"Kolovoz/Avgust"}]
[null,null,null,{"$f":"'RAZRADA UKUPNO'!D4","v":6},{"$f":"'RAZRADA UKUPNO'!E4","v":"dana +"},null,{"$f":"'RAZRADA UKUPNO'!G4","v":22},{"$f":"'RAZRADA UKUPNO'!H4","v":"dana +"}]
["KC BEOGRAD",null,null,{"$f":"'RAZRADA UKUPNO'!D5","v":1},{"$f":"'RAZRADA UKUPNO'!E5","v":"subota"},null,{"$f":"'RAZRADA UKUPNO'!G5","v":5},{"$f":"'RAZRADA UKUPNO'!H5","v":"subota"}]
[]
["GRUPA PROIZVODA","KUPAC","1:Dnevna prodaja","2:Dnevni plan","IND. prodaja / plan","Razlika 1-2","3: Kum. prodaje 2013","4: Kum. plana 2013","IND. kum. prod 2013 / kum. plana 2013","Razlika 3-4"]
["1. Sveži proizvodi",{"$f":"'PRORACUN 3'!D3","v":"DELHAIZE SERBIA DOO"},{"$f":"'PRORACUN 3'!E3","v":1484.7339999999999},{"$f":"'PRORACUN 3'!F3","v":2070.6616548210159},{"$f":"IFERROR(C8/D8,0)","v":0.71703360930221005},{"$f":"IFERROR(C8-D8,0)","v":-585.92765482101595},{"$f":"'KUMULATIV 3'!E3","v":16466.732999999997},{"$f":"'KUMULATIV 3'!F3","v":14494.631583747108},{"$f":"IFERROR(G8/H8,0)","v":1.1360573675059265},{"$f":"IFERROR(G8-H8,0)","v":1972.1014162528882}]
[null,{"$f":"'PRORACUN 3'!D4","v":"IDEA DOO"},{"$f":"'PRORACUN 3'!E4","v":1723.1860000000013},{"$f":"'PRORACUN 3'!F4","v":1278.8070666678552},{"$f":"IFERROR(C9/D9,0)","v":1.3474948996724341},{"$f":"IFERROR(C9-D9,0)","v":444.37893333214606},{"$f":"'KUMULATIV 3'!E4","v":10500.770000000002},{"$f":"'KUMULATIV 3'!F4","v":8951.6494666749859},{"$f":"IFERROR(G9/H9,0)","v":1.1730541995742851},{"$f":"IFERROR(G9-H9,0)","v":1549.1205333250164}]
[null,{"$f":"'PRORACUN 3'!D5","v":"MERCATOR S"},{"$f":"'PRORACUN 3'!E5","v":493.58500000000009},{"$f":"'PRORACUN 3'!F5","v":708.7756812918575},0.69639099228173595,-215.1906812918574,{"$f":"'KUMULATIV 3'!E5","v":3493.5020000000004},{"$f":"'KUMULATIV 3'!F5","v":4961.429769043003},0.70413210760289624,-1467.9277690430026]
[null,{"$f":"'PRORACUN 3'!D6","v":"ŠTRAND DOO"},{"$f":"'PRORACUN 3'!E6","v":678.83800000000008},{"$f":"'PRORACUN 3'!F6","v":676.21141839442669},1.0038842609487575,2.6265816055733922,{"$f":"'KUMULATIV 3'!E6","v":5020.0519999999997},{"$f":"'KUMULATIV 3'!F6","v":4733.4799287609867},1.0605415203089337,286.57207123901298]
[null,{"$f":"'PRORACUN 3'!D7","v":"METRO CASH & CARRY DOO"},{"$f":"'PRORACUN 3'!E7","v":162.40500000000003},{"$f":"'PRORACUN 3'!F7","v":519.06888589112782},0.31287754749773944,-356.66388589112779,{"$f":"'KUMULATIV 3'!E7","v":1324.682},{"$f":"'KUMULATIV 3'!F7","v":3633.4822012378954},0.36457643842281451,-2308.8002012378956]
[null,{"$f":"'PRORACUN 3'!D8","v":"UNIVEREXPORT DOO"},{"$f":"'PRORACUN 3'!E8","v":896.67399999999986},{"$f":"'PRORACUN 3'!F8","v":447.2198166196813},2.004996126463102,449.45418338031857,{"$f":"'KUMULATIV 3'!E8","v":4018.2729999999997},{"$f":"'KUMULATIV 3'!F8","v":3130.5387163377691},1.2835723701576636,887.73428366223061]
[null,{"$f":"'PRORACUN 3'!D9","v":"AMAN DOO"},{"$f":"'PRORACUN 3'!E9","v":12.135},{"$f":"'PRORACUN 3'!F9","v":302.94642145733746},4.0056588031718722E-2,-290.81142145733747,{"$f":"'KUMULATIV 3'!E9","v":127.49600000000001},{"$f":"'KUMULATIV 3'!F9","v":2120.6249502013625},6.0121899437188889E-2,-1993.1289502013624]
[null,{"$f":"'PRORACUN 3'!D10","v":"MESO-MARKET"},{"$f":"'PRORACUN 3'!E10","v":251.47499999999999},{"$f":"'PRORACUN 3'!F10","v":308.27991935776402},0.81573590820931496,-56.804919357764021,{"$f":"'KUMULATIV 3'!E10","v":1782.3959999999997},{"$f":"'KUMULATIV 3'!F10","v":2157.9594355043478},0.82596362594898676,-375.56343550434804]
[null,{"$f":"'PRORACUN 3'!D11","v":"MUP UPRAVA ZA POSLOVE ISHRANE I SMEŠTAJA"},{"$f":"'PRORACUN 3'!E11","v":0},{"$f":"'PRORACUN 3'!F11","v":0},0,0,{"$f":"'KUMULATIV 3'!E11","v":0},{"$f":"'KUMULATIV 3'!F11","v":0},0,0]
[null,{"$f":"'PRORACUN 3'!D12","v":"ĐERIĆ STR"},{"$f":"'PRORACUN 3'!E12","v":61.096999999999994},{"$f":"'PRORACUN 3'!F12","v":164.41968324704888},0.37159176318445197,-103.32268324704889,{"$f":"'KUMULATIV 3'!E12","v":383.33799999999997},{"$f":"'KUMULATIV 3'!F12","v":1150.9377827293422},0.33306578839644091,-767.59978272934222]
[null,{"$f":"'PRORACUN 3'!D13","v":"TP DOO TREND COMERCCE ŠID"},{"$f":"'PRORACUN 3'!E13","v":0},{"$f":"'PRORACUN 3'!F13","v":0},0,0,{"$f":"'KUMULATIV 3'!E13","v":0},{"$f":"'KUMULATIV 3'!F13","v":0},0,0]
[null,{"$f":"'PRORACUN 3'!D14","v":"VINDIJA D.O.O. LAJKOVAC - VLASTITA POTROŠNJA"},{"$f":"'PRORACUN 3'!E14","v":0},{"$f":"'PRORACUN 3'!F14","v":47.212732771319985},0,-47.212732771319985,{"$f":"'KUMULATIV 3'!E14","v":0},{"$f":"'KUMULATIV 3'!F14","v":330.48912939923986},0,-330.48912939923986]
[null,{"$f":"'PRORACUN 3'!D15","v":"PODUNAVLJE AD, BEOGRAD"},{"$f":"'PRORACUN 3'!E15","v":7.9859999999999998},{"$f":"'PRORACUN 3'!F15","v":32.670249768699037},0.24444257563195271,-24.684249768699036,{"$f":"'KUMULATIV 3'!E15","v":459.22899999999998},{"$f":"'KUMULATIV 3'!F15","v":228.69174838089322},2.0080698287160752,230.53725161910677]
[null,{"$f":"'PRORACUN 3'!D16","v":"POINT MARTINOVIĆ DOO"},{"$f":"'PRORACUN 3'!E16","v":0},{"$f":"'PRORACUN 3'!F16","v":83.211675069864512},0,-83.211675069864512,{"$f":"'KUMULATIV 3'!E16","v":0},{"$f":"'KUMULATIV 3'!F16","v":582.48172548905154},0,-582.48172548905154]
[null,{"$f":"'PRORACUN 3'!D17","v":"MIS CHILLI DOO"},{"$f":"'PRORACUN 3'!E17","v":0},{"$f":"'PRORACUN 3'!F17","v":45.721326720895732},0,-45.721326720895732,{"$f":"'KUMULATIV 3'!E17","v":190.82},{"$f":"'KUMULATIV 3'!F17","v":320.04928704627008},0.59622066888845404,-129.22928704627009]
[null,{"$f":"'PRORACUN 3'!D18","v":"VEROPOULOS DOO"},{"$f":"'PRORACUN 3'!E18","v":12.215},{"$f":"'PRORACUN 3'!F18","v":55.957977875138077},0.21828880284516283,-43.742977875138081,{"$f":"'KUMULATIV 3'!E18","v":134.98400000000001},{"$f":"'KUMULATIV 3'!F18","v":391.7058451259665},0.34460552907141645,-256.72184512596652]
[null,{"$f":"'PRORACUN 3'!D19","v":"JOVANA STR"},{"$f":"'PRORACUN 3'!E19","v":46.153999999999996},{"$f":"'PRORACUN 3'!F19","v":53.967701651104086},0.85521522295652119,-7.8137016511040898,{"$f":"'KUMULATIV 3'!E19","v":250.92999999999998},{"$f":"'KUMULATIV 3'!F19","v":377.77391155772864},0.66423326842582853,-126.84391155772866]
[null,{"$f":"'PRORACUN 3'!D20","v":"SLAVONAC STUR, ISMETA MUJEZINOVIĆA"},{"$f":"'PRORACUN 3'!E20","v":0},{"$f":"'PRORACUN 3'!F20","v":57.190027817047969},0,-57.190027817047969,{"$f":"'KUMULATIV 3'!E20","v":0},{"$f":"'KUMULATIV 3'!F20","v":400.33019471933579},0,-400.33019471933579]
[null,{"$f":"'PRORACUN 3'!D21","v":"MEDIUS DOO"},{"$f":"'PRORACUN 3'!E21","v":0},{"$f":"'PRORACUN 3'!F21","v":8.9340155824650349},0,-8.9340155824650349,{"$f":"'KUMULATIV 3'!E21","v":10.173},{"$f":"'KUMULATIV 3'!F21","v":62.53810907725525},0.16266881346592971,-52.365109077255248]
[null,{"$f":"'PRORACUN 3'!D22","v":"FAMOSO"},{"$f":"'PRORACUN 3'!E22","v":0},{"$f":"'PRORACUN 3'!F22","v":50.54283484523345},0,-50.54283484523345,{"$f":"'KUMULATIV 3'!E22","v":0},{"$f":"'KUMULATIV 3'!F22","v":353.79984391663419},0,-353.79984391663419]
["Ukupno Sveži proizvodi",null,{"$f":"SUM(C8:C27)","v":5830.4840000000004},{"$f":"SUM(D8:D27)","v":6911.7990898498801},{"$f":"IFERROR(C28/D28,0)","v":0.84355519079861374},{"$f":"IFERROR(C28-D28,0)","v":-1081.3150898498798},{"$f":"SUM(G8:G27)","v":44163.378000000004},{"$f":"SUM(H8:H27)","v":48382.593628949166},{"$f":"IFERROR(G28/H28,0)","v":0.91279476124602299},{"$f":"IFERROR(G28-H28,0)","v":-4219.2156289491613}]
["2. Smrznuti proizvodi",{"$f":"'PRORACUN 3'!D23","v":"DELHAIZE SERBIA DOO"},{"$f":"'PRORACUN 3'!E23","v":0},{"$f":"'PRORACUN 3'!F23","v":0},0,0,{"$f":"'KUMULATIV 3'!E23","v":0},{"$f":"'KUMULATIV 3'!F23","v":0},0,0]
[null,{"$f":"'PRORACUN 3'!D24","v":"IDEA DOO"},{"$f":"'PRORACUN 3'!E24","v":0},{"$f":"'PRORACUN 3'!F24","v":0},0,0,{"$f":"'KUMULATIV 3'!E24","v":0},{"$f":"'KUMULATIV 3'!F24","v":0},0,0]
[null,{"$f":"'PRORACUN 3'!D25","v":"MERCATOR S"},{"$f":"'PRORACUN 3'!E25","v":19.132999999999999},{"$f":"'PRORACUN 3'!F25","v":15.10537900485849},1.2666348850860389,4.0276209951415094,{"$f":"'KUMULATIV 3'!E25","v":46.536000000000001},{"$f":"'KUMULATIV 3'!F25","v":105.73765303400943},0.44010812293168805,-59.201653034009425]
[null,{"$f":"'PRORACUN 3'!D26","v":"ŠTRAND DOO"},{"$f":"'PRORACUN 3'!E26","v":0},{"$f":"'PRORACUN 3'!F26","v":0},0,0,{"$f":"'KUMULATIV 3'!E26","v":0},{"$f":"'KUMULATIV 3'!F26","v":0},0,0]
[null,{"$f":"'PRORACUN 3'!D27","v":"METRO CASH & CARRY DOO"},{"$f":"'PRORACUN 3'!E27","v":0},{"$f":"'PRORACUN 3'!F27","v":6.3749341137545237},0,-6.3749341137545237,{"$f":"'KUMULATIV 3'!E27","v":0},{"$f":"'KUMULATIV 3'!F27","v":44.624538796281669},0,-44.624538796281669]
[null,{"$f":"'PRORACUN 3'!D28","v":"UNIVEREXPORT DOO"},{"$f":"'PRORACUN 3'!E28","v":0},{"$f":"'PRORACUN 3'!F28","v":0},0,0,{"$f":"'KUMULATIV 3'!E28","v":0},{"$f":"'KUMULATIV 3'!F28","v":0},0,0]
[null,{"$f":"'PRORACUN 3'!D29","v":"AMAN DOO"},{"$f":"'PRORACUN 3'!E29","v":0},{"$f":"'PRORACUN 3'!F29","v":0},0,0,{"$f":"'KUMULATIV 3'!E29","v":0},{"$f":"'KUMULATIV 3'!F29","v":0},0,0]
[null,{"$f":"'PRORACUN 3'!D30","v":"MESO-MARKET"},{"$f":"'PRORACUN 3'!E30","v":0},{"$f":"'PRORACUN 3'!F30","v":0},0,0,{"$f":"'KUMULATIV 3'!E30","v":0},{"$f":"'KUMULATIV 3'!F30","v":0},0,0]
[null,{"$f":"'PRORACUN 3'!D31","v":"MUP UPRAVA ZA POSLOVE ISHRANE I SMEŠTAJA"},{"$f":"'PRORACUN 3'!E31","v":239.26800000000003},{"$f":"'PRORACUN 3'!F31","v":177.0353195086964},1.3515269193967061,62.232680491303626,{"$f":"'KUMULATIV 3'!E31","v":1251.989},{"$f":"'KUMULATIV 3'!F31","v":1239.2472365608749},1.0102818574560519,12.74176343912518]
[null,{"$f":"'PRORACUN 3'!D32","v":"ĐERIĆ STR"},{"$f":"'PRORACUN 3'!E32","v":0},{"$f":"'PRORACUN 3'!F32","v":0},0,0,{"$f":"'KUMULATIV 3'!E32","v":0},{"$f":"'KUMULATIV 3'!F32","v":0},0,0]
[null,{"$f":"'PRORACUN 3'!D33","v":"TP DOO TREND COMERCCE ŠID"},{"$f":"'PRORACUN 3'!E33","v":60.995000000000005},{"$f":"'PRORACUN 3'!F33","v":25.686501044029782},2.3745935616317366,35.308498955970222,{"$f":"'KUMULATIV 3'!E33","v":230.79000000000002},{"$f":"'KUMULATIV 3'!F33","v":179.80550730820852},1.2835535654889474,50.984492691791502]
[null,{"$f":"'PRORACUN 3'!D34","v":"VINDIJA D.O.O. LAJKOVAC - VLASTITA POTROŠNJA"},{"$f":"'PRORACUN 3'!E34","v":0},{"$f":"'PRORACUN 3'!F34","v":29.186290538438641},0,-29.186290538438641,{"$f":"'KUMULATIV 3'!E34","v":0},{"$f":"'KUMULATIV 3'!F34","v":204.30403376907049},0,-204.30403376907049]
[null,{"$f":"'PRORACUN 3'!D35","v":"PODUNAVLJE AD, BEOGRAD"},{"$f":"'PRORACUN 3'!E35","v":136.50900000000001},{"$f":"'PRORACUN 3'!F35","v":47.56560670742364},2.8699097824961588,88.943393292576374,{"$f":"'KUMULATIV 3'!E35","v":613.11699999999996},{"$f":"'KUMULATIV 3'!F35","v":332.95924695196544},1.841417547680998,280.15775304803452]
[null,{"$f":"'PRORACUN 3'!D36","v":"POINT MARTINOVIĆ DOO"},{"$f":"'PRORACUN 3'!E36","v":0},{"$f":"'PRORACUN 3'!F36","v":0.60680872127948282},0,-0.60680872127948282,{"$f":"'KUMULATIV 3'!E36","v":0},{"$f":"'KUMULATIV 3'!F36","v":4.2476610489563793},0,-4.2476610489563793]
[null,{"$f":"'PRORACUN 3'!D37","v":"MIS CHILLI DOO"},{"$f":"'PRORACUN 3'!E37","v":0},{"$f":"'PRORACUN 3'!F37","v":0},0,0,{"$f":"'KUMULATIV 3'!E37","v":0},{"$f":"'KUMULATIV 3'!F37","v":0},0,0]
[null,{"$f":"'PRORACUN 3'!D38","v":"VEROPOULOS DOO"},{"$f":"'PRORACUN 3'!E38","v":0},{"$f":"'PRORACUN 3'!F38","v":0.52126023899778684},0,-0.52126023899778684,{"$f":"'KUMULATIV 3'!E38","v":0},{"$f":"'KUMULATIV 3'!F38","v":3.6488216729845075},0,-3.6488216729845075]
[null,{"$f":"'PRORACUN 3'!D39","v":"JOVANA STR"},{"$f":"'PRORACUN 3'!E39","v":0},{"$f":"'PRORACUN 3'!F39","v":0},0,0,{"$f":"'KUMULATIV 3'!E39","v":0},{"$f":"'KUMULATIV 3'!F39","v":0},0,0]
[null,{"$f":"'PRORACUN 3'!D40","v":"SLAVONAC STUR, ISMETA MUJEZINOVIĆA"},{"$f":"'PRORACUN 3'!E40","v":0},{"$f":"'PRORACUN 3'!F40","v":0},0,0,{"$f":"'KUMULATIV 3'!E40","v":0},{"$f":"'KUMULATIV 3'!F40","v":0},0,0]
[null,{"$f":"'PRORACUN 3'!D41","v":"MEDIUS DOO"},{"$f":"'PRORACUN 3'!E41","v":0},{"$f":"'PRORACUN 3'!F41","v":0},0,0,{"$f":"'KUMULATIV 3'!E41","v":0},{"$f":"'KUMULATIV 3'!F41","v":0},0,0]
[null,{"$f":"'PRORACUN 3'!D42","v":"FAMOSO"},{"$f":"'PRORACUN 3'!E42","v":0},{"$f":"'PRORACUN 3'!F42","v":0},0,0,{"$f":"'KUMULATIV 3'!E42","v":0},{"$f":"'KUMULATIV 3'!F42","v":0},0,0]
["Ukupno Smrznuti proizvodi",null,{"$f":"SUM(C29:C48)","v":455.90500000000003},{"$f":"SUM(D29:D48)","v":302.08209987747875},{"$f":"IFERROR(C49/D49,0)","v":1.5092089209685386},{"$f":"IFERROR(C49-D49,0)","v":153.82290012252128},{"$f":"SUM(G29:G48)","v":2142.4319999999998},{"$f":"SUM(H29:H48)","v":2114.5746991423507},{"$f":"IFERROR(G49/H49,0)","v":1.0131739497634904},{"$f":"IFERROR(G49-H49,0)","v":27.857300857649079}]
["3. Prerađevine",{"$f":"'PRORACUN 3'!D43","v":"DELHAIZE SERBIA DOO"},{"$f":"'PRORACUN 3'!E43","v":50.921000000000006},{"$f":"'PRORACUN 3'!F43","v":294.01755613204404},0.17319033825698238,-243.09655613204404,{"$f":"'KUMULATIV 3'!E43","v":332.72899999999998},{"$f":"'KUMULATIV 3'!F43","v":2058.1228929243084},0.16166624507404317,-1725.3938929243084]
[null,{"$f":"'PRORACUN 3'!D44","v":"IDEA DOO"},{"$f":"'PRORACUN 3'!E44","v":246.18200000000002},{"$f":"'PRORACUN 3'!F44","v":17.832413070596054},13.805310533431429,228.34958692940396,{"$f":"'KUMULATIV 3'!E44","v":1496.2550000000001},{"$f":"'KUMULATIV 3'!F44","v":124.8268914941724},11.986639914604085,1371.4281085058278]
[null,{"$f":"'PRORACUN 3'!D45","v":"MERCATOR S"},{"$f":"'PRORACUN 3'!E45","v":68.067000000000007},{"$f":"'PRORACUN 3'!F45","v":147.63721786742215},0.46104228312622364,-79.570217867422144,{"$f":"'KUMULATIV 3'!E45","v":598.55700000000002},{"$f":"'KUMULATIV 3'!F45","v":1033.4605250719551},0.57917741943585632,-434.90352507195507]
[null,{"$f":"'PRORACUN 3'!D46","v":"ŠTRAND DOO"},{"$f":"'PRORACUN 3'!E46","v":0},{"$f":"'PRORACUN 3'!F46","v":0},0,0,{"$f":"'KUMULATIV 3'!E46","v":0},{"$f":"'KUMULATIV 3'!F46","v":0},0,0]
[null,{"$f":"'PRORACUN 3'!D47","v":"METRO CASH & CARRY DOO"},{"$f":"'PRORACUN 3'!E47","v":0},{"$f":"'PRORACUN 3'!F47","v":103.29789489197951},0,-103.29789489197951,{"$f":"'KUMULATIV 3'!E47","v":260.5},{"$f":"'KUMULATIV 3'!F47","v":723.0852642438565},0.36026180159045229,-462.5852642438565]
[null,{"$f":"'PRORACUN 3'!D48","v":"UNIVEREXPORT DOO"},{"$f":"'PRORACUN 3'!E48","v":92.25},{"$f":"'PRORACUN 3'!F48","v":44.926506506236706},2.0533535138592143,47.323493493763294,{"$f":"'KUMULATIV 3'!E48","v":533.9},{"$f":"'KUMULATIV 3'!F48","v":314.48554554365694},1.6976932885008664,219.41445445634304]
[null,{"$f":"'PRORACUN 3'!D49","v":"AMAN DOO"},{"$f":"'PRORACUN 3'!E49","v":236.255},{"$f":"'PRORACUN 3'!F49","v":138.69664248371743},1.7033937936005599,97.55835751628257,{"$f":"'KUMULATIV 3'!E49","v":1841.0940000000001},{"$f":"'KUMULATIV 3'!F49","v":970.87649738602181},1.8963215248869894,870.21750261397824]
[null,{"$f":"'PRORACUN 3'!D50","v":"MESO-MARKET"},{"$f":"'PRORACUN 3'!E50","v":0},{"$f":"'PRORACUN 3'!F50","v":3.3440890881268306},0,-3.3440890881268306,{"$f":"'KUMULATIV 3'!E50","v":13.285},{"$f":"'KUMULATIV 3'!F50","v":23.408623616887809},0.56752589205696535,-10.123623616887809]
[null,{"$f":"'PRORACUN 3'!D51","v":"MUP UPRAVA ZA POSLOVE ISHRANE I SMEŠTAJA"},{"$f":"'PRORACUN 3'!E51","v":0},{"$f":"'PRORACUN 3'!F51","v":0},0,0,{"$f":"'KUMULATIV 3'!E51","v":0},{"$f":"'KUMULATIV 3'!F51","v":0},0,0]
[null,{"$f":"'PRORACUN 3'!D52","v":"ĐERIĆ STR"},{"$f":"'PRORACUN 3'!E52","v":0},{"$f":"'PRORACUN 3'!F52","v":0},0,0,{"$f":"'KUMULATIV 3'!E52","v":13},{"$f":"'KUMULATIV 3'!F52","v":0},0,13]
[null,{"$f":"'PRORACUN 3'!D53","v":"TP DOO TREND COMERCCE ŠID"},{"$f":"'PRORACUN 3'!E53","v":141},{"$f":"'PRORACUN 3'!F53","v":78.945310455390256},1.7860465578848421,62.054689544609744,{"$f":"'KUMULATIV 3'!E53","v":531.63499999999999},{"$f":"'KUMULATIV 3'!F53","v":552.61717318773185},0.9620312682888631,-20.98217318773186]
[null,{"$f":"'PRORACUN 3'!D54","v":"VINDIJA D.O.O. LAJKOVAC - VLASTITA POTROŠNJA"},{"$f":"'PRORACUN 3'!E54","v":0},{"$f":"'PRORACUN 3'!F54","v":20.922892652947361},0,-20.922892652947361,{"$f":"'KUMULATIV 3'!E54","v":0},{"$f":"'KUMULATIV 3'!F54","v":146.46024857063151},0,-146.46024857063151]
[null,{"$f":"'PRORACUN 3'!D55","v":"PODUNAVLJE AD, BEOGRAD"},{"$f":"'PRORACUN 3'!E55","v":29.863},{"$f":"'PRORACUN 3'!F55","v":9.8722297994276627},3.0249498448396421,19.990770200572335,{"$f":"'KUMULATIV 3'!E55","v":141.649},{"$f":"'KUMULATIV 3'!F55","v":69.105608595993644},2.0497467988178895,72.543391404006357]
[null,{"$f":"'PRORACUN 3'!D56","v":"POINT MARTINOVIĆ DOO"},{"$f":"'PRORACUN 3'!E56","v":0},{"$f":"'PRORACUN 3'!F56","v":0},0,0,{"$f":"'KUMULATIV 3'!E56","v":0},{"$f":"'KUMULATIV 3'!F56","v":0},0,0]
[null,{"$f":"'PRORACUN 3'!D57","v":"MIS CHILLI DOO"},{"$f":"'PRORACUN 3'!E57","v":0},{"$f":"'PRORACUN 3'!F57","v":37.451477460631622},0,-37.451477460631622,{"$f":"'KUMULATIV 3'!E57","v":227.61699999999996},{"$f":"'KUMULATIV 3'!F57","v":262.16034222442136},0.86823582113403441,-34.543342224421394]
[null,{"$f":"'PRORACUN 3'!D58","v":"VEROPOULOS DOO"},{"$f":"'PRORACUN 3'!E58","v":92.843000000000004},{"$f":"'PRORACUN 3'!F58","v":16.851316186025802},5.5095399656076367,75.991683813974205,{"$f":"'KUMULATIV 3'!E58","v":251.66300000000001},{"$f":"'KUMULATIV 3'!F58","v":117.9592133021806},2.1334747236343916,133.7037866978194]
[null,{"$f":"'PRORACUN 3'!D59","v":"JOVANA STR"},{"$f":"'PRORACUN 3'!E59","v":7.2},{"$f":"'PRORACUN 3'!F59","v":9.990956780541044},0.72065170114869581,-2.7909567805410438,{"$f":"'KUMULATIV 3'!E59","v":48.111000000000004},{"$f":"'KUMULATIV 3'!F59","v":69.936697463787297},0.68792210305485935,-21.825697463787293]
[null,{"$f":"'PRORACUN 3'!D60","v":"SLAVONAC STUR, ISMETA MUJEZINOVIĆA"},{"$f":"'PRORACUN 3'!E60","v":0},{"$f":"'PRORACUN 3'!F60","v":0},0,0,{"$f":"'KUMULATIV 3'!E60","v":0},{"$f":"'KUMULATIV 3'!F60","v":0},0,0]
[null,{"$f":"'PRORACUN 3'!D61","v":"MEDIUS DOO"},{"$f":"'PRORACUN 3'!E61","v":0},{"$f":"'PRORACUN 3'!F61","v":46.521405619193111},0,-46.521405619193111,{"$f":"'KUMULATIV 3'!E61","v":216.56399999999999},{"$f":"'KUMULATIV 3'!F61","v":325.64983933435178},0.6650210558760602,-109.08583933435179]
[null,{"$f":"'PRORACUN 3'!D62","v":"FAMOSO"},{"$f":"'PRORACUN 3'!E62","v":0},{"$f":"'PRORACUN 3'!F62","v":0},0,0,{"$f":"'KUMULATIV 3'!E62","v":0},{"$f":"'KUMULATIV 3'!F62","v":0},0,0]
["Ukupno Prerađevine",null,{"$f":"SUM(C50:C69)","v":964.58100000000002},{"$f":"SUM(D50:D69)","v":970.3079089942795},{"$f":"IFERROR(C70/D70,0)","v":0.99409784364200904},{"$f":"IFERROR(C70-D70,0)","v":-5.7269089942794835},{"$f":"SUM(G50:G69)","v":6506.5590000000002},{"$f":"SUM(H50:H69)","v":6792.1553629599575},{"$f":"IFERROR(G70/H70,0)","v":0.95795202734651563},{"$f":"IFERROR(G70-H70,0)","v":-285.59636295995733}]

{"sheet":"RAZRADA GRUPA LA","index":14,"n_rows":70,"n_cols":10,"rows_kept":70,"cut":false,"hidden":false,"merged":[[2,3,2,4],[2,6,2,7],[0,1,0,8]]}
[{"$f":"'RAZRADA UKUPNO'!A1","v":"VINDIJA"},{"$f":"'RAZRADA UKUPNO'!B1:I1","v":"Dnevna prodaja od 08.08. i kumulativ dnevnog plana i prodaje za 01.- 08.08.2013"}]
[]
[null,null,null,{"$f":"'RAZRADA UKUPNO'!D3:E3","v":"Izvještaj za "},null,null,{"$f":"'RAZRADA UKUPNO'!G3:H3","v":"Kolovoz/Avgust"}]
[null,null,null,{"$f":"'RAZRADA UKUPNO'!D4","v":6},{"$f":"'RAZRADA UKUPNO'!E4","v":"dana +"},null,{"$f":"'RAZRADA UKUPNO'!G4","v":22},{"$f":"'RAZRADA UKUPNO'!H4","v":"dana +"}]
["KC LAJKOVAC",null,null,{"$f":"'RAZRADA UKUPNO'!D5","v":1},{"$f":"'RAZRADA UKUPNO'!E5","v":"subota"},null,{"$f":"'RAZRADA UKUPNO'!G5","v":5},{"$f":"'RAZRADA UKUPNO'!H5","v":"subota"}]
[]
["GRUPA PROIZVODA","KUPAC","1:Dnevna prodaja","2:Dnevni plan","IND. prodaja / plan","Razlika 1-2","3: Kum. prodaje 2013","4: Kum. plana 2013","IND. kum. prod 2013 / kum. plana 2013","Razlika 3-4"]
["1. Sveži proizvodi",{"$f":"'PRORACUN 3'!D87","v":0},{"$f":"'PRORACUN 3'!E87","v":5830.4840000000004},{"$f":"'PRORACUN 3'!F87","v":6911.7990898498801},{"$f":"IFERROR(C8/D8,0)","v":0.84355519079861374},{"$f":"IFERROR(C8-D8,0)","v":-1081.3150898498798},{"$f":"'KUMULATIV 3'!E87","v":2022.1940000000004},{"$f":"'KUMULATIV 3'!F87","v":2970.3480897778995},{"$f":"IFERROR(G8/H8,0)","v":0.68079361033783925},{"$f":"IFERROR(G8-H8,0)","v":-948.15408977789912}]
[null,{"$f":"'PRORACUN 3'!D88","v":0},{"$f":"'PRORACUN 3'!E88","v":455.90500000000003},{"$f":"'PRORACUN 3'!F88","v":302.08209987747875},{"$f":"IFERROR(C9/D9,0)","v":1.5092089209685386},{"$f":"IFERROR(C9-D9,0)","v":153.82290012252128},{"$f":"'KUMULATIV 3'!E88","v":2605.3720000000003},{"$f":"'KUMULATIV 3'!F88","v":3215.660539290297},{"$f":"IFERROR(G9/H9,0)","v":0.81021363050187234},{"$f":"IFERROR(G9-H9,0)","v":-610.28853929029674}]
[null,{"$f":"'PRORACUN 3'!D89","v":0},{"$f":"'PRORACUN 3'!E89","v":964.58100000000002},{"$f":"'PRORACUN 3'!F89","v":970.3079089942795},0.99409784364200904,-5.7269089942794835,{"$f":"'KUMULATIV 3'!E89","v":652.57400000000007},{"$f":"'KUMULATIV 3'!F89","v":1257.3830045251975},0.51899381306368109,-604.80900452519745]
[null,{"$f":"'PRORACUN 3'!D90","v":0},{"$f":"'PRORACUN 3'!E90","v":7250.9700000000012},{"$f":"'PRORACUN 3'!F90","v":8184.1890987216393},0.88597293055369331,-933.21909872163815,{"$f":"'KUMULATIV 3'!E90","v":1041.5740000000001},{"$f":"'KUMULATIV 3'!F90","v":1582.6231168722084},0.65813142048531303,-541.04911687220829]
[null,{"$f":"'PRORACUN 3'!D91","v":0},{"$f":"'PRORACUN 3'!E91","v":0},{"$f":"'PRORACUN 3'!F91","v":0},0,0,{"$f":"'KUMULATIV 3'!E91","v":787.49300000000005},{"$f":"'KUMULATIV 3'!F91","v":1436.6341513867922},0.54815138512461781,-649.1411513867921]
[null,{"$f":"'PRORACUN 3'!D92","v":0},{"$f":"'PRORACUN 3'!E92","v":0},{"$f":"'PRORACUN 3'!F92","v":0},0,0,{"$f":"'KUMULATIV 3'!E92","v":414.00899999999996},{"$f":"'KUMULATIV 3'!F92","v":788.20098673353482},0.52525815999766434,-374.19198673353486]
[null,{"$f":"'PRORACUN 3'!D93","v":0},{"$f":"'PRORACUN 3'!E93","v":0},{"$f":"'PRORACUN 3'!F93","v":0},0,0,{"$f":"'KUMULATIV 3'!E93","v":0},{"$f":"'KUMULATIV 3'!F93","v":957.11833316561513},0,-957.11833316561513]
[null,{"$f":"'PRORACUN 3'!D94","v":0},{"$f":"'PRORACUN 3'!E94","v":0},{"$f":"'PRORACUN 3'!F94","v":0},0,0,{"$f":"'KUMULATIV 3'!E94","v":73.782000000000011},{"$f":"'KUMULATIV 3'!F94","v":802.73613073748311},9.1913142033628936E-2,-728.95413073748307]
[null,{"$f":"'PRORACUN 3'!D95","v":0},{"$f":"'PRORACUN 3'!E95","v":0},{"$f":"'PRORACUN 3'!F95","v":0},0,0,{"$f":"'KUMULATIV 3'!E95","v":283.63599999999997},{"$f":"'KUMULATIV 3'!F95","v":644.68179627954578},0.43996278728026972,-361.04579627954581]
[null,{"$f":"'PRORACUN 3'!D96","v":0},{"$f":"'PRORACUN 3'!E96","v":0},{"$f":"'PRORACUN 3'!F96","v":0},0,0,{"$f":"'KUMULATIV 3'!E96","v":97.596999999999994},{"$f":"'KUMULATIV 3'!F96","v":502.21339605599962},0.19433372499907864,-404.61639605599964]
[null,{"$f":"'PRORACUN 3'!D97","v":0},{"$f":"'PRORACUN 3'!E97","v":0},{"$f":"'PRORACUN 3'!F97","v":0},0,0,{"$f":"'KUMULATIV 3'!E97","v":374.72899999999998},{"$f":"'KUMULATIV 3'!F97","v":440.95788670402663},0.84980677588270503,-66.22888670402665]
[null,{"$f":"'PRORACUN 3'!D98","v":0},{"$f":"'PRORACUN 3'!E98","v":0},{"$f":"'PRORACUN 3'!F98","v":0},0,0,{"$f":"'KUMULATIV 3'!E98","v":266.35400000000004},{"$f":"'KUMULATIV 3'!F98","v":407.6419118466647},0.65340190068628079,-141.28791184666466]
[null,{"$f":"'PRORACUN 3'!D99","v":0},{"$f":"'PRORACUN 3'!E99","v":0},{"$f":"'PRORACUN 3'!F99","v":0},0,0,{"$f":"'KUMULATIV 3'!E99","v":24.036999999999999},{"$f":"'KUMULATIV 3'!F99","v":419.16898253786792},5.7344414785816089E-2,-395.13198253786794]
[null,{"$f":"'PRORACUN 3'!D100","v":0},{"$f":"'PRORACUN 3'!E100","v":0},{"$f":"'PRORACUN 3'!F100","v":0},0,0,{"$f":"'KUMULATIV 3'!E100","v":99.88},{"$f":"'KUMULATIV 3'!F100","v":262.34971733037872},0.38071319846028445,-162.46971733037873]
[null,{"$f":"'PRORACUN 3'!D101","v":0},{"$f":"'PRORACUN 3'!E101","v":0},{"$f":"'PRORACUN 3'!F101","v":0},0,0,{"$f":"'KUMULATIV 3'!E101","v":0},{"$f":"'KUMULATIV 3'!F101","v":137.8232604293359},0,-137.8232604293359]
[null,{"$f":"'PRORACUN 3'!D102","v":0},{"$f":"'PRORACUN 3'!E102","v":0},{"$f":"'PRORACUN 3'!F102","v":0},0,0,{"$f":"'KUMULATIV 3'!E102","v":0},{"$f":"'KUMULATIV 3'!F102","v":412.38991350016755},0,-412.38991350016755]
[null,{"$f":"'PRORACUN 3'!D103","v":0},{"$f":"'PRORACUN 3'!E103","v":0},{"$f":"'PRORACUN 3'!F103","v":0},0,0,{"$f":"'KUMULATIV 3'!E103","v":217.595},{"$f":"'KUMULATIV 3'!F103","v":239.33083248631647},0.90918080942387902,-21.735832486316468]
[null,{"$f":"'PRORACUN 3'!D104","v":0},{"$f":"'PRORACUN 3'!E104","v":0},{"$f":"'PRORACUN 3'!F104","v":0},0,0,{"$f":"'KUMULATIV 3'!E104","v":0},{"$f":"'KUMULATIV 3'!F104","v":276.40144694259772},0,-276.40144694259772]
[null,{"$f":"'PRORACUN 3'!D105","v":0},{"$f":"'PRORACUN 3'!E105","v":0},{"$f":"'PRORACUN 3'!F105","v":0},0,0,{"$f":"'KUMULATIV 3'!E105","v":18.712},{"$f":"'KUMULATIV 3'!F105","v":200.23496615731699},9.3450211814147852E-2,-181.522966157317]
[null,{"$f":"'PRORACUN 3'!D106","v":0},{"$f":"'PRORACUN 3'!E106","v":0},{"$f":"'PRORACUN 3'!F106","v":0},0,0,{"$f":"'KUMULATIV 3'!E106","v":6.1520000000000001},{"$f":"'KUMULATIV 3'!F106","v":3.8044349159621582},1.6170601248001986,2.3475650840378419]
["Ukupno Sveži proizvodi",null,{"$f":"SUM(C8:C27)","v":14501.940000000002},{"$f":"SUM(D8:D27)","v":16368.378197443279},{"$f":"IFERROR(C28/D28,0)","v":0.88597293055369331},{"$f":"IFERROR(C28-D28,0)","v":-1866.4381974432763},{"$f":"SUM(G8:G27)","v":8985.6899999999987},{"$f":"SUM(H8:H27)","v":16957.702897675204},{"$f":"IFERROR(G28/H28,0)","v":0.52988839669032539},{"$f":"IFERROR(G28-H28,0)","v":-7972.0128976752057}]
["2. Smrznuti proizvodi",{"$f":"'PRORACUN 3'!D107","v":0},{"$f":"'PRORACUN 3'!E107","v":0},{"$f":"'PRORACUN 3'!F107","v":0},0,0,{"$f":"'KUMULATIV 3'!E107","v":11.108000000000001},{"$f":"'KUMULATIV 3'!F107","v":35.866076641100406},0.30970769708529783,-24.758076641100406]
[null,{"$f":"'PRORACUN 3'!D108","v":0},{"$f":"'PRORACUN 3'!E108","v":0},{"$f":"'PRORACUN 3'!F108","v":0},{"$f":"IFERROR(C30/D30,0)","v":0},{"$f":"IFERROR(C30-D30,0)","v":0},{"$f":"'KUMULATIV 3'!E108","v":0},{"$f":"'KUMULATIV 3'!F108","v":0},{"$f":"IFERROR(G30/H30,0)","v":0},{"$f":"IFERROR(G30-H30,0)","v":0}]
[null,{"$f":"'PRORACUN 3'!D109","v":0},{"$f":"'PRORACUN 3'!E109","v":0},{"$f":"'PRORACUN 3'!F109","v":0},0,0,{"$f":"'KUMULATIV 3'!E109","v":0},{"$f":"'KUMULATIV 3'!F109","v":0},0,0]
[null,{"$f":"'PRORACUN 3'!D110","v":0},{"$f":"'PRORACUN 3'!E110","v":0},{"$f":"'PRORACUN 3'!F110","v":0},0,0,{"$f":"'KUMULATIV 3'!E110","v":91.923999999999992},{"$f":"'KUMULATIV 3'!F110","v":376.56163768368356},0.24411408598455611,-284.63763768368358]
[null,{"$f":"'PRORACUN 3'!D111","v":0},{"$f":"'PRORACUN 3'!E111","v":0},{"$f":"'PRORACUN 3'!F111","v":0},0,0,{"$f":"'KUMULATIV 3'!E111","v":0},{"$f":"'KUMULATIV 3'!F111","v":27.54480665294356},0,-27.54480665294356]
[null,{"$f":"'PRORACUN 3'!D112","v":0},{"$f":"'PRORACUN 3'!E112","v":0},{"$f":"'PRORACUN 3'!F112","v":0},0,0,{"$f":"'KUMULATIV 3'!E112","v":108.146},{"$f":"'KUMULATIV 3'!F112","v":304.8233054205358},0.35478258412952129,-196.67730542053579]
[null,{"$f":"'PRORACUN 3'!D113","v":0},{"$f":"'PRORACUN 3'!E113","v":0},{"$f":"'PRORACUN 3'!F113","v":0},0,0,{"$f":"'KUMULATIV 3'!E113","v":0},{"$f":"'KUMULATIV 3'!F113","v":104.81259992464507},0,-104.81259992464507]
[null,{"$f":"'PRORACUN 3'!D114","v":0},{"$f":"'PRORACUN 3'!E114","v":0},{"$f":"'PRORACUN 3'!F114","v":0},0,0,{"$f":"'KUMULATIV 3'!E114","v":0},{"$f":"'KUMULATIV 3'!F114","v":3.3784487000925063},0,-3.3784487000925063]
[null,{"$f":"'PRORACUN 3'!D115","v":0},{"$f":"'PRORACUN 3'!E115","v":0},{"$f":"'PRORACUN 3'!F115","v":0},0,0,{"$f":"'KUMULATIV 3'!E115","v":0},{"$f":"'KUMULATIV 3'!F115","v":0},0,0]
[null,{"$f":"'PRORACUN 3'!D116","v":0},{"$f":"'PRORACUN 3'!E116","v":0},{"$f":"'PRORACUN 3'!F116","v":0},0,0,{"$f":"'KUMULATIV 3'!E116","v":0},{"$f":"'KUMULATIV 3'!F116","v":0},0,0]
[null,{"$f":"'PRORACUN 3'!D117","v":0},{"$f":"'PRORACUN 3'!E117","v":0},{"$f":"'PRORACUN 3'!F117","v":0},0,0,{"$f":"'KUMULATIV 3'!E117","v":0},{"$f":"'KUMULATIV 3'!F117","v":0},0,0]
[null,{"$f":"'PRORACUN 3'!D118","v":0},{"$f":"'PRORACUN 3'!E118","v":0},{"$f":"'PRORACUN 3'!F118","v":0},0,0,{"$f":"'KUMULATIV 3'!E118","v":0},{"$f":"'KUMULATIV 3'!F118","v":64.009880976427226},0,-64.009880976427226]
[null,{"$f":"'PRORACUN 3'!D119","v":0},{"$f":"'PRORACUN 3'!E119","v":0},{"$f":"'PRORACUN 3'!F119","v":0},0,0,{"$f":"'KUMULATIV 3'!E119","v":0},{"$f":"'KUMULATIV 3'!F119","v":0},0,0]
[null,{"$f":"'PRORACUN 3'!D120","v":0},{"$f":"'PRORACUN 3'!E120","v":0},{"$f":"'PRORACUN 3'!F120","v":0},0,0,{"$f":"'KUMULATIV 3'!E120","v":24.317999999999998},{"$f":"'KUMULATIV 3'!F120","v":73.903156411372677},0.3290522513630797,-49.585156411372679]
[null,{"$f":"'PRORACUN 3'!D121","v":0},{"$f":"'PRORACUN 3'!E121","v":0},{"$f":"'PRORACUN 3'!F121","v":0},0,0,{"$f":"'KUMULATIV 3'!E121","v":0},{"$f":"'KUMULATIV 3'!F121","v":67.734716079014404},0,-67.734716079014404]
[null,{"$f":"'PRORACUN 3'!D122","v":0},{"$f":"'PRORACUN 3'!E122","v":0},{"$f":"'PRORACUN 3'!F122","v":0},0,0,{"$f":"'KUMULATIV 3'!E122","v":0},{"$f":"'KUMULATIV 3'!F122","v":8.9504356363397477},0,-8.9504356363397477]
[null,{"$f":"'PRORACUN 3'!D123","v":0},{"$f":"'PRORACUN 3'!E123","v":0},{"$f":"'PRORACUN 3'!F123","v":0},0,0,{"$f":"'KUMULATIV 3'!E123","v":123.068},{"$f":"'KUMULATIV 3'!F123","v":146.95797508568069},0.83743668846993735,-23.889975085680689]
[null,{"$f":"'PRORACUN 3'!D124","v":0},{"$f":"'PRORACUN 3'!E124","v":0},{"$f":"'PRORACUN 3'!F124","v":0},0,0,{"$f":"'KUMULATIV 3'!E124","v":0},{"$f":"'KUMULATIV 3'!F124","v":0},0,0]
[null,{"$f":"'PRORACUN 3'!D125","v":0},{"$f":"'PRORACUN 3'!E125","v":0},{"$f":"'PRORACUN 3'!F125","v":0},0,0,{"$f":"'KUMULATIV 3'!E125","v":13.376000000000001},{"$f":"'KUMULATIV 3'!F125","v":42.019978194760029},0.31832477251661245,-28.643978194760027]
[null,{"$f":"'PRORACUN 3'!D126","v":0},{"$f":"'PRORACUN 3'!E126","v":0},{"$f":"'PRORACUN 3'!F126","v":0},0,0,{"$f":"'KUMULATIV 3'!E126","v":149.04000000000002},{"$f":"'KUMULATIV 3'!F126","v":276.56936983656692},0.53888830888276673,-127.5293698365669]
["Ukupno Smrznuti proizvodi",null,{"$f":"SUM(C29:C48)","v":0},{"$f":"SUM(D29:D48)","v":0},0,0,{"$f":"SUM(G29:G48)","v":520.98},{"$f":"SUM(H29:H48)","v":1533.1323872431624},0.33981409846595984,-1012.1523872431624]
["3. Prerađevine",{"$f":"'PRORACUN 3'!D127","v":0},{"$f":"'PRORACUN 3'!E127","v":0},{"$f":"'PRORACUN 3'!F127","v":0},0,0,{"$f":"'KUMULATIV 3'!E127","v":389.99900000000002},{"$f":"'KUMULATIV 3'!F127","v":345.14260997702445},1.1299647992635902,44.856390022975575]
[null,{"$f":"'PRORACUN 3'!D128","v":0},{"$f":"'PRORACUN 3'!E128","v":0},{"$f":"'PRORACUN 3'!F128","v":0},{"$f":"IFERROR(C51/D51,0)","v":0},{"$f":"IFERROR(C51-D51,0)","v":0},{"$f":"'KUMULATIV 3'!E128","v":238.65300000000002},{"$f":"'KUMULATIV 3'!F128","v":10.358879822768845},{"$f":"IFERROR(G51/H51,0)","v":23.038494903226901},{"$f":"IFERROR(G51-H51,0)","v":228.29412017723118}]
[null,{"$f":"'PRORACUN 3'!D129","v":0},{"$f":"'PRORACUN 3'!E129","v":0},{"$f":"'PRORACUN 3'!F129","v":0},0,0,{"$f":"'KUMULATIV 3'!E129","v":717.71100000000001},{"$f":"'KUMULATIV 3'!F129","v":1189.3982214525672},0.60342363647011898,-471.6872214525672]
[null,{"$f":"'PRORACUN 3'!D130","v":0},{"$f":"'PRORACUN 3'!E130","v":0},{"$f":"'PRORACUN 3'!F130","v":0},0,0,{"$f":"'KUMULATIV 3'!E130","v":390.85},{"$f":"'KUMULATIV 3'!F130","v":322.94262184316216},1.2102769147326029,67.907378156837865]
[null,{"$f":"'PRORACUN 3'!D131","v":0},{"$f":"'PRORACUN 3'!E131","v":0},{"$f":"'PRORACUN 3'!F131","v":0},0,0,{"$f":"'KUMULATIV 3'!E131","v":147.31200000000001},{"$f":"'KUMULATIV 3'!F131","v":84.260218886804182},1.7482983304126005,63.05178111319583]
[null,{"$f":"'PRORACUN 3'!D132","v":0},{"$f":"'PRORACUN 3'!E132","v":0},{"$f":"'PRORACUN 3'!F132","v":0},0,0,{"$f":"'KUMULATIV 3'!E132","v":349.31999999999994},{"$f":"'KUMULATIV 3'!F132","v":361.02331794953034},0.96758293060957778,-11.703317949530401]
[null,{"$f":"'PRORACUN 3'!D133","v":0},{"$f":"'PRORACUN 3'!E133","v":0},{"$f":"'PRORACUN 3'!F133","v":0},0,0,{"$f":"'KUMULATIV 3'!E133","v":0},{"$f":"'KUMULATIV 3'!F133","v":273.86552046809044},0,-273.86552046809044]
[null,{"$f":"'PRORACUN 3'!D134","v":0},{"$f":"'PRORACUN 3'!E134","v":0},{"$f":"'PRORACUN 3'!F134","v":0},0,0,{"$f":"'KUMULATIV 3'!E134","v":35.4},{"$f":"'KUMULATIV 3'!F134","v":47.812591097758869},0.74039074618692458,-12.41259109775887]
[null,{"$f":"'PRORACUN 3'!D135","v":0},{"$f":"'PRORACUN 3'!E135","v":0},{"$f":"'PRORACUN 3'!F135","v":0},0,0,{"$f":"'KUMULATIV 3'!E135","v":0},{"$f":"'KUMULATIV 3'!F135","v":2.1808168047934413},0,-2.1808168047934413]
[null,{"$f":"'PRORACUN 3'!D136","v":0},{"$f":"'PRORACUN 3'!E136","v":0},{"$f":"'PRORACUN 3'!F136","v":0},0,0,{"$f":"'KUMULATIV 3'!E136","v":70.704999999999998},{"$f":"'KUMULATIV 3'!F136","v":117.06551914237701},0.60397801605447465,-46.360519142377015]
[null,{"$f":"'PRORACUN 3'!D137","v":0},{"$f":"'PRORACUN 3'!E137","v":0},{"$f":"'PRORACUN 3'!F137","v":0},0,0,{"$f":"'KUMULATIV 3'!E137","v":60.5},{"$f":"'KUMULATIV 3'!F137","v":174.6972379037183},0.34631343188919589,-114.1972379037183]
[null,{"$f":"'PRORACUN 3'!D138","v":0},{"$f":"'PRORACUN 3'!E138","v":0},{"$f":"'PRORACUN 3'!F138","v":0},0,0,{"$f":"'KUMULATIV 3'!E138","v":17.25},{"$f":"'KUMULATIV 3'!F138","v":25.533730089456544},0.67557696974023063,-8.2837300894565438]
[null,{"$f":"'PRORACUN 3'!D139","v":0},{"$f":"'PRORACUN 3'!E139","v":0},{"$f":"'PRORACUN 3'!F139","v":0},0,0,{"$f":"'KUMULATIV 3'!E139","v":0},{"$f":"'KUMULATIV 3'!F139","v":25.247679618561133},0,-25.247679618561133]
[null,{"$f":"'PRORACUN 3'!D140","v":0},{"$f":"'PRORACUN 3'!E140","v":0},{"$f":"'PRORACUN 3'!F140","v":0},0,0,{"$f":"'KUMULATIV 3'!E140","v":140.14699999999999},{"$f":"'KUMULATIV 3'!F140","v":95.113780654793672},1.4734668208453416,45.033219345206319]
[null,{"$f":"'PRORACUN 3'!D141","v":0},{"$f":"'PRORACUN 3'!E141","v":0},{"$f":"'PRORACUN 3'!F141","v":0},0,0,{"$f":"'KUMULATIV 3'!E141","v":0},{"$f":"'KUMULATIV 3'!F141","v":223.85175827536008},0,-223.85175827536008]
[null,{"$f":"'PRORACUN 3'!D142","v":0},{"$f":"'PRORACUN 3'!E142","v":0},{"$f":"'PRORACUN 3'!F142","v":0},0,0,{"$f":"'KUMULATIV 3'!E142","v":0},{"$f":"'KUMULATIV 3'!F142","v":4.1980723492273739},0,-4.1980723492273739]
[null,{"$f":"'PRORACUN 3'!D143","v":0},{"$f":"'PRORACUN 3'!E143","v":0},{"$f":"'PRORACUN 3'!F143","v":0},0,0,{"$f":"'KUMULATIV 3'!E143","v":0},{"$f":"'KUMULATIV 3'!F143","v":0},0,0]
[null,{"$f":"'PRORACUN 3'!D144","v":0},{"$f":"'PRORACUN 3'!E144","v":0},{"$f":"'PRORACUN 3'!F144","v":0},0,0,{"$f":"'KUMULATIV 3'!E144","v":0},{"$f":"'KUMULATIV 3'!F144","v":85.670480420570627},0,-85.670480420570627]
[null,{"$f":"'PRORACUN 3'!D145","v":0},{"$f":"'PRORACUN 3'!E145","v":0},{"$f":"'PRORACUN 3'!F145","v":0},0,0,{"$f":"'KUMULATIV 3'!E145","v":65.194000000000003},{"$f":"'KUMULATIV 3'!F145","v":95.563028916581175},0.68220943537598744,-30.369028916581172]
[null,{"$f":"'PRORACUN 3'!D146","v":0},{"$f":"'PRORACUN 3'!E146","v":0},{"$f":"'PRORACUN 3'!F146","v":0},0,0,{"$f":"'KUMULATIV 3'!E146","v":42},{"$f":"'KUMULATIV 3'!F146","v":43.779897356228332},0.95934441458951669,-1.7798973562283322]
["Ukupno Prerađevine",null,{"$f":"SUM(C50:C69)","v":0},{"$f":"SUM(D50:D69)","v":0},0,0,{"$f":"SUM(G50:G69)","v":2665.0410000000002},{"$f":"SUM(H50:H69)","v":3527.7059830293742},0.75546006748312655,-862.66498302937407]

{"sheet":"RAZRADA GRUPA NI","index":15,"n_rows":70,"n_cols":10,"rows_kept":70,"cut":false,"hidden":false,"merged":[[2,3,2,4],[2,6,2,7],[0,1,0,8]]}
[{"$f":"'RAZRADA UKUPNO'!A1","v":"VINDIJA"},{"$f":"'RAZRADA UKUPNO'!B1:I1","v":"Dnevna prodaja od 08.08. i kumulativ dnevnog plana i prodaje za 01.- 08.08.2013"}]
[]
[null,null,null,{"$f":"'RAZRADA UKUPNO'!D3:E3","v":"Izvještaj za "},null,null,{"$f":"'RAZRADA UKUPNO'!G3:H3","v":"Kolovoz/Avgust"}]
[null,null,null,{"$f":"'RAZRADA UKUPNO'!D4","v":6},{"$f":"'RAZRADA UKUPNO'!E4","v":"dana +"},null,{"$f":"'RAZRADA UKUPNO'!G4","v":22},{"$f":"'RAZRADA UKUPNO'!H4","v":"dana +"}]
["KC NIŠ",null,null,{"$f":"'RAZRADA UKUPNO'!D5","v":1},{"$f":"'RAZRADA UKUPNO'!E5","v":"subota"},null,{"$f":"'RAZRADA UKUPNO'!G5","v":5},{"$f":"'RAZRADA UKUPNO'!H5","v":"subota"}]
[]
["GRUPA PROIZVODA","KUPAC","1:Dnevna prodaja","2:Dnevni plan","IND. prodaja / plan","Razlika 1-2","3: Kum. prodaje 2013","4: Kum. plana 2013","IND. kum. prod 2013 / kum. plana 2013","Razlika 3-4"]
["1. Sveži proizvodi",{"$f":"'PRORACUN 3'!D171","v":0},{"$f":"'PRORACUN 3'!E171","v":0},{"$f":"'PRORACUN 3'!F171","v":0},{"$f":"IFERROR(C8/D8,0)","v":0},{"$f":"IFERROR(C8-D8,0)","v":0},{"$f":"'KUMULATIV 3'!E171","v":183.41000000000003},{"$f":"'KUMULATIV 3'!F171","v":5312.8679379772329},{"$f":"IFERROR(G8/H8,0)","v":3.4521844348690829E-2},{"$f":"IFERROR(G8-H8,0)","v":-5129.4579379772331}]
[null,{"$f":"'PRORACUN 3'!D172","v":0},{"$f":"'PRORACUN 3'!E172","v":0},{"$f":"'PRORACUN 3'!F172","v":0},{"$f":"IFERROR(C9/D9,0)","v":0},{"$f":"IFERROR(C9-D9,0)","v":0},{"$f":"'KUMULATIV 3'!E172","v":1409.7190000000001},{"$f":"'KUMULATIV 3'!F172","v":7205.9060621780154},{"$f":"IFERROR(G9/H9,0)","v":0.1956338297829415},{"$f":"IFERROR(G9-H9,0)","v":-5796.1870621780154}]
[null,{"$f":"'PRORACUN 3'!D173","v":0},{"$f":"'PRORACUN 3'!E173","v":0},{"$f":"'PRORACUN 3'!F173","v":0},0,0,{"$f":"'KUMULATIV 3'!E173","v":12889.468000000001},{"$f":"'KUMULATIV 3'!F173","v":6535.3971816206122},1.9722547294063222,6354.0708183793886]
[null,{"$f":"'PRORACUN 3'!D174","v":0},{"$f":"'PRORACUN 3'!E174","v":0},{"$f":"'PRORACUN 3'!F174","v":0},0,0,{"$f":"'KUMULATIV 3'!E174","v":28.513000000000002},{"$f":"'KUMULATIV 3'!F174","v":151.58045911315358},0.18810472119440724,-123.06745911315357]
[null,{"$f":"'PRORACUN 3'!D175","v":0},{"$f":"'PRORACUN 3'!E175","v":0},{"$f":"'PRORACUN 3'!F175","v":0},0,0,{"$f":"'KUMULATIV 3'!E175","v":157.21},{"$f":"'KUMULATIV 3'!F175","v":2355.9833212575068},6.6727976629346056E-2,-2198.7733212575067]
[null,{"$f":"'PRORACUN 3'!D176","v":0},{"$f":"'PRORACUN 3'!E176","v":0},{"$f":"'PRORACUN 3'!F176","v":0},0,0,{"$f":"'KUMULATIV 3'!E176","v":0},{"$f":"'KUMULATIV 3'!F176","v":2821.804017965324},0,-2821.804017965324]
[null,{"$f":"'PRORACUN 3'!D177","v":0},{"$f":"'PRORACUN 3'!E177","v":0},{"$f":"'PRORACUN 3'!F177","v":0},0,0,{"$f":"'KUMULATIV 3'!E177","v":331.54700000000003},{"$f":"'KUMULATIV 3'!F177","v":2744.5075133131159},0.12080382305084783,-2412.9605133131158]
[null,{"$f":"'PRORACUN 3'!D178","v":0},{"$f":"'PRORACUN 3'!E178","v":0},{"$f":"'PRORACUN 3'!F178","v":0},0,0,{"$f":"'KUMULATIV 3'!E178","v":0},{"$f":"'KUMULATIV 3'!F178","v":2012.4578168376274},0,-2012.4578168376274]
[null,{"$f":"'PRORACUN 3'!D179","v":0},{"$f":"'PRORACUN 3'!E179","v":0},{"$f":"'PRORACUN 3'!F179","v":0},0,0,{"$f":"'KUMULATIV 3'!E179","v":37.691000000000003},{"$f":"'KUMULATIV 3'!F179","v":696.22314826135118},5.4136378679916282E-2,-658.53214826135115]
[null,{"$f":"'PRORACUN 3'!D180","v":0},{"$f":"'PRORACUN 3'!E180","v":0},{"$f":"'PRORACUN 3'!F180","v":0},0,0,{"$f":"'KUMULATIV 3'!E180","v":323.89599999999996},{"$f":"'KUMULATIV 3'!F180","v":1722.0823050777867},0.18808392551560973,-1398.1863050777868]
[null,{"$f":"'PRORACUN 3'!D181","v":0},{"$f":"'PRORACUN 3'!E181","v":0},{"$f":"'PRORACUN 3'!F181","v":0},0,0,{"$f":"'KUMULATIV 3'!E181","v":247.53699999999998},{"$f":"'KUMULATIV 3'!F181","v":1453.0597798138849},0.1703556890355232,-1205.5227798138849]
[null,{"$f":"'PRORACUN 3'!D182","v":0},{"$f":"'PRORACUN 3'!E182","v":0},{"$f":"'PRORACUN 3'!F182","v":0},0,0,{"$f":"'KUMULATIV 3'!E182","v":0},{"$f":"'KUMULATIV 3'!F182","v":0},0,0]
[null,{"$f":"'PRORACUN 3'!D183","v":0},{"$f":"'PRORACUN 3'!E183","v":0},{"$f":"'PRORACUN 3'!F183","v":0},0,0,{"$f":"'KUMULATIV 3'!E183","v":82.230999999999995},{"$f":"'KUMULATIV 3'!F183","v":1131.3342772031899},7.2684971769162748E-2,-1049.1032772031899]
[null,{"$f":"'PRORACUN 3'!D184","v":0},{"$f":"'PRORACUN 3'!E184","v":0},{"$f":"'PRORACUN 3'!F184","v":0},0,0,{"$f":"'KUMULATIV 3'!E184","v":0},{"$f":"'KUMULATIV 3'!F184","v":0},0,0]
[null,{"$f":"'PRORACUN 3'!D185","v":0},{"$f":"'PRORACUN 3'!E185","v":0},{"$f":"'PRORACUN 3'!F185","v":0},0,0,{"$f":"'KUMULATIV 3'!E185","v":0},{"$f":"'KUMULATIV 3'!F185","v":1441.076183049684},0,-1441.076183049684]
[null,{"$f":"'PRORACUN 3'!D186","v":0},{"$f":"'PRORACUN 3'!E186","v":0},{"$f":"'PRORACUN 3'!F186","v":0},0,0,{"$f":"'KUMULATIV 3'!E186","v":0},{"$f":"'KUMULATIV 3'!F186","v":0},0,0]
[null,{"$f":"'PRORACUN 3'!D187","v":0},{"$f":"'PRORACUN 3'!E187","v":0},{"$f":"'PRORACUN 3'!F187","v":0},0,0,{"$f":"'KUMULATIV 3'!E187","v":0},{"$f":"'KUMULATIV 3'!F187","v":474.37931081410147},0,-474.37931081410147]
[null,{"$f":"'PRORACUN 3'!D188","v":0},{"$f":"'PRORACUN 3'!E188","v":0},{"$f":"'PRORACUN 3'!F188","v":0},0,0,{"$f":"'KUMULATIV 3'!E188","v":222.98500000000001},{"$f":"'KUMULATIV 3'!F188","v":724.2583092248874},0.30788048567732978,-501.27330922488738]
[null,{"$f":"'PRORACUN 3'!D189","v":0},{"$f":"'PRORACUN 3'!E189","v":0},{"$f":"'PRORACUN 3'!F189","v":0},0,0,{"$f":"'KUMULATIV 3'!E189","v":0},{"$f":"'KUMULATIV 3'!F189","v":0},0,0]
[null,{"$f":"'PRORACUN 3'!D190","v":0},{"$f":"'PRORACUN 3'!E190","v":0},{"$f":"'PRORACUN 3'!F190","v":0},0,0,{"$f":"'KUMULATIV 3'!E190","v":136.54400000000001},{"$f":"'KUMULATIV 3'!F190","v":869.9904247269526},0.15694885382543663,-733.44642472695261]
["Ukupno Sveži proizvodi",null,{"$f":"SUM(C8:C27)","v":0},{"$f":"SUM(D8:D27)","v":0},{"$f":"IFERROR(C28/D28,0)","v":0},{"$f":"IFERROR(C28-D28,0)","v":0},{"$f":"SUM(G8:G27)","v":16050.751000000004},{"$f":"SUM(H8:H27)","v":37652.90804843443},{"$f":"IFERROR(G28/H28,0)","v":0.42628184201213054},{"$f":"IFERROR(G28-H28,0)","v":-21602.157048434427}]
["2. Smrznuti proizvodi",{"$f":"'PRORACUN 3'!D191","v":0},{"$f":"'PRORACUN 3'!E191","v":0},{"$f":"'PRORACUN 3'!F191","v":0},0,{"$f":"IFERROR(C29-D29,0)","v":0},{"$f":"'KUMULATIV 3'!E191","v":60},{"$f":"'KUMULATIV 3'!F191","v":150.37390202124709},0.39900540714519928,-90.37390202124709]
[null,{"$f":"'PRORACUN 3'!D192","v":0},{"$f":"'PRORACUN 3'!E192","v":0},{"$f":"'PRORACUN 3'!F192","v":0},{"$f":"IFERROR(C30/D30,0)","v":0},{"$f":"IFERROR(C30-D30,0)","v":0},{"$f":"'KUMULATIV 3'!E192","v":0},{"$f":"'KUMULATIV 3'!F192","v":0},{"$f":"IFERROR(G30/H30,0)","v":0},{"$f":"IFERROR(G30-H30,0)","v":0}]
[null,{"$f":"'PRORACUN 3'!D193","v":0},{"$f":"'PRORACUN 3'!E193","v":0},{"$f":"'PRORACUN 3'!F193","v":0},0,0,{"$f":"'KUMULATIV 3'!E193","v":0},{"$f":"'KUMULATIV 3'!F193","v":0},0,0]
[null,{"$f":"'PRORACUN 3'!D194","v":0},{"$f":"'PRORACUN 3'!E194","v":0},{"$f":"'PRORACUN 3'!F194","v":0},0,0,{"$f":"'KUMULATIV 3'!E194","v":231.72599999999997},{"$f":"'KUMULATIV 3'!F194","v":1121.2950049246717},0.2066592636034861,-889.56900492467173]
[null,{"$f":"'PRORACUN 3'!D195","v":0},{"$f":"'PRORACUN 3'!E195","v":0},{"$f":"'PRORACUN 3'!F195","v":0},0,0,{"$f":"'KUMULATIV 3'!E195","v":40.267000000000003},{"$f":"'KUMULATIV 3'!F195","v":969.15609688150676},4.1548518478673122E-2,-928.8890968815067]
[null,{"$f":"'PRORACUN 3'!D196","v":0},{"$f":"'PRORACUN 3'!E196","v":0},{"$f":"'PRORACUN 3'!F196","v":0},0,0,{"$f":"'KUMULATIV 3'!E196","v":0},{"$f":"'KUMULATIV 3'!F196","v":0},0,0]
[null,{"$f":"'PRORACUN 3'!D197","v":0},{"$f":"'PRORACUN 3'!E197","v":0},{"$f":"'PRORACUN 3'!F197","v":0},0,0,{"$f":"'KUMULATIV 3'!E197","v":0},{"$f":"'KUMULATIV 3'!F197","v":0},0,0]
[null,{"$f":"'PRORACUN 3'!D198","v":0},{"$f":"'PRORACUN 3'!E198","v":0},{"$f":"'PRORACUN 3'!F198","v":0},0,0,{"$f":"'KUMULATIV 3'!E198","v":0},{"$f":"'KUMULATIV 3'!F198","v":806.01728193250892},0,-806.01728193250892]
[null,{"$f":"'PRORACUN 3'!D199","v":0},{"$f":"'PRORACUN 3'!E199","v":0},{"$f":"'PRORACUN 3'!F199","v":0},0,0,{"$f":"'KUMULATIV 3'!E199","v":183.92600000000002},{"$f":"'KUMULATIV 3'!F199","v":237.41252264058767},0.77471060900372368,-53.486522640587651]
[null,{"$f":"'PRORACUN 3'!D200","v":0},{"$f":"'PRORACUN 3'!E200","v":0},{"$f":"'PRORACUN 3'!F200","v":0},0,0,{"$f":"'KUMULATIV 3'!E200","v":156.01800000000003},{"$f":"'KUMULATIV 3'!F200","v":282.71989420323189},0.55184655625205914,-126.70189420323186]
[null,{"$f":"'PRORACUN 3'!D201","v":0},{"$f":"'PRORACUN 3'!E201","v":0},{"$f":"'PRORACUN 3'!F201","v":0},0,0,{"$f":"'KUMULATIV 3'!E201","v":0},{"$f":"'KUMULATIV 3'!F201","v":24.38474937974226},0,-24.38474937974226]
[null,{"$f":"'PRORACUN 3'!D202","v":0},{"$f":"'PRORACUN 3'!E202","v":0},{"$f":"'PRORACUN 3'!F202","v":0},0,0,{"$f":"'KUMULATIV 3'!E202","v":0},{"$f":"'KUMULATIV 3'!F202","v":337.56700803819064},0,-337.56700803819064]
[null,{"$f":"'PRORACUN 3'!D203","v":0},{"$f":"'PRORACUN 3'!E203","v":0},{"$f":"'PRORACUN 3'!F203","v":0},0,0,{"$f":"'KUMULATIV 3'!E203","v":79.078000000000003},{"$f":"'KUMULATIV 3'!F203","v":324.26798225765361},0.24386619810390961,-245.18998225765361]
[null,{"$f":"'PRORACUN 3'!D204","v":0},{"$f":"'PRORACUN 3'!E204","v":0},{"$f":"'PRORACUN 3'!F204","v":0},0,0,{"$f":"'KUMULATIV 3'!E204","v":83.097000000000008},{"$f":"'KUMULATIV 3'!F204","v":604.9013780503592},0.13737280656861395,-521.80437805035922]
[null,{"$f":"'PRORACUN 3'!D205","v":0},{"$f":"'PRORACUN 3'!E205","v":0},{"$f":"'PRORACUN 3'!F205","v":0},0,0,{"$f":"'KUMULATIV 3'!E205","v":0},{"$f":"'KUMULATIV 3'!F205","v":0},0,0]
[null,{"$f":"'PRORACUN 3'!D206","v":0},{"$f":"'PRORACUN 3'!E206","v":0},{"$f":"'PRORACUN 3'!F206","v":0},0,0,{"$f":"'KUMULATIV 3'!E206","v":464.76000000000005},{"$f":"'KUMULATIV 3'!F206","v":1285.8517165835854},0.36144136528808596,-821.09171658358537]
[null,{"$f":"'PRORACUN 3'!D207","v":0},{"$f":"'PRORACUN 3'!E207","v":0},{"$f":"'PRORACUN 3'!F207","v":0},0,0,{"$f":"'KUMULATIV 3'!E207","v":21},{"$f":"'KUMULATIV 3'!F207","v":0},0,21]
[null,{"$f":"'PRORACUN 3'!D208","v":0},{"$f":"'PRORACUN 3'!E208","v":0},{"$f":"'PRORACUN 3'!F208","v":0},0,0,{"$f":"'KUMULATIV 3'!E208","v":21.606000000000002},{"$f":"'KUMULATIV 3'!F208","v":22.467322663623225},0.96166331536165683,-0.86132266362322341]
[null,{"$f":"'PRORACUN 3'!D209","v":0},{"$f":"'PRORACUN 3'!E209","v":0},{"$f":"'PRORACUN 3'!F209","v":0},0,0,{"$f":"'KUMULATIV 3'!E209","v":430.34800000000001},{"$f":"'KUMULATIV 3'!F209","v":1070.3659995229855},0.4020568667089453,-640.01799952298552]
[null,{"$f":"'PRORACUN 3'!D210","v":0},{"$f":"'PRORACUN 3'!E210","v":0},{"$f":"'PRORACUN 3'!F210","v":0},0,0,{"$f":"'KUMULATIV 3'!E210","v":0},{"$f":"'KUMULATIV 3'!F210","v":23.484314522406475},0,-23.484314522406475]
["Ukupno Smrznuti proizvodi",null,{"$f":"SUM(C29:C48)","v":0},{"$f":"SUM(D29:D48)","v":0},0,0,{"$f":"SUM(G29:G48)","v":1771.826},{"$f":"SUM(H29:H48)","v":7260.2651736223006},0.24404425425634949,-5488.4391736223006]
["3. Prerađevine",{"$f":"'PRORACUN 3'!D211","v":0},{"$f":"'PRORACUN 3'!E211","v":0},{"$f":"'PRORACUN 3'!F211","v":0},0,0,{"$f":"'KUMULATIV 3'!E211","v":474.298},{"$f":"'KUMULATIV 3'!F211","v":2490.285165540703},0.19045931227599713,-2015.987165540703]
[null,{"$f":"'PRORACUN 3'!D212","v":0},{"$f":"'PRORACUN 3'!E212","v":0},{"$f":"'PRORACUN 3'!F212","v":0},{"$f":"IFERROR(C51/D51,0)","v":0},{"$f":"IFERROR(C51-D51,0)","v":0},{"$f":"'KUMULATIV 3'!E212","v":376.71000000000004},{"$f":"'KUMULATIV 3'!F212","v":194.3389467979911},{"$f":"IFERROR(G51/H51,0)","v":1.9384174207323333},{"$f":"IFERROR(G51-H51,0)","v":182.37105320200894}]
[null,{"$f":"'PRORACUN 3'!D213","v":0},{"$f":"'PRORACUN 3'!E213","v":0},{"$f":"'PRORACUN 3'!F213","v":0},0,0,{"$f":"'KUMULATIV 3'!E213","v":0},{"$f":"'KUMULATIV 3'!F213","v":0},0,0]
[null,{"$f":"'PRORACUN 3'!D214","v":0},{"$f":"'PRORACUN 3'!E214","v":0},{"$f":"'PRORACUN 3'!F214","v":0},0,0,{"$f":"'KUMULATIV 3'!E214","v":1844.9289999999994},{"$f":"'KUMULATIV 3'!F214","v":4459.9550352315891},0.41366538124844549,-2615.02603523159]
[null,{"$f":"'PRORACUN 3'!D215","v":0},{"$f":"'PRORACUN 3'!E215","v":0},{"$f":"'PRORACUN 3'!F215","v":0},0,0,{"$f":"'KUMULATIV 3'!E215","v":104.4},{"$f":"'KUMULATIV 3'!F215","v":405.70802426900735},0.25732791503965152,-301.30802426900732]
[null,{"$f":"'PRORACUN 3'!D216","v":0},{"$f":"'PRORACUN 3'!E216","v":0},{"$f":"'PRORACUN 3'!F216","v":0},0,0,{"$f":"'KUMULATIV 3'!E216","v":0},{"$f":"'KUMULATIV 3'!F216","v":473.22142587664575},0,-473.22142587664575]
[null,{"$f":"'PRORACUN 3'!D217","v":0},{"$f":"'PRORACUN 3'!E217","v":0},{"$f":"'PRORACUN 3'!F217","v":0},0,0,{"$f":"'KUMULATIV 3'!E217","v":42.55},{"$f":"'KUMULATIV 3'!F217","v":402.21643761026291},0.10578881423346954,-359.6664376102629]
[null,{"$f":"'PRORACUN 3'!D218","v":0},{"$f":"'PRORACUN 3'!E218","v":0},{"$f":"'PRORACUN 3'!F218","v":0},0,0,{"$f":"'KUMULATIV 3'!E218","v":0},{"$f":"'KUMULATIV 3'!F218","v":0},0,0]
[null,{"$f":"'PRORACUN 3'!D219","v":0},{"$f":"'PRORACUN 3'!E219","v":0},{"$f":"'PRORACUN 3'!F219","v":0},0,0,{"$f":"'KUMULATIV 3'!E219","v":535.1400000000001},{"$f":"'KUMULATIV 3'!F219","v":1625.5359633403759},0.32920834239823304,-1090.3959633403758]
[null,{"$f":"'PRORACUN 3'!D220","v":0},{"$f":"'PRORACUN 3'!E220","v":0},{"$f":"'PRORACUN 3'!F220","v":0},0,0,{"$f":"'KUMULATIV 3'!E220","v":158.23500000000001},{"$f":"'KUMULATIV 3'!F220","v":469.29563236635511},0.33717552239325771,-311.06063236635509]
[null,{"$f":"'PRORACUN 3'!D221","v":0},{"$f":"'PRORACUN 3'!E221","v":0},{"$f":"'PRORACUN 3'!F221","v":0},0,0,{"$f":"'KUMULATIV 3'!E221","v":169.9},{"$f":"'KUMULATIV 3'!F221","v":741.35376305256966},0.22917533904518986,-571.45376305256968]
[null,{"$f":"'PRORACUN 3'!D222","v":0},{"$f":"'PRORACUN 3'!E222","v":0},{"$f":"'PRORACUN 3'!F222","v":0},0,0,{"$f":"'KUMULATIV 3'!E222","v":858},{"$f":"'KUMULATIV 3'!F222","v":1772.8832258624989},0.48395742454079976,-914.88322586249888]
[null,{"$f":"'PRORACUN 3'!D223","v":0},{"$f":"'PRORACUN 3'!E223","v":0},{"$f":"'PRORACUN 3'!F223","v":0},0,0,{"$f":"'KUMULATIV 3'!E223","v":59.2},{"$f":"'KUMULATIV 3'!F223","v":403.36279493219115},0.14676613892947674,-344.16279493219116]
[null,{"$f":"'PRORACUN 3'!D224","v":0},{"$f":"'PRORACUN 3'!E224","v":0},{"$f":"'PRORACUN 3'!F224","v":0},0,0,{"$f":"'KUMULATIV 3'!E224","v":551.78399999999999},{"$f":"'KUMULATIV 3'!F224","v":1137.3427265854975},0.48515191340481195,-585.55872658549754]
[null,{"$f":"'PRORACUN 3'!D225","v":0},{"$f":"'PRORACUN 3'!E225","v":0},{"$f":"'PRORACUN 3'!F225","v":0},0,0,{"$f":"'KUMULATIV 3'!E225","v":0},{"$f":"'KUMULATIV 3'!F225","v":0},0,0]
[null,{"$f":"'PRORACUN 3'!D226","v":0},{"$f":"'PRORACUN 3'!E226","v":0},{"$f":"'PRORACUN 3'!F226","v":0},0,0,{"$f":"'KUMULATIV 3'!E226","v":0},{"$f":"'KUMULATIV 3'!F226","v":0},0,0]
[null,{"$f":"'PRORACUN 3'!D227","v":0},{"$f":"'PRORACUN 3'!E227","v":0},{"$f":"'PRORACUN 3'!F227","v":0},0,0,{"$f":"'KUMULATIV 3'!E227","v":271.25400000000002},{"$f":"'KUMULATIV 3'!F227","v":792.85658753830546},0.34212240178542358,-521.60258753830544]
[null,{"$f":"'PRORACUN 3'!D228","v":0},{"$f":"'PRORACUN 3'!E228","v":0},{"$f":"'PRORACUN 3'!F228","v":0},0,0,{"$f":"'KUMULATIV 3'!E228","v":66.099999999999994},{"$f":"'KUMULATIV 3'!F228","v":438.17747467222546},0.15085211773938284,-372.07747467222543]
[null,{"$f":"'PRORACUN 3'!D229","v":0},{"$f":"'PRORACUN 3'!E229","v":0},{"$f":"'PRORACUN 3'!F229","v":0},0,0,{"$f":"'KUMULATIV 3'!E229","v":0},{"$f":"'KUMULATIV 3'!F229","v":0},0,0]
[null,{"$f":"'PRORACUN 3'!D230","v":0},{"$f":"'PRORACUN 3'!E230","v":0},{"$f":"'PRORACUN 3'!F230","v":0},0,0,{"$f":"'KUMULATIV 3'!E230","v":0},{"$f":"'KUMULATIV 3'!F230","v":13.448884782398036},0,-13.448884782398036]
["Ukupno Prerađevine",null,{"$f":"SUM(C50:C69)","v":0},{"$f":"SUM(D50:D69)","v":0},0,0,{"$f":"SUM(G50:G69)","v":5512.5},{"$f":"SUM(H50:H69)","v":15819.982088458613},0.348451721953694,-10307.482088458613]