{"text_format":"1","workbook":"xlsx","n_sheets":4,"sheets":["ulaz-izlaz","stanje","cijene","istorija"],"not_rendered":{"charts":0,"images":0,"macros":1,"external_links":0,"defined_names":0,"comments":0,"pivot_tables":1},"unopened":[],"bounds":{"document_bytes":16777216,"sheet_cells":100000,"rows_first":2000,"rows_last":500,"rows_between":2000,"halvings":0,"cell_chars":16384,"cell_head_chars":4096},"cells_cut":0,"cells_raw":0,"read":"whole","date_system":"1900"}

{"sheet":"ulaz-izlaz","index":0,"n_rows":12,"n_cols":6,"rows_kept":12,"cut":false,"hidden":false,"merged":[]}
["Datum","Proizvod ","Skladište","Ulaz/Izlaz","Količina","Pomoćni red"]
["2012-04-25","Proizvod 1","Skladište 1","Izlaz",8,{"$f":"IF(D2=\"Ulaz\",E2,-E2)","v":-8}]
["2012-05-23","Proizvod 1","Skladište 1","Ulaz",10,10]
["2012-05-27","Proizvod 2","Skladište 1","Ulaz",15,15]
["2012-05-30","Proizvod 2","Skladište 1","Izlaz",2,-2]
["2012-05-29","Proizvod 3","Skladište 1","Izlaz",12,-12]
["2012-06-05","Proizvod 3","Skladište 1","Ulaz",23,23]
["2012-06-15","Proizvod 1","Skladište 2","Ulaz",3,3]
["2012-05-13","Proizvod 2","Skladište 2","Ulaz",17,17]
["2012-05-14","Proizvod 2","Skladište 2","Izlaz",12,-12]
["2012-03-31","Proizvod 3","Skladište 2","Ulaz",14,14]
["2012-05-13","Proizvod 3","Skladište 2","Izlaz",7,-7]

{"sheet":"stanje","index":1,"n_rows":21,"n_cols":4,"rows_kept":21,"cut":false,"hidden":false,"merged":[[0,0,0,3]]}
[{"$f":"CONCATENATE(\"Vrijednost robe na dan \",TEXT(cijene!B1, \"dd.mm.yyy\"))","v":"Vrijednost robe na dan 22.06.2012"}]
[]
["Ukupna vrijednost",{"$f":"SUM(OFFSET(D7,0,0,COUNTA(D7:D100),1))","v":98.240000000000009}]
["Skladište","Skladište 2"]
[]
["Proizvod","Količine","Cijena","Ukupna vrijednost"]
["Proizvod 1",3,{"$f":"IF(A7=\"\",\"\",INDEX(cijene!$A$4:$B$6,MATCH(stanje!A7,cijene!$A$4:$A$6,0),2))","v":5.03},{"$f":"IF(A7=\"\",\"\",B7*C7)","v":15.09}]
["Proizvod 2",5,{"$f":"IF(A8=\"\",\"\",INDEX(cijene!$A$4:$B$6,MATCH(stanje!A8,cijene!$A$4:$A$6,0),2))","v":6.48},{"$f":"IF(A8=\"\",\"\",B8*C8)","v":32.400000000000006}]
["Proizvod 3",7,{"$f":"IF(A9=\"\",\"\",INDEX(cijene!$A$4:$B$6,MATCH(stanje!A9,cijene!$A$4:$A$6,0),2))","v":7.25},50.75]
[null,null,{"$f":"IF(A10=\"\",\"\",INDEX(cijene!$A$4:$B$6,MATCH(stanje!A10,cijene!$A$4:$A$6,0),2))","v":""},""]
[null,null,{"$f":"IF(A11=\"\",\"\",INDEX(cijene!$A$4:$B$6,MATCH(stanje!A11,cijene!$A$4:$A$6,0),2))","v":""},""]
[null,null,{"$f":"IF(A12=\"\",\"\",INDEX(cijene!$A$4:$B$6,MATCH(stanje!A12,cijene!$A$4:$A$6,0),2))","v":""},""]
[null,null,{"$f":"IF(A13=\"\",\"\",INDEX(cijene!$A$4:$B$6,MATCH(stanje!A13,cijene!$A$4:$A$6,0),2))","v":""},""]
[null,null,{"$f":"IF(A14=\"\",\"\",INDEX(cijene!$A$4:$B$6,MATCH(stanje!A14,cijene!$A$4:$A$6,0),2))","v":""},""]
[null,null,{"$f":"IF(A15=\"\",\"\",INDEX(cijene!$A$4:$B$6,MATCH(stanje!A15,cijene!$A$4:$A$6,0),2))","v":""},""]
[null,null,{"$f":"IF(A16=\"\",\"\",INDEX(cijene!$A$4:$B$6,MATCH(stanje!A16,cijene!$A$4:$A$6,0),2))","v":""},""]
[null,null,{"$f":"IF(A17=\"\",\"\",INDEX(cijene!$A$4:$B$6,MATCH(stanje!A17,cijene!$A$4:$A$6,0),2))","v":""},""]
[null,null,{"$f":"IF(A18=\"\",\"\",INDEX(cijene!$A$4:$B$6,MATCH(stanje!A18,cijene!$A$4:$A$6,0),2))","v":""},""]
[null,null,{"$f":"IF(A19=\"\",\"\",INDEX(cijene!$A$4:$B$6,MATCH(stanje!A19,cijene!$A$4:$A$6,0),2))","v":""},""]
[null,null,{"$f":"IF(A20=\"\",\"\",INDEX(cijene!$A$4:$B$6,MATCH(stanje!A20,cijene!$A$4:$A$6,0),2))","v":""},""]
[null,null,{"$f":"IF(A21=\"\",\"\",INDEX(cijene!$A$4:$B$6,MATCH(stanje!A21,cijene!$A$4:$A$6,0),2))","v":""}]

{"sheet":"cijene","index":2,"n_rows":6,"n_cols":2,"rows_kept":6,"cut":false,"hidden":false,"merged":[]}
["Cijene na ","2012-06-22"]
[]
["Proizvod","Cijena"]
["Proizvod 1",5.03]
["Proizvod 2",6.48]
["Proizvod 3",7.25]

{"sheet":"istorija","index":3,"n_rows":5,"n_cols":3,"rows_kept":5,"cut":false,"hidden":false,"merged":[]}
["Datum","Skladište1","Skladište 2"]
[]
["2012-06-22",174.05,98.240000000000009]
["2012-06-21",169.43,95.91]
["2012-06-20",168.39,96]