{"text_format":"1","workbook":"xlsx","n_sheets":3,"sheets":["Presmetka","Formuli","Sliki"],"not_rendered":{"charts":0,"images":6,"macros":1,"external_links":0,"defined_names":4,"comments":0,"pivot_tables":0},"unopened":[],"bounds":{"document_bytes":16777216,"sheet_cells":100000,"rows_first":2000,"rows_last":500,"rows_between":2000,"halvings":0,"cell_chars":16384,"cell_head_chars":4096},"cells_cut":0,"cells_raw":0,"read":"whole","date_system":"1900"}

{"sheet":"Presmetka","index":0,"n_rows":19,"n_cols":17,"rows_kept":19,"cut":false,"hidden":false,"merged":[[13,7,13,8],[14,7,14,8],[14,2,14,4],[15,2,15,4],[16,2,16,4],[6,1,6,4],[5,16,11,16],[6,13,6,15],[7,0,10,0],[7,1,7,4],[9,1,10,1],[9,2,10,2],[9,4,10,4],[9,13,9,15],[5,0,6,0]]}
[]
[]
[]
[]
[]
["Br.",0,null,null,null,null,null,null,null,null,null,null,null,null,null,0,"ROPLASTO"]
[null,"Tip na prozor",null,null,null,null,{"$f":"IF(B8<>\"\",VLOOKUP(B8,podatoci1,3,FALSE),\"\")","v":"Kasa"},{"$f":"IF(B8<>\"\",VLOOKUP(B8,podatoci1,4,FALSE),\"\")","v":"Krilo"},{"$f":"IF(B8<>\"\",VLOOKUP(B8,podatoci1,5,FALSE),\"\")","v":0},{"$f":"IF(B8<>\"\",VLOOKUP(B8,podatoci1,6,FALSE),\"\")","v":"T Pre."},{"$f":"IF(B8<>\"\",VLOOKUP(B8,podatoci1,7,FALSE),\"\")","v":"`.Kasa"},{"$f":"IF(B8<>\"\",VLOOKUP(B8,podatoci1,8,FALSE),\"\")","v":"`.Krilo"},{"$f":"IF(B8<>\"\",VLOOKUP(B8,podatoci1,9,FALSE),\"\")","v":0},{"$f":"IF(B8<>\"\",VLOOKUP(B8,podatoci1,10,FALSE),\"\")","v":"Staklo "}]
["PVC","Prozor so 1 krilo + fiksno ",null,null,null,null,{"$f":"IF(B8<>\"\",VLOOKUP(B8,Presmetka,2,FALSE),\"\")","v":2006},{"$f":"IF(B8<>\"\",VLOOKUP(B8,Presmetka,6,FALSE),\"\")","v":-76},{"$f":"IF(B8<>\"\",VLOOKUP(B8,Presmetka,10,FALSE),\"\")","v":0},{"$f":"IF(B8<>\"\",VLOOKUP(B8,Presmetka,14,FALSE),\"\")","v":1350},{"$f":"IF(B8<>\"\",VLOOKUP(B8,Presmetka,15,FALSE),\"\")","v":1850},{"$f":"IF(B8<>\"\",VLOOKUP(B8,Presmetka,19,FALSE),\"\")","v":-161},{"$f":"IF(B8<>\"\",VLOOKUP(B8,Presmetka,23,FALSE),\"\")","v":0},{"$f":"IF(B8<>\"\",VLOOKUP(B8,Presmetka,27,FALSE),\"\")","v":-136},"x",{"$f":"IF(B8<>\"\",VLOOKUP(B8,Presmetka,28,FALSE),\"\")","v":1232}]
[null,"[irina","Visina",null,{"$f":"IF(B8<>\"\",VLOOKUP(B8,podatoci1,2,FALSE),\"\")","v":"Krilo"},null,{"$f":"IF(B8<>\"\",VLOOKUP(B8,Presmetka,3,FALSE),\"\")","v":2006},{"$f":"IF(B8<>\"\",VLOOKUP(B8,Presmetka,7,FALSE),\"\")","v":-76},{"$f":"IF(B8<>\"\",VLOOKUP(B8,Presmetka,11,FALSE),\"\")","v":0},null,{"$f":"IF(B8<>\"\",VLOOKUP(B8,Presmetka,16,FALSE),\"\")","v":1850},{"$f":"IF(B8<>\"\",VLOOKUP(B8,Presmetka,20,FALSE),\"\")","v":-161},{"$f":"IF(B8<>\"\",VLOOKUP(B8,Presmetka,24,FALSE),\"\")","v":0}]
[null,2000,1450,null,null,null,{"$f":"IF(B8<>\"\",VLOOKUP(B8,Presmetka,4,FALSE),\"\")","v":1456},{"$f":"IF(B8<>\"\",VLOOKUP(B8,Presmetka,8,FALSE),\"\")","v":1374},{"$f":"IF(B8<>\"\",VLOOKUP(B8,Presmetka,12,FALSE),\"\")","v":0},null,{"$f":"IF(B8<>\"\",VLOOKUP(B8,Presmetka,17,FALSE),\"\")","v":1300},{"$f":"IF(B8<>\"\",VLOOKUP(B8,Presmetka,21,FALSE),\"\")","v":1289},{"$f":"IF(B8<>\"\",VLOOKUP(B8,Presmetka,25,FALSE),\"\")","v":0},{"$f":"IF(B8<>\"\",VLOOKUP(B8,podatoci1,11,FALSE),\"\")","v":"Staklo 2"}]
[null,null,null,null,null,null,{"$f":"IF(B8<>\"\",VLOOKUP(B8,Presmetka,5,FALSE),\"\")","v":1456},{"$f":"IF(B8<>\"\",VLOOKUP(B8,Presmetka,9,FALSE),\"\")","v":1374},{"$f":"IF(B8<>\"\",VLOOKUP(B8,Presmetka,13,FALSE),\"\")","v":0},null,{"$f":"IF(B8<>\"\",VLOOKUP(B8,Presmetka,18,FALSE),\"\")","v":1300},{"$f":"IF(B8<>\"\",VLOOKUP(B8,Presmetka,22,FALSE),\"\")","v":1289},{"$f":"IF(B8<>\"\",VLOOKUP(B8,Presmetka,26,FALSE),\"\")","v":0},{"$f":"IF(B8<>\"\",VLOOKUP(B8,Presmetka,29,FALSE),\"\")","v":1869},"x",{"$f":"IF(B8<>\"\",VLOOKUP(B8,Presmetka,30,FALSE),\"\")","v":1342}]
[null,0,null,null,null,null,null,null,null,null,null,null,null,null,null,0]
[]
[null,null,null,null,null,null,null,"Datum"]
[null,"Klient :"]
[null,"Adresa :"]
[null,"Telefon :"]
[]
[null,"."]

{"sheet":"Formuli","index":1,"n_rows":22,"n_cols":47,"rows_kept":22,"cut":false,"hidden":false,"merged":[]}
["Prozor fiksen",1,null,null,"Tip na PVC","Krilo","Kasa","Krilo","Kril. 2","T Pre.","`.Kasa","`.Krilo","`.Kri.2","Stak. 1","Stak. 2",null,null,"Tip na PVC","Kasa 1","Kasa 2","Kasa 3","Kasa 4","Krilo 1/1","Krilo 1/2","Krilo 1/3","Krilo 1/4","Krilo 2/1","Krilo 2/2","Krilo 2/3","Krilo 2/4","T Pre. 1","`.Kasa 1","`.Kasa 2","`.Kasa 3","`.Kasa 4","`.Krilo 1/1","`.Krilo 1/2","`.Krilo 1/3","`.Krilo 1/4","`.Krilo 2/1","`.Krilo 2/2","`.Krilo 2/3","`.Krilo 2/4","Stak. 1/1","Stak. 1/2","Stak. 2/1","Stak. 2/2"]
["Prozor so 1 krilo ",2,null,1,"Prozor fiksen",null,"Kasa",null,null,null,"`.Kasa",null,null,"Staklo ",null,null,1,"Prozor fiksen",{"$f":"S18","v":2006},{"$f":"S18","v":2006},1456,{"$f":"T18","v":1456},null,null,null,null,null,null,null,null,null,{"$f":"X18","v":1850},{"$f":"X18","v":1850},1300,{"$f":"Y18","v":1300},null,null,null,null,null,null,null,null,{"$f":"AB18","v":1892},1342]
["Prozor so 1 krilo + fiksno ",3,null,2,"Prozor so 1 krilo ",null,"Kasa","Krilo",null,null,"`.Kasa","`.Krilo",null,"Staklo ",null,null,2,"Prozor so 1 krilo ",{"$f":"S19","v":2006},2006,1456,{"$f":"T19","v":1456},{"$f":"U19","v":1924},{"$f":"U19","v":1924},1374,{"$f":"V19","v":1374},null,null,null,null,null,{"$f":"X19","v":1850},1850,1300,{"$f":"Y19","v":1300},{"$f":"Z19","v":1839},{"$f":"Z19","v":1839},1289,{"$f":"AA19","v":1289},null,null,null,null,1782,1232]
["Prozor so 2 krila so adapter",4,null,3,"Prozor so 1 krilo + fiksno ","Krilo","Kasa","Krilo",null,"T Pre.","`.Kasa","`.Krilo",null,"Staklo ","Staklo 2",null,3,"Prozor so 1 krilo + fiksno ",{"$f":"S20","v":2006},2006,1456,{"$f":"T20","v":1456},{"$f":"U20","v":-76},-76,1374,{"$f":"V20","v":1374},null,null,null,null,{"$f":"W20","v":1350},{"$f":"X20","v":1850},1850,1300,{"$f":"Y20","v":1300},{"$f":"Z20","v":-161},-161,1289,{"$f":"AA20","v":1289},null,null,null,null,-136,1232,1869,1342]
["Prozor so 2 krila so T pre.",5,null,4,"Prozor so 2 krila so adapter",null,"Kasa","Krilo","Kril.2",null,"`.Kasa","`.Krilo","`.Kri.2","Staklo ","Staklo 2",null,4,"Prozor so 2 krila so adapter",{"$f":"S21","v":2006},2006,1456,{"$f":"T21","v":1456},{"$f":"U21","v":962},962,1374,{"$f":"V21","v":1374},{"$f":"U21","v":962},{"$f":"U21","v":962},{"$f":"V21","v":1374},{"$f":"V21","v":1374},null,{"$f":"X21","v":1850},1850,1300,{"$f":"Y21","v":1300},{"$f":"Z21","v":801},801,1289,{"$f":"AA21","v":1289},{"$f":"Z21","v":801},{"$f":"Z21","v":801},{"$f":"AA21","v":1289},{"$f":"AA21","v":1289},827,1232,827,1232]
[null,null,null,5,"Prozor so 2 krila so T pre.",null,"Kasa","Krilo","Kril.2","T Pre.","`.Kasa","`.Krilo","`.Kri.2","Staklo ","Staklo 2",null,5,"Prozor so 2 krila so T pre.",{"$f":"S22","v":2006},2006,1456,{"$f":"T22","v":1456},{"$f":"U22","v":954},954,1374,{"$f":"V22","v":1374},{"$f":"U22","v":954},{"$f":"U22","v":954},{"$f":"V22","v":1374},{"$f":"V22","v":1374},{"$f":"W22","v":1350},{"$f":"X22","v":1850},1850,1300,{"$f":"Y22","v":1300},{"$f":"Z22","v":793},793,1289,{"$f":"AA22","v":1289},{"$f":"Z22","v":793},{"$f":"Z22","v":793},{"$f":"AA22","v":1289},{"$f":"AA22","v":1289},819,1232,819,1232]
[]
[]
[]
[]
[]
[]
[]
[]
[]
[]
[null,null,null,null,null,null,null,null,null,null,null,null,null,null,null,null,null,"Tip na PVC -Formuli","Kasa 1 ","Kasa 2","Krilo 1","Krilo 2","T.pre.","`.Kasa1","`.Kasa2","`.Krilo 1","`.Krilo 2","Stak.1/a","Stak.1/b","Stak.2/a","Stak.2/b"]
[null,null,null,null,null,null,null,null,null,null,null,null,null,null,null,null,1,"Prozor fiksen",{"$f":"Presmetka!B10+6","v":2006},{"$f":"Presmetka!C10+6","v":1456},null,null,null,{"$f":"Presmetka!B10-150","v":1850},{"$f":"Presmetka!C10-150","v":1300},null,null,{"$f":"Presmetka!B10-108","v":1892},{"$f":"Presmetka!C10-108","v":1342}]
[null,null,null,null,null,null,null,null,null,null,null,null,null,null,null,null,2,"Prozor so 1 krilo ",{"$f":"Presmetka!B10+6","v":2006},{"$f":"Presmetka!C10+6","v":1456},{"$f":"Presmetka!B10-76","v":1924},{"$f":"Presmetka!C10-76","v":1374},null,{"$f":"Presmetka!B10-150","v":1850},{"$f":"Presmetka!C10-150","v":1300},{"$f":"Presmetka!B10-161","v":1839},{"$f":"Presmetka!C10-161","v":1289},{"$f":"Presmetka!B10-218","v":1782},{"$f":"Presmetka!C10-218","v":1232}]
[null,null,null,null,null,null,null,null,null,null,null,null,null,null,null,null,3,"Prozor so 1 krilo + fiksno ",{"$f":"Presmetka!B10+6","v":2006},{"$f":"Presmetka!C10+6","v":1456},{"$f":"Presmetka!E10-76","v":-76},{"$f":"Presmetka!C10-76","v":1374},{"$f":"Presmetka!C10-100","v":1350},{"$f":"Presmetka!B10-150","v":1850},{"$f":"Presmetka!C10-150","v":1300},{"$f":"Presmetka!E10-161","v":-161},{"$f":"Presmetka!C10-161","v":1289},{"$f":"Presmetka!E10-136","v":-136},{"$f":"Presmetka!C10-218","v":1232},{"$f":"Presmetka!B10-Presmetka!E10-131","v":1869},{"$f":"Presmetka!C10-108","v":1342}]
[null,null,null,null,null,null,null,null,null,null,null,null,null,null,null,null,4,"Prozor so 2 krila so adapter",{"$f":"Presmetka!B10+6","v":2006},{"$f":"Presmetka!C10+6","v":1456},{"$f":"(Presmetka!B10-76)/2","v":962},{"$f":"Presmetka!C10-76","v":1374},null,{"$f":"Presmetka!B10-150","v":1850},{"$f":"Presmetka!C10-150","v":1300},{"$f":"((Presmetka!B10-76)/2)-161","v":801},{"$f":"Presmetka!C10-161","v":1289},{"$f":"(Presmetka!B10-346)/2","v":827},{"$f":"Presmetka!C10-218","v":1232},{"$f":"(Presmetka!B10-346)/2","v":827},{"$f":"Presmetka!C10-218","v":1232}]
[null,null,null,null,null,null,null,null,null,null,null,null,null,null,null,null,5,"Prozor so 2 krila so T pre.",{"$f":"Presmetka!B10+6","v":2006},{"$f":"Presmetka!C10+6","v":1456},{"$f":"(Presmetka!B10-92)/2","v":954},{"$f":"Presmetka!C10-76","v":1374},{"$f":"Presmetka!C10-100","v":1350},{"$f":"Presmetka!B10-150","v":1850},{"$f":"Presmetka!C10-150","v":1300},{"$f":"((Presmetka!B10-92)/2)-161","v":793},{"$f":"Presmetka!C10-161","v":1289},{"$f":"(Presmetka!B10-362)/2","v":819},{"$f":"Presmetka!C10-218","v":1232},{"$f":"(Presmetka!B10-362)/2","v":819},{"$f":"Presmetka!C10-218","v":1232}]

{"sheet":"Sliki","index":2,"n_rows":0,"n_cols":0,"rows_kept":0,"cut":false,"hidden":false,"merged":[]}