{"text_format":"1","workbook":"xlsx","n_sheets":11,"sheets":["Fix","k1-OK","1K-OK-1O","1K-FIX","2K-OK-FIX","1K-OK-2FIX","2K-OK-2FIX","Vrata 1K","Vrata 2K","Poručivanje okova","Otpremnica"],"not_rendered":{"charts":0,"images":36,"macros":1,"external_links":1,"defined_names":14,"comments":0,"pivot_tables":0},"unopened":[],"bounds":{"document_bytes":16777216,"sheet_cells":100000,"rows_first":2000,"rows_last":500,"rows_between":2000,"halvings":0,"cell_chars":16384,"cell_head_chars":4096},"cells_cut":0,"cells_raw":0,"read":"whole","date_system":"1900"}

{"sheet":"Fix","index":0,"n_rows":31,"n_cols":18,"rows_kept":31,"cut":false,"hidden":false,"merged":[[0,0,0,12],[1,6,1,12],[6,6,6,12],[10,6,10,11],[28,1,28,2],[29,3,29,4],[1,16,1,17],[4,4,15,4],[25,1,25,5],[26,1,26,5],[27,1,27,5],[21,0,21,1],[22,0,24,3],[18,0,18,3]]}
["KROJNA LISTA"]
[null,null,null,null,null,null,"PVC",null,null,null,null,null,null,null,null,null,"Podešavanje"]
[null,null,null,null,null,null,null,"Visina","Visina+Var","kom","Širina","Širina+var","kom",null,null,null,"Štok",{"$f":"IF(D31=\"Aluplast\",50,IF(D31=\"Profi link\",46,\"\"))","v":""}]
[null,null,null,null,null,null,"Štok",{"$f":"IF(AND(A19>0,E5>0),ABS(E5),0)","v":0},{"$f":"IF(AND(E5>0,A19>0),ABS(E5+6),0)","v":0},{"$f":"IF(AND(E5>0,A19>0),ABS(2*B21),0)","v":0},{"$f":"IF(AND(E5>0,A19>0),ABS(A19),0)","v":0},{"$f":"IF(AND(E5>0,A19>0),ABS(A19+6),0)","v":0},{"$f":"IF(AND(E5>0,A19>0),ABS(2*B21),0)","v":0}]
[null,null,null,null,null,null,"Lajsna",{"$f":"IF(AND(E5>0,A19>0),SUM(E5-2*R3),0)","v":0},null,{"$f":"IF(AND(E5>0,A19>0),ABS(2*B21),0)","v":0},{"$f":"IF(AND(E5>0,A19>0),SUM(A19-2*R3),0)","v":0},null,{"$f":"IF(AND(E5>0,A19>0),ABS(2*B21),0)","v":0}]
[]
[null,null,null,null,null,null,"Armatura"]
[null,null,null,null,null,null,null,"Visina",null,"kom","Širina",null,"kom"]
[null,null,null,null,null,null,"Štok",{"$f":"IF(AND(E5>0,A19>0),ABS(H4-110),0)","v":0},null,{"$f":"IF(AND(E5>0,A19>0),ABS(2*B21),0)","v":0},{"$f":"IF(AND(E5>0,A19>0),ABS(K4-110),0)","v":0},null,{"$f":"IF(AND(E5>0,A19>0),ABS(2*B21),0)","v":0}]
[]
[null,null,null,null,null,null,"Ispuna"]
[null,null,null,null,null,null,null,"Visina",null,"Širina",null,"kom"]
[null,null,null,null,null,null,"Staklo",{"$f":"IF(AND(E5>0,A19>0),ABS(SUM(E5-2*R3-10)),0)","v":0},null,{"$f":"IF(AND(E5>0,A19>0),ABS(SUM(A19-2*R3-10)),0)","v":0},null,{"$f":"IF(AND(E5>0,A19>0),ABS(B21),0)","v":0}]
[]
[]
[]
[]
[]
[]
[]
["Komada"]
["Napomena:"]
[]
[]
[]
["Kupac:"]
["Adresa:"]
["Tel:"]
["Datum:",{"$f":"TODAY()","v":"2011-04-11"}]
[null,null,"Potvrdi"]
[null,null,"Profil"]

{"sheet":"k1-OK","index":1,"n_rows":33,"n_cols":19,"rows_kept":33,"cut":false,"hidden":false,"merged":[[0,0,0,12],[22,3,22,4],[24,0,26,3],[23,0,23,1],[31,6,31,8],[31,3,31,4],[30,1,30,2],[7,4,10,4],[26,6,26,8],[27,6,27,8],[28,6,28,8],[29,6,29,8],[30,6,30,8],[20,0,20,3],[24,6,24,8],[25,6,25,8],[1,16,1,17],[27,1,27,5],[28,1,28,5],[29,1,29,5],[18,6,18,8],[19,6,19,8],[20,6,20,8],[21,6,21,8],[22,6,22,8],[23,6,23,8],[16,6,16,9],[12,6,12,11],[7,6,7,12],[1,6,1,12]]}
["KROJNA LISTA"]
[null,null,null,null,null,null,"PVC",null,null,null,null,null,null,null,null,null,"Podešavanje"]
[null,null,null,null,null,null,null,"Visina","Visina+Var","kom","Širina","Širina+var","kom",null,null,null,"Štok",{"$f":"IF(D33=\"Aluplast\",50,IF(D33=\"Profi link\",46,\"\"))","v":""}]
[null,null,null,null,null,null,"Štok",{"$f":"IF(AND(A21>0,E8>0),ABS(E8),0)","v":0},{"$f":"IF(AND(E8>0,A21>0),ABS(E8+6),0)","v":0},{"$f":"IF(AND(E8>0,A21>0),ABS(2*B23),0)","v":0},{"$f":"IF(AND(E8>0,A21>0),ABS(A21),0)","v":0},{"$f":"IF(AND(E8>0,A21>0),ABS(A21+6),0)","v":0},{"$f":"IF(AND(E8>0,A21>0),ABS(2*B23),0)","v":0},null,null,null,"Krilo",{"$f":"IF(D33=\"Aluplast\",57,IF(D33=\"Profi link\",57,\"\"))","v":""}]
[null,null,null,null,null,null,"Krilo",{"$f":"IF(AND(E8>0,A21>0),ABS(E8-2*R3+2*R5),0)","v":0},{"$f":"IF(AND(E8>0,A21>0),ABS(E8-2*R3+2*R5+6),0)","v":0},{"$f":"IF(AND(E8>0,A21>0),ABS(2*B23),0)","v":0},{"$f":"IF(AND(E8>0,A21>0),ABS(A21-2*R3+2*R5),0)","v":0},{"$f":"IF(AND(E8>0,A21>0),ABS(A21-2*R3+2*R5+6),0)","v":0},{"$f":"IF(AND(E8>0,A21>0),ABS(2*B23),0)","v":0},null,null,null,"Preklop",8]
[null,null,null,null,null,null,"Lajsna",{"$f":"IF(AND(E8>0,A21>0),SUM(H5-2*R4),0)","v":0},null,{"$f":"IF(AND(E8>0,A21>0),ABS(2*B23),0)","v":0},{"$f":"IF(AND(E8>0,A21>0),SUM(K5-2*R4),0)","v":0},null,{"$f":"IF(AND(E8>0,A21>0),ABS(2*B23),0)","v":0}]
[]
[null,null,null,null,null,null,"Armatura",null,null,null,null,null,null,null,null,null,"DFNK","RM","LM"]
[null,null,null,null,null,null,null,"Visina",null,"kom","Širina",null,"kom",null,null,null,{"$f":"IF(D32=\"Obradi\",SUMIF(J21,\"L\",L21),0)","v":0},{"$f":"IF(D32=\"Obradi\",SUMIF(J22,\"L\",L22),0)","v":0},{"$f":"IF(D32=\"Obradi\",SUMIF(J22,\"L\",L22),0)","v":0}]
[null,null,null,null,null,null,"Štok",{"$f":"IF(AND(E8>0,A21>0),ABS(H4-110),0)","v":0},null,{"$f":"IF(AND(E8>0,A21>0),ABS(2*B23),0)","v":0},{"$f":"IF(AND(E8>0,A21>0),ABS(K4-110),0)","v":0},null,{"$f":"IF(AND(E8>0,A21>0),ABS(2*B23),0)","v":0},null,null,null,{"$f":"IF(D32=\"Obradi\",SUMIF(J21,\"R\",L21),0)","v":0},{"$f":"IF(D32=\"Obradi\",SUMIF(J22,\"R\",L22),0)","v":0},{"$f":"IF(D32=\"Obradi\",SUMIF(J22,\"R\",L22),0)","v":0}]
[null,null,null,null,null,null,"Krilo",{"$f":"IF(AND(E8>0,A21>0),ABS(H5-130),0)","v":0},null,{"$f":"IF(AND(E8>0,A21>0),ABS(2*B23),0)","v":0},{"$f":"IF(AND(E8>0,A21>0),ABS(K5-130),0)","v":0},null,{"$f":"IF(AND(E8>0,A21>0),ABS(2*B23),0)","v":0}]
[]
[null,null,null,null,null,null,"Ispuna"]
[null,null,null,null,null,null,null,"Visina",null,"Širina",null,"kom"]
[null,null,null,null,null,null,"Staklo",{"$f":"IF(AND(E8>0,A21>0),ABS(SUM(H5-2*R4-10)),0)","v":0},null,{"$f":"IF(AND(E8>0,A21>0),ABS(SUM(K5-2*R4-10)),0)","v":0},null,{"$f":"IF(AND(E8>0,A21>0),ABS(B23),0)","v":0}]
[null,null,null,null,null,null,null,null,null,null,"Falc. Širina:",{"$f":"IF(AND(E8>0,A21>0),K5-40,0)","v":0}]
[null,null,null,null,null,null,"Okov                               ",null,null,null,"Falc. Visina:",{"$f":"IF(AND(E8>0,A21>0),H5-40,0)","v":0}]
[null,null,null,null,null,null,"Naziv",null,null,"L/R","Velličina","kom"]
[null,null,null,null,null,null,"Donji nosač na ramu",null,null,null,null,{"$f":"IF(AND(E8>0,A21>0),B23,0)","v":0}]
[null,null,null,null,null,null,"Gornji nosač na ramu",null,null,null,null,{"$f":"IF(AND(E8>0,A21>0),IF(AND(D23=\"Okretni\",E8>=1200),B23*2,B23),0)","v":0}]
[null,null,null,null,null,null,"Donji falcni nosač na krilu",null,null,{"$f":"IF(AND(E8>0,A21>0),C23,0)","v":0},null,{"$f":"IF(AND(E8>0,A21>0),B23,0)","v":0}]
[null,null,null,null,null,null,{"$f":"IF(D23=\"Okretni\",\"Lažna Makaza\",IF(D23=\"Okretno/Nagibni\",\"Ruka makaze\",\"Izaberi\"))","v":"Izaberi"},null,null,{"$f":"IF(AND(E8>0,A21>0),C23,0)","v":0},{"$f":"IF(D23=\"Okretni\",\"\",IF(D23=\"Okretno/Nagibni\",IF(L16>=1201,\"1201-1600\",IF(L16>=751,\"751-1200\",IF(L16>=501,\"501-750\",IF(L16>=280,\"280-500\",\"Greška\")))),\"Greška\"))","v":"Greška"},{"$f":"IF(AND(E8>0,A21>0),ABS(B23),0)","v":0}]
["Komada",null,null,null,null,null,"Telo makaze",null,null,null,{"$f":"IF(D23=\"Okretni\",\"\",IF(D23=\"Okretno/Nagibni\",IF(L16>=1451,\"1451-1600\",IF(L16>=1201,\"1201-1450\",IF(L16>=951,\"951-1200\",IF(L16>=751,\"751-950\",IF(L16>=501,\"501-750\",IF(L16>=401,\"401-500\",IF(L16>=280,\"280-400\",\"Greška\"))))))),\"Greška\"))","v":"Greška"},{"$f":"IF(AND(E8>0,A21>0),IF(D23=\"Okretni\",\"\",IF(D23=\"Okretno/Nagibni\",B23)),0)","v":0}]
["Napomena:",null,null,null,null,null,"Bočni zatvarač",null,null,null,{"$f":"IF(L17>=2101,\"2101-2350\",IF(L17>=1851,\"1851-2100\",IF(L17>=1601,\"1601-1850\",IF(L17>=1351,\"1351-1600\",IF(L17>=1101,\"1101-1350\",IF(L17>=851,\"851-1100\",IF(L17>=721,\"721-850\",IF(L17>=551,\"551-720\",IF(L17>=451,\"451-550\",IF(L17>=350,\"350-450\",\"Greška\"))))))))))","v":"Greška"},{"$f":"IF(AND(E8>0,A21>0),IF(K24=\"Greška\",\"\",B23),0)","v":0}]
[null,null,null,null,null,null,"Srednji zatvarač po širini",null,null,null,{"$f":"IF(D23=\"Okretni\",\"\",IF(D23=\"Okretno/Nagibni\",IF(L16>=1201,\"1201-1600\",IF(L16>=951,\"951-1200\",IF(L16>=751,\"751-950\",IF(L16>=280,\"280-750\",\"Greška\")))),\"Greška\"))","v":"Greška"},{"$f":"IF(AND(E8>0,A21>0),IF(D23=\"Okretni\",\"\",IF(D23=\"Okretno/Nagibni\",B23)),0)","v":0}]
[null,null,null,null,null,null,"Ugaonik",null,null,null,null,{"$f":"IF(AND(E8>0,A21>0),IF(D23=\"Okretni\",\"\",IF(D23=\"Okretno/Nagibni\",B23)),\"\")","v":""}]
[null,null,null,null,null,null,"Pokrivna kapa gornjeg nosača",null,null,null,null,{"$f":"L20","v":0}]
["Kupac:",null,null,null,null,null,"Pokrivna kapa donjeg falcnog",null,null,{"$f":"C23","v":0},null,{"$f":"L21","v":0}]
["Adresa:",null,null,null,null,null,"Pokrivna kapa donjeg nosača",null,null,null,null,{"$f":"L19","v":0}]
["Tel:",null,null,null,null,null,"Prihvatnik na ramu",null,null,null,null,{"$f":"IF(AND(E8>0,A21>0),B23*4,0)","v":0}]
["Datum:",{"$f":"TODAY()","v":"2011-04-11"},null,null,null,null,"Prihvatnik nagiba",null,null,null,null,{"$f":"L25","v":0}]
[null,null,"Potvrdi",null,null,null,"Srednja šarka",null,null,null,null,{"$f":"IF(AND(E8>0,A21>0),IF(AND(D23=\"Okretni\",E8>=1200),B23,IF(AND(D23=\"Okretno/Nagibni\",E8>=1200),\"\",\"\")),0)","v":0}]
[null,null,"Profil"]

{"sheet":"1K-OK-1O","index":2,"n_rows":41,"n_cols":18,"rows_kept":41,"cut":false,"hidden":false,"merged":[[0,0,0,12],[30,6,30,8],[25,6,25,8],[30,1,30,2],[1,6,1,12],[29,1,29,5],[2,0,2,1],[2,2,2,3],[28,6,28,8],[29,6,29,8],[1,16,1,17],[27,1,27,5],[28,1,28,5],[15,6,15,11],[22,6,22,8],[23,6,23,8],[24,6,24,8],[26,6,26,8],[27,6,27,8],[22,3,22,4],[9,6,9,12],[20,6,20,9],[40,6,40,8],[7,4,15,4],[21,0,21,3],[31,3,31,4],[36,6,36,8],[37,6,37,8],[38,6,38,8],[39,6,39,8],[35,6,35,8],[33,6,33,8],[34,6,34,8],[32,6,32,8],[31,6,31,8],[24,0,26,3]]}
["KROJNA LISTA"]
[null,null,null,null,null,null,"PVC",null,null,null,null,null,null,null,null,null,"Podešavanje"]
[null,null,{"$f":"IF(AND(E8>0,A22>0),A22-A3,0)","v":0},null,null,null,null,"Visina","Visina+Var","kom","Širina","Širina+var","kom",null,null,null,"Štok",{"$f":"IF(D33=\"Aluplast\",50,IF(D33=\"Profi link\",46,\"\"))","v":""}]
[null,null,null,null,null,null,"Štok",{"$f":"IF(AND(E8>0,A22>0),ABS(E8),0)","v":0},{"$f":"IF(AND(E8>0,A22>0),ABS(E8+6),0)","v":0},{"$f":"IF(AND(E8>0,A22>0),ABS(2*B23),0)","v":0},{"$f":"IF(AND(E8>0,A22>0),ABS(A22),0)","v":0},{"$f":"IF(AND(E8>0,A22>0),ABS(A22+6),0)","v":0},{"$f":"IF(AND(E8>0,A22>0),ABS(2*B23),0)","v":0},null,null,null,"Krilo",{"$f":"IF(D33=\"Aluplast\",57,IF(D33=\"Profi link\",57,\"\"))","v":""}]
[null,null,null,null,null,null,"Krilo (G)",{"$f":"IF(AND(E8>0,A22>0),ABS(E8-2*R3+2*R5),0)","v":0},{"$f":"IF(AND(E8>0,A22>0),ABS(A22-2*R3+2*R5+6),0)","v":0},{"$f":"IF(AND(E8>0,A22>0),ABS(2*B23),0)","v":0},{"$f":"IF(C23=\"R\",C3-R3-(R6/2)+R5,IF(C23=\"L\",A3-R3-(R6/2)+R5,0))","v":0},{"$f":"IF(AND(E8>0,A22>0),ABS(K5+6),0)","v":0},{"$f":"IF(AND(E8>0,A22>0),ABS(2*B23),0)","v":0},null,null,null,"Preklop",8]
[null,null,null,null,null,null,"Krilo (P)",{"$f":"IF(AND(E8>0,A22>0),ABS(E8-2*R3+2*R5),0)","v":0},{"$f":"IF(AND(E8>0,A22>0),ABS(A22-2*R3+2*R5+6),0)","v":0},{"$f":"IF(AND(E8>0,A22>0),ABS(2*B23),0)","v":0},{"$f":"IF(C23=\"R\",A3-R3-(R6/2)+R5,IF(C23=\"L\",C3-R3-(R6/2)+R5,0))","v":0},{"$f":"IF(AND(E8>0,A22>0),ABS(K6+6),0)","v":0},{"$f":"IF(AND(E8>0,A22>0),ABS(2*B23),0)","v":0},null,null,null,"Zazor",{"$f":"IF(D33=\"Aluplast\",8,IF(D33=\"Profi link\",14,\"\"))","v":""}]
[null,null,null,null,null,null,"Leteća",{"$f":"IF(AND(E8>0,A22>0),H6-78,0)","v":0},null,{"$f":"IF(AND(E8>0,A22>0),B23,0)","v":0}]
[null,null,null,null,null,null,"Lajsna (G)",{"$f":"IF(AND(E8>0,A22>0),SUM(H5-2*R4),0)","v":0},null,{"$f":"IF(AND(E8>0,A22>0),ABS(2*B23),0)","v":0},{"$f":"IF(AND(E8>0,A22>0),SUM(K5-2*R4),0)","v":0},null,{"$f":"IF(AND(E8>0,A22>0),ABS(2*B23),0)","v":0}]
[null,null,null,null,null,null,"Lajsna (P)",{"$f":"IF(AND(E8>0,A22>0),SUM(H5-2*R4),0)","v":0},null,{"$f":"IF(AND(E8>0,A22>0),ABS(2*B23),0)","v":0},{"$f":"IF(AND(E8>0,A22>0),SUM(K6-2*R4),0)","v":0},null,{"$f":"IF(AND(E8>0,A22>0),ABS(2*B23),0)","v":0},null,null,null,{"$f":"IF(D32=\"Obradi\",SUM(SUMIF(J25,{\"L\";\"L/L\"},L25))+SUM(SUMIF(J25,{\"L/R\";\"R/L\"},L25))/2,0)","v":0}]
[null,null,null,null,null,null,"Armatura",null,null,null,null,null,null,null,null,null,{"$f":"IF(D32=\"Obradi\",SUM(SUMIF(J25,{\"R\";\"R/R\"},L25))+SUM(SUMIF(J25,{\"L/R\";\"R/L\"},L25))/2,0)","v":0}]
[null,null,null,null,null,null,null,"Visina",null,"kom","Širina",null,"kom"]
[null,null,null,null,null,null,"Štok",{"$f":"IF(AND(E8>0,A22>0),H4-110,0)","v":0},null,{"$f":"IF(AND(E8>0,A22>0),ABS(2*B23),0)","v":0},{"$f":"IF(AND(E8>0,A22>0),K4-110,0)","v":0},null,{"$f":"IF(AND(E8>0,A22>0),ABS(2*B23),0)","v":0}]
[null,null,null,null,null,null,"Krilo (G)",{"$f":"IF(AND(E8>0,A22>0),H5-130,0)","v":0},null,{"$f":"IF(AND(E8>0,A22>0),ABS(2*B23),0)","v":0},{"$f":"IF(AND(E8>0,A22>0),K5-130,0)","v":0},null,{"$f":"IF(AND(E8>0,A22>0),ABS(2*B23),0)","v":0}]
[null,null,null,null,null,null,"Krilo (P)",{"$f":"IF(AND(E8>0,A22>0),H6-130,0)","v":0},null,{"$f":"IF(AND(E8>0,A22>0),ABS(2*B23),0)","v":0},{"$f":"IF(AND(E8>0,A22>0),K6-130,0)","v":0},null,{"$f":"IF(AND(E8>0,A22>0),ABS(2*B23),0)","v":0}]
[null,null,null,null,null,null,"Leteća",{"$f":"IF(AND(E8>0,A22>0),H7-10,0)","v":0},null,{"$f":"IF(AND(E8>0,A22>0),B23,0)","v":0}]
[null,null,null,null,null,null,"Ispuna"]
[null,null,null,null,null,null,null,"Visina",null,"Širina",null,"kom"]
[null,null,null,null,null,null,null,{"$f":"IF(AND(E8>0,A22>0),ABS(SUM(H5-2*R4-10)),0)","v":0},null,{"$f":"IF(AND(E8>0,A22>0),ABS(SUM(K5-2*R4-10)),0)","v":0},null,{"$f":"IF(AND(E8>0,A22>0),ABS(B23),0)","v":0}]
[null,null,null,null,null,null,null,{"$f":"IF(AND(E8>0,A22>0),ABS(SUM(H5-2*R4-10)),0)","v":0},null,{"$f":"IF(AND(E8>0,A22>0),ABS(SUM(K6-2*R4-10)),0)","v":0},null,{"$f":"IF(AND(E8>0,A22>0),ABS(B23),0)","v":0}]
[null,null,null,null,null,null,null,null,null,null,"Falc. Širina:",{"$f":"IF(AND(E8>0,A22>0),K5-40,0)","v":0}]
[null,null,null,null,null,null,"Okov                               ",null,null,null,"Falc. Visina:",{"$f":"IF(AND(E8>0,A22>0),H5-40,0)","v":0}]
[null,null,null,null,null,null,"Naziv",null,null,"L/R","Velličina","kom"]
["Komada:",null,null,null,null,null,"Donji nosač na ramu",null,null,null,null,{"$f":"IF(AND(E8>0,A22>0),ABS(B23*2),0)","v":0}]
["Napomena:",null,null,null,null,null,"Gornji nosač na ramu",null,null,null,null,{"$f":"IF(AND(E8>0,A22>0),IF(AND(D23=\"Okretni\",E8>=1200),B23*4,IF(AND(D23=\"Okretno/Nagibni\",E8>=1200),B23*2+1,B23*2)),0)","v":0}]
[null,null,null,null,null,null,"Donji falcni nosač na krilu",null,null,"L/R",null,{"$f":"IF(AND(E8>0,A22>0),B23*2,0)","v":0}]
[null,null,null,null,null,null,"Lažna makaza",null,null,{"$f":"IF(AND(E8>0,A22>0),IF(C23=\"L\",\"R\",\"L\"),0)","v":0},null,{"$f":"IF(AND(E8>0,A22>0),ABS(B23),0)","v":0}]
[null,null,null,null,null,null,{"$f":"IF(D23=\"Okretni\",\"Lažna makaza\",\"Ruka makaze\")","v":"Ruka makaze"},null,null,{"$f":"IF(AND(E8>0,A22>0),C23,0)","v":0},{"$f":"IF(D23=\"Okretni\",\"\",IF(D23=\"Okretno/Nagibni\",IF(L20>=1201,\"1201-1600\",IF(L20>=751,\"751-1200\",IF(L20>=501,\"501-750\",IF(L206>=280,\"280-500\",\"Greška\")))),\"Greška\"))","v":"Greška"},{"$f":"IF(AND(E8>0,A22>0),ABS(B23),0)","v":0}]
["Kupac:",null,null,null,null,null,"Telo makaze",null,null,null,{"$f":"IF(D23=\"Okretni\",\"0\",IF(L20>=1451,\"1451-1600\",IF(L20>=1201,\"1201-1450\",IF(L20>=951,\"951-1200\",IF(L20>=751,\"751-950\",IF(L20>=501,\"501-750\",IF(L20>=401,\"401-500\",IF(L20>=280,\"280-400\",\"Greška\"))))))))","v":"Greška"},{"$f":"IF(AND(E8>0,A22>0),IF(D23=\"Okretni\",0,IF(D23=\"Okretno/Nagibni\",B23)),0)","v":0}]
["Adresa:",null,null,null,null,null,"Bočni zatvarač",null,null,null,{"$f":"IF(L21>=2101,\"2101-2350\",IF(L21>=1851,\"1851-2100\",IF(L21>=1601,\"1601-1850\",IF(L21>=1351,\"1351-1600\",IF(L21>=1101,\"1101-1350\",IF(L21>=851,\"851-1100\",IF(L21>=721,\"721-850\",IF(L21>=551,\"551-720\",IF(L21>=451,\"451-550\",IF(L21>=350,\"350-450\",\"Greška\"))))))))))","v":"Greška"},{"$f":"IF(AND(E8>0,A22>0),ABS(B23),0)","v":0}]
["Tel:",null,null,null,null,null,"Srednji zatvarač po širini",null,null,null,{"$f":"IF(D23=\"Okretni\",\"0\",IF(L20>=1201,\"1201-1600\",IF(L20>=951,\"951-1200\",IF(L20>=751,\"751-950\",IF(L20>=280,\"280-750\",\"Greška\")))))","v":"Greška"},{"$f":"IF(AND(E8>0,A22>0),IF(D23=\"Okretni\",0,IF(D23=\"Okretno/Nagibni\",B23)),0)","v":0}]
["Datum:",{"$f":"TODAY()","v":"2011-04-11"},null,null,null,null,"Ugaonik",null,null,null,null,{"$f":"IF(AND(E8>0,A22>0),IF(D23=\"Okretni\",\"0\",IF(D23=\"Okretno/Nagibni\",B23)),0)","v":0}]
[null,null,"Potvrdi",null,null,null,"Srednja šarka",null,null,null,null,{"$f":"IF(AND(E8>0,A22>0),IF(AND(D23=\"Okretni\",E8>=1200),B23*2,IF(AND(D23=\"Okretno/Nagibni\",E8>=1200),B23,0)),0)","v":0}]
[null,null,"Profil",null,null,null,"Zasun donji",null,null,null,null,{"$f":"IF(AND(E8>0,A22>0),B23,0)","v":0}]
[null,null,null,null,null,null,"Zasun gornji",null,null,null,null,{"$f":"IF(AND(E8>0,A22>0),B23,0)","v":0}]
[null,null,null,null,null,null,"Čepovi leteće",null,null,"L/R",null,{"$f":"J7*2","v":0}]
[null,null,null,null,null,null,"Pokrivna kapa gornjeg nosača",null,null,null,null,{"$f":"L24","v":0}]
[null,null,null,null,null,null,"Pokrivna kapa donjeg nosača",null,null,null,null,{"$f":"L23","v":0}]
[null,null,null,null,null,null,"Pokrivna kapa donjeg falcnog",null,null,"L/R",null,{"$f":"L25","v":0}]
[null,null,null,null,null,null,"Prihvatnik nagiba",null,null,null,null,{"$f":"L30","v":0}]
[null,null,null,null,null,null,"Prihvatnik na ramu",null,null,null,null,{"$f":"IF(AND(E8>0,A22>0),B23*5,0)","v":0}]
[null,null,null,null,null,null,"Prihvatnik zasuna",null,null,null,null,{"$f":"L33+L34","v":0}]

{"sheet":"1K-FIX","index":3,"n_rows":35,"n_cols":18,"rows_kept":35,"cut":false,"hidden":false,"merged":[[0,0,0,12],[1,6,1,12],[23,6,23,8],[24,6,24,8],[25,6,25,8],[22,3,22,4],[22,6,22,8],[24,0,26,3],[23,0,23,1],[1,16,1,17],[2,0,2,1],[2,2,2,3],[28,1,28,5],[29,1,29,5],[29,6,29,8],[28,6,28,8],[27,1,27,5],[7,4,16,4],[21,0,21,3],[31,3,31,4],[34,6,34,8],[8,6,8,12],[13,6,13,11],[18,6,18,9],[19,6,19,8],[20,6,20,8],[21,6,21,8],[31,6,31,8],[32,6,32,8],[33,6,33,8],[30,6,30,8],[26,6,26,8],[27,6,27,8]]}
["KROJNA LISTA"]
[null,null,null,null,null,null,"PVC",null,null,null,null,null,null,null,null,null,"Podešavanje"]
[null,null,{"$f":"IF(AND(E8>0,A22>0),A22-A3,0)","v":0},null,null,null,null,"Visina","Visina+Var","kom","Širina","Širina+var","kom",null,null,null,"Štok",{"$f":"IF(D33=\"Aluplast\",50,IF(D33=\"Profi link\",46,\"\"))","v":""}]
[null,null,null,null,null,null,"Štok",{"$f":"IF(AND(E8>0,A22>0),ABS(E8),0)","v":0},{"$f":"IF(AND(E8>0,A22>0),ABS(E8+6),0)","v":0},{"$f":"IF(AND(E8>0,A22>0),ABS(2*B23),0)","v":0},{"$f":"IF(AND(E8>0,A22>0),ABS(A22),0)","v":0},{"$f":"IF(AND(E8>0,A22>0),ABS(A22+6),0)","v":0},{"$f":"IF(AND(E8>0,A22>0),ABS(2*B23),0)","v":0},null,null,null,"Krilo",{"$f":"IF(D33=\"Aluplast\",57,IF(D33=\"Profi link\",57,\"\"))","v":""}]
[null,null,null,null,null,null,"Krilo",{"$f":"IF(AND(E8>0,A22>0),ABS(E8-2*R3+2*R5),0)","v":0},{"$f":"IF(AND(E8>0,A22>0),ABS(A22-2*R3+2*R5+6),0)","v":0},{"$f":"IF(AND(E8>0,A22>0),ABS(2*B23),0)","v":0},{"$f":"IF(AND(E8>0,A22>0),ABS(A3-R3+R5-(R6/2)+R5),0)","v":0},{"$f":"IF(AND(E8>0,A22>0),ABS(K5+6),0)","v":0},{"$f":"IF(AND(E8>0,A22>0),ABS(2*B23),0)","v":0},null,null,null,"Preklop",8]
[null,null,null,null,null,null,"T Prečka",{"$f":"IF(AND(E8>0,A22>0),ABS(E8-(2*R3)+6),0)","v":0},null,{"$f":"IF(AND(E8>0,A22>0),B23,0)","v":0},null,null,null,null,null,null,"T Prečka",{"$f":"IF(D33=\"Aluplast\",40,IF(D33=\"Profi link\",44,\"\"))","v":""}]
[null,null,null,null,null,null,"Lajsna (K)",{"$f":"IF(AND(E8>0,A22>0),SUM(H5-2*R4),0)","v":0},null,{"$f":"IF(AND(E8>0,A22>0),ABS(2*B23),0)","v":0},{"$f":"IF(AND(E8>0,A22>0),SUM(K5-2*R4),0)","v":0},null,{"$f":"IF(AND(E8>0,A22>0),ABS(2*B23),0)","v":0}]
[null,null,null,null,null,null,"Lajsna (F)",{"$f":"IF(AND(E8>0,A22>0),SUM(H5-2*R4),0)","v":0},null,{"$f":"IF(AND(E8>0,A22>0),ABS(2*B23),0)","v":0},null,null,{"$f":"IF(AND(E8>0,A22>0),ABS(2*B23),0)","v":0}]
[null,null,null,null,null,null,"Armatura",null,null,null,null,null,null,null,null,null,{"$f":"IF(D32=\"Obradi\",SUMIF(J23,\"L\",L23),0)","v":0}]
[null,null,null,null,null,null,null,"Visina",null,"kom","Širina",null,"kom",null,null,null,{"$f":"IF(D32=\"Obradi\",SUMIF(J23,\"R\",L23),0)","v":0}]
[null,null,null,null,null,null,"Štok",{"$f":"IF(AND(E8>0,A22>0),H4-110,0)","v":0},null,{"$f":"IF(AND(E8>0,A22>0),B23*2,0)","v":0},{"$f":"IF(AND(E8>0,A22>0),K4-110,0)","v":0},null,{"$f":"IF(AND(E8>0,A22>0),B23*2,0)","v":0}]
[null,null,null,null,null,null,"Krilo",{"$f":"IF(AND(E8>0,A22>0),H5-130,0)","v":0},null,{"$f":"IF(AND(E8>0,A22>0),B23*2,0)","v":0},{"$f":"IF(AND(E8>0,A22>0),K5-130,0)","v":0},null,{"$f":"IF(AND(E8>0,A22>0),B23*2,0)","v":0}]
[null,null,null,null,null,null,"Prečka",null,null,{"$f":"IF(AND(E8>0,A22>0),ABS(B23),0)","v":0}]
[null,null,null,null,null,null,"Ispuna"]
[null,null,null,null,null,null,null,"Visina",null,"Širina",null,"kom"]
[null,null,null,null,null,null,"Staklo (K)",{"$f":"IF(AND(E8>0,A22>0),ABS(SUM(H5-2*R4-10)),0)","v":0},null,{"$f":"IF(AND(E8>0,A22>0),ABS(SUM(K5-2*R4-10)),0)","v":0},null,{"$f":"IF(AND(E8>0,A22>0),ABS(B23),0)","v":0}]
[null,null,null,null,null,null,"Staklo (F)",{"$f":"IF(AND(E8>0,A22>0),ABS(SUM(E8-2*R3-10)),0)","v":0},null,{"$f":"IF(AND(E8>0,A22>0),ABS(C3-R3-(R6/2)-10),0)","v":0},null,{"$f":"IF(AND(E8>0,A22>0),ABS(B23),0)","v":0}]
[null,null,null,null,null,null,null,null,null,null,"Falc. Širina:",{"$f":"IF(AND(E8>0,A22>0),K5-40,0)","v":0}]
[null,null,null,null,null,null,"Okov                               ",null,null,null,"Falc. Visina:",{"$f":"IF(AND(E8>0,A22>0),H5-40,0)","v":0}]
[null,null,null,null,null,null,"Naziv",null,null,"L/R","Velličina","kom"]
[null,null,null,null,null,null,"Donji nosač na ramu",null,null,null,null,{"$f":"IF(AND(E8>0,A22>0),B23,0)","v":0}]
[null,null,null,null,null,null,"Gornji nosač na ramu",null,null,null,null,{"$f":"IF(AND(E8>0,A22>0),IF(AND(D23=\"Okretni\",E8>=1200),B23*2,B23),0)","v":0}]
["Komada:",null,null,null,null,null,"Donji falcni nosač na krilu",null,null,{"$f":"C23","v":0},null,{"$f":"IF(AND(E8>0,A22>0),B23,0)","v":0}]
["Napomena:",null,null,null,null,null,{"$f":"IF(D23=\"Okretni\",\"Lažna makaza\",IF(D23=\"Okretno/Nagibni\",\"Ruka makaze\",\"Greška\"))","v":"Greška"},null,null,{"$f":"C23","v":0},{"$f":"IF(D23=\"Okretni\",\"\",IF(D23=\"Okretno/Nagibni\",IF(L18>=1201,\"1201-1600\",IF(L18>=751,\"751-1200\",IF(L18>=501,\"501-750\",IF(L18>=280,\"280-500\",\"Greška\")))),\"Greška\"))","v":"Greška"},{"$f":"IF(AND(E8>0,A22>0),B23,0)","v":0}]
[null,null,null,null,null,null,"Telo makaze",null,null,null,{"$f":"IF(D23=\"Okretni\",\"0\",IF(D23=\"Okretno/Nagibni\",IF(L18>=1451,\"1451-1600\",IF(L18>=1201,\"1201-1450\",IF(L18>=951,\"951-1200\",IF(L18>=751,\"751-950\",IF(L18>=501,\"501-750\",IF(L18>=401,\"401-500\",IF(L18>=280,\"280-400\",\"Greška\"))))))),\"Greška\"))","v":"Greška"},{"$f":"IF(AND(E8>0,A22>0),IF(D23=\"Okretni\",0,IF(D23=\"Okretno/Nagibni\",B23)),0)","v":0}]
[null,null,null,null,null,null,"Bočni zatvarač",null,null,null,{"$f":"IF(L19>=2101,\"2101-2350\",IF(L19>=1851,\"1851-2100\",IF(L19>=1601,\"1601-1850\",IF(L19>=1351,\"1351-1600\",IF(L19>=1101,\"1101-1350\",IF(L19>=851,\"851-1100\",IF(L19>=721,\"721-850\",IF(L19>=551,\"551-720\",IF(L19>=451,\"451-550\",IF(L19>=350,\"350-450\",\"Greška\"))))))))))","v":"Greška"},{"$f":"IF(AND(E8>0,A22>0),B23,0)","v":0}]
[null,null,null,null,null,null,"Srednji zatvarač po širini",null,null,null,{"$f":"IF(D23=\"Okretni\",\"0\",IF(D23=\"Okretno/Nagibni\",IF(L18>=1201,\"1201-1600\",IF(L18>=951,\"951-1200\",IF(L18>=751,\"751-950\",IF(L18>=280,\"280-750\",\"Greška\")))),\"Greška\"))","v":"Greška"},{"$f":"IF(AND(E8>0,A22>0),IF(D23=\"Okretni\",0,IF(D23=\"Okretno/Nagibni\",B23)),0)","v":0}]
["Kupac:",null,null,null,null,null,"Ugaonik",null,null,null,null,{"$f":"IF(AND(E8>0,A22>0),B23,0)","v":0}]
["Adresa:",null,null,null,null,null,"Pokrivna kapa gornjeg nosača",null,null,null,null,{"$f":"L22","v":0}]
["Tel:",null,null,null,null,null,"Pokrivna kapa donjeg nosača",null,null,null,null,{"$f":"L21","v":0}]
["Datum:",{"$f":"TODAY()","v":"2011-04-11"},null,null,null,null,"Pokrivna kapa donjeg falcnog",null,null,{"$f":"C23","v":0},null,{"$f":"L23","v":0}]
[null,null,"Potvrdi",null,null,null,"Prihvatnik nagiba",null,null,null,null,{"$f":"L27","v":0}]
[null,null,"Profil",null,null,null,"Prihvatnik na ramu",null,null,null,null,{"$f":"IF(AND(E8>0,A22>0),B23*4,0)","v":0}]
[null,null,null,null,null,null,"Spojnica T prečke",null,null,null,null,{"$f":"IF(AND(E8>0,A22>0),B23*2,0)","v":0}]
[null,null,null,null,null,null,"Srednja šarka",null,null,null,null,{"$f":"IF(AND(E8>0,A22>0),IF(AND(D23=\"Okretni\",E8>=1200),B23,IF(AND(D23=\"Okretno/Nagibni\",E8>=1200),0,0)),0)","v":0}]

{"sheet":"2K-OK-FIX","index":4,"n_rows":46,"n_cols":18,"rows_kept":46,"cut":false,"hidden":false,"merged":[[1,16,1,17],[2,0,2,1],[2,2,2,3],[3,4,6,4],[21,1,21,2],[10,4,18,4],[11,6,11,12],[18,6,18,11],[33,6,33,8],[32,6,32,8],[31,6,31,8],[0,0,0,12],[1,6,1,12],[27,1,27,5],[28,1,28,5],[29,1,29,5],[27,6,27,8],[26,6,26,8],[24,0,26,3],[23,0,23,1],[22,3,22,4],[24,6,24,9],[25,6,25,8],[45,6,45,8],[31,3,31,4],[30,6,30,8],[29,6,29,8],[28,6,28,8],[41,6,41,8],[42,6,42,8],[43,6,43,8],[44,6,44,8],[36,6,36,8],[37,6,37,8],[38,6,38,8],[39,6,39,8],[40,6,40,8],[35,6,35,8],[34,6,34,8]]}
["KROJNA LISTA"]
[null,null,null,null,null,null,"PVC",null,null,null,null,null,null,null,null,null,"Podešavanje"]
[null,null,{"$f":"IF(AND(E11>0,B22>0),B22-A3,0)","v":0},null,null,null,null,"Visina","Visina+Var","kom","Širina","Širina+var","kom",null,null,null,"Štok",{"$f":"IF(D33=\"Aluplast\",50,IF(D33=\"Profi link\",46,\"\"))","v":""}]
[null,null,null,null,null,null,"Štok",{"$f":"ABS(E11)","v":0},{"$f":"IF(AND(E11>0,B22>0),ABS(E11+6),0)","v":0},{"$f":"IF(AND(E11>0,B22>0),ABS(2*B23),0)","v":0},{"$f":"ABS(B22)","v":0},{"$f":"IF(AND(E11>0,B22>0),ABS(B22+6),0)","v":0},{"$f":"IF(AND(E11>0,B22>0),ABS(2*B23),0)","v":0},null,null,null,"Krilo",{"$f":"IF(D33=\"Aluplast\",57,IF(D33=\"Profi link\",57,\"\"))","v":""}]
[null,null,null,null,null,null,"Krilo (G)",{"$f":"IF(AND(E11>0,B22>0),ABS((E11-E4)-R3+R5-(R7/2)+R5),0)","v":0},{"$f":"IF(AND(E11>0,B22>0),ABS(H5+6),0)","v":0},{"$f":"IF(AND(E11>0,B22>0),ABS(2*B23),0)","v":0},{"$f":"IF(C23=\"R\",C3-R3-(R6/2)+R5,IF(C23=\"L\",A3-R3-(R6/2)+R5,0))","v":0},{"$f":"IF(AND(E11>0,B22>0),ABS(K5+6),0)","v":0},{"$f":"IF(AND(E11>0,B22>0),ABS(2*B23),0)","v":0},null,null,null,"Preklop",8]
[null,null,null,null,null,null,"Krilo (P)",{"$f":"IF(AND(E11>0,B22>0),ABS((E11-E4)-R3+R5-(R7/2)+R5),0)","v":0},{"$f":"IF(AND(E11>0,B22>0),ABS(H6+6),0)","v":0},{"$f":"IF(AND(E11>0,B22>0),ABS(2*B23),0)","v":0},{"$f":"IF(C23=\"R\",A3-R3-(R6/2)+R5,IF(C23=\"L\",C3-R3-(R6/2)+R5,0))","v":0},{"$f":"IF(AND(E11>0,B22>0),K6+6,0)","v":0},{"$f":"IF(AND(E11>0,B22>0),ABS(2*B23),0)","v":0},null,null,null,"Zazor",{"$f":"IF(D33=\"Aluplast\",8,IF(D33=\"Profi link\",14,\"\"))","v":""}]
[null,null,null,null,null,null,"T Prečka",{"$f":"IF(AND(E11>0,B22>0),ABS(B22-(2*R3)+6),0)","v":0},null,{"$f":"IF(AND(E11>0,B22>0),B23,0)","v":0},null,null,null,null,null,null,"T Prečka",{"$f":"IF(D33=\"Aluplast\",40,IF(D33=\"Profi link\",44,\"\"))","v":""}]
[null,null,null,null,null,null,"Lajsna (GK)",{"$f":"IF(AND(E11>0,B22>0),SUM(H5-2*R4),0)","v":0},null,{"$f":"IF(AND(E11>0,B22>0),ABS(2*B23),0)","v":0},{"$f":"IF(AND(E11>0,B22>0),SUM(K5-2*R4),0)","v":0},null,{"$f":"IF(AND(E11>0,B22>0),ABS(2*B23),0)","v":0}]
[null,null,null,null,null,null,"Lajsna (PK)",{"$f":"IF(AND(E11>0,B22>0),SUM(H5-2*R4),0)","v":0},null,{"$f":"IF(AND(E11>0,B22>0),ABS(2*B23),0)","v":0},{"$f":"IF(AND(E11>0,B22>0),SUM(K6-2*R4),0)","v":0},null,{"$f":"IF(AND(E11>0,B22>0),ABS(2*B23),0)","v":0},null,null,null,{"$f":"IF(D32=\"Obradi\",SUM(SUMIF(J29,{\"L\";\"L/L\"},L29))+SUM(SUMIF(J29,{\"L/R\";\"R/L\"},L29))/2,0)","v":0}]
[null,null,null,null,null,null,"Lajsna (F)",{"$f":"IF(AND(E11>0,B22>0),ABS(E4-R3-(R7/2)),0)","v":0},null,{"$f":"IF(AND(E11>0,B22>0),ABS(2*B23),0)","v":0},{"$f":"IF(AND(E11>0,B22>0),ABS(B22-2*R3),0)","v":0},null,{"$f":"IF(AND(E11>0,B22>0),ABS(2*B23),0)","v":0},null,null,null,{"$f":"IF(D32=\"Obradi\",SUM(SUMIF(J29,{\"R\";\"R/R\"},L29))+SUM(SUMIF(J29,{\"L/R\";\"R/L\"},L29))/2,0)","v":0}]
[null,null,null,null,null,null,"Leteća",{"$f":"IF(AND(E11>0,B22>0),H6-78,0)","v":0},null,{"$f":"IF(AND(E11>0,B22>0),B23,0)","v":0}]
[null,null,null,null,null,null,"Armatura"]
[null,null,null,null,null,null,null,"Visina",null,"kom","Širina",null,"kom"]
[null,null,null,null,null,null,"Štok",{"$f":"IF(AND(E11>0,B22>0),H4-110,0)","v":0},null,{"$f":"IF(AND(E11>0,B22>0),ABS(2*B23),0)","v":0},{"$f":"IF(AND(E11>0,B22>0),K4-110,0)","v":0},null,{"$f":"IF(AND(E11>0,B22>0),ABS(2*B23),0)","v":0}]
[null,null,null,null,null,null,"Leteća",{"$f":"IF(AND(E11>0,B22>0),H11-10,0)","v":0},null,{"$f":"IF(AND(E11>0,B22>0),B23,0)","v":0}]
[null,null,null,null,null,null,"Prečka",null,null,{"$f":"IF(AND(E11>0,B22>0),ABS(B23),0)","v":0}]
[null,null,null,null,null,null,"Krilo",{"$f":"IF(AND(E11>0,B22>0),H5-130,0)","v":0},null,{"$f":"IF(AND(E11>0,B22>0),IF(A3=C3,B23*4,B23*2),0)","v":0},{"$f":"IF(AND(E11>0,B22>0),K5-130,0)","v":0},null,{"$f":"IF(AND(E11>0,B22>0),IF(A3=C3,B23*4,B23*2),0)","v":0}]
[null,null,null,null,null,null,{"$f":"IF(A3=C3,\"0\",\"Krilo (P)\")","v":"0"},{"$f":"IF(AND(E11>0,B22>0),IF(A3=C3,\"0\",H6-130),0)","v":0},null,{"$f":"IF(AND(E11>0,B22>0),IF(A3=C3,\"0\",B23*2),0)","v":0},{"$f":"IF(AND(E11>0,B22>0),IF(A3=C3,\"0\",K6-130),0)","v":0},null,{"$f":"IF(AND(E11>0,B22>0),IF(A3=C3,\"0\",B23*2),0)","v":0}]
[null,null,null,null,null,null,"Ispuna"]
[null,null,null,null,null,null,null,"Visina",null,"Širina",null,"kom"]
[null,null,null,null,null,null,"Staklo (GK)",{"$f":"IF(AND(E11>0,B22>0),ABS(SUM(H5-2*R4-10)),0)","v":0},null,{"$f":"IF(AND(E11>0,B22>0),ABS(SUM(K5-2*R4-10)),0)","v":0},null,{"$f":"IF(AND(E11>0,B22>0),ABS(B23),0)","v":0}]
[null,null,null,null,null,null,"Staklo (PK)",{"$f":"IF(AND(E11>0,B22>0),ABS(SUM(H6-2*R4-10)),0)","v":0},null,{"$f":"IF(AND(E11>0,B22>0),ABS(SUM(K6-2*R4-10)),0)","v":0}]
["Komada:",null,null,null,null,null,"Staklo (F)",{"$f":"IF(AND(E11>0,B22>0),ABS(E4-R3-(R7/2)-10),0)","v":0},null,{"$f":"IF(AND(E11>0,B22>0),ABS(B22-(2*R3)-10),0)","v":0},null,{"$f":"IF(AND(E11>0,B22>0),ABS(B23),0)","v":0}]
[null,null,null,null,null,null,null,null,null,null,"Falc. Širina:",{"$f":"IF(AND(E11>0,B22>0),K5-40,0)","v":0}]
[null,null,null,null,null,null,"Okov                               ",null,null,null,"Falc. Visina:",{"$f":"IF(AND(E11>0,B22>0),H5-40,0)","v":0}]
[null,null,null,null,null,null,"Naziv",null,null,"L/R","Velličina","kom"]
[null,null,null,null,null,null,"Donji nosač na ramu",null,null,null,null,{"$f":"IF(AND(E11>0,B22>0),B23*2,0)","v":0}]
["Kupac:",null,null,null,null,null,"Gornji nosač na ramu",null,null,null,null,{"$f":"IF(AND(E11>0,B22>0),IF(AND(D23=\"Okretni\",E11-E4>=1200),B23*4,IF(AND(D23=\"Okretno/Nagibni\",E11-E4>=1200),B23*2+1,B23*2)),0)","v":0}]
["Adresa:",null,null,null,null,null,"Donji falcni nosač na krilu",null,null,"L/R",null,{"$f":"IF(AND(E11>0,B22>0),B23*2,0)","v":0}]
["Tel:",null,null,null,null,null,{"$f":"IF(D23=\"Okretni\",\"Lažna makaza\",IF(D23=\"Okretno/Nagibni\",\"Ruka makaze\",\"Greška\"))","v":"Greška"},null,null,{"$f":"C23","v":0},{"$f":"IF(D23=\"Okretni\",\"\",IF(D23=\"Okretno/Nagibni\",IF(L24>=1201,\"1201-1600\",IF(L24>=751,\"751-1200\",IF(L24>=501,\"501-750\",IF(L24>=280,\"280-500\",\"Greška\")))),\"Greška\"))","v":"Greška"},{"$f":"IF(AND(E11>0,B22>0),B23,0)","v":0}]
["Datum:",{"$f":"TODAY()","v":"2011-04-11"},null,null,null,null,"Lažna makaza",null,null,{"$f":"IF(C23=\"R\",\"L\",IF(C23=\"L\",\"R\",\"Greška\"))","v":"Greška"},null,{"$f":"IF(AND(E11>0,B22>0),B23,0)","v":0}]
[null,null,"Potvrdi",null,null,null,"Telo makaze",null,null,null,{"$f":"IF(D23=\"Okretni\",\"0\",IF(D23=\"Okretno/Nagibni\",IF(L24>=1451,\"1451-1600\",IF(L24>=1201,\"1201-1450\",IF(L24>=951,\"951-1200\",IF(L24>=751,\"751-950\",IF(L24>=501,\"501-750\",IF(L24>=401,\"401-500\",IF(L24>=280,\"280-400\",\"Greška\"))))))),\"Greška\"))","v":"Greška"},{"$f":"IF(AND(E11>0,B22>0),IF(D23=\"Okretni\",0,IF(D23=\"Okretno/Nagibni\",B23)),0)","v":0}]
[null,null,"Profil",null,null,null,"Bočni zatvarač",null,null,null,{"$f":"IF(L25>=2101,\"2101-2350\",IF(L25>=1851,\"1851-2100\",IF(L25>=1601,\"1601-1850\",IF(L25>=1351,\"1351-1600\",IF(L25>=1101,\"1101-1350\",IF(L25>=851,\"851-1100\",IF(L25>=721,\"721-850\",IF(L25>=551,\"551-720\",IF(L25>=451,\"451-550\",IF(L25>=350,\"350-450\",\"Greška\"))))))))))","v":"Greška"},{"$f":"IF(AND(E11>0,B22>0),B23,0)","v":0}]
[null,null,null,null,null,null,"Srednji zatvarač po širini",null,null,null,{"$f":"IF(D23=\"Okretni\",\"0\",IF(D23=\"Okretno/Nagibni\",IF(L24>=1201,\"1201-1600\",IF(L24>=951,\"951-1200\",IF(L24>=751,\"751-950\",IF(L24>=280,\"280-750\",\"Greška\")))),\"Greška\"))","v":"Greška"},{"$f":"IF(AND(E11>0,B22>0),IF(D23=\"Okretni\",0,IF(D23=\"Okretno/Nagibni\",B23)),0)","v":0}]
[null,null,null,null,null,null,"Ugaonik",null,null,null,null,{"$f":"IF(AND(E11>0,B22>0),IF(D23=\"Okretni\",\"0\",IF(D23=\"Okretno/Nagibni\",B23)),0)","v":0}]
[null,null,null,null,null,null,"Srednja šarka",null,null,null,null,{"$f":"IF(AND(E11>0,B22>0),IF(AND(D23=\"Okretni\",E11>=1200),B23*2,IF(AND(D23=\"Okretno/Nagibni\",E11>=1200),B23,0)),0)","v":0}]
[null,null,null,null,null,null,"Zasun donji",null,null,null,null,{"$f":"IF(AND(E11>0,B22>0),B23,0)","v":0}]
[null,null,null,null,null,null,"Zasun gornji",null,null,null,null,{"$f":"IF(AND(E11>0,B22>0),B23,0)","v":0}]
[null,null,null,null,null,null,"Čepovi leteće",null,null,"L/R",null,{"$f":"J15*2","v":0}]
[null,null,null,null,null,null,"Pokrivna kapa gornjeg nosača",null,null,null,null,{"$f":"L28","v":0}]
[null,null,null,null,null,null,"Pokrivna kapa donjeg nosača",null,null,null,null,{"$f":"L27","v":0}]
[null,null,null,null,null,null,"Pokrivna kapa donjeg falcnog",null,null,"L/R",null,{"$f":"L29","v":0}]
[null,null,null,null,null,null,"Prihvatnik nagiba",null,null,null,null,{"$f":"L34","v":0}]
[null,null,null,null,null,null,"Prihvatnik na ramu",null,null,null,null,{"$f":"IF(AND(E11>0,B22>0),B23*5,0)","v":0}]
[null,null,null,null,null,null,"Prihvatnik zasuna",null,null,null,null,{"$f":"L37+L38","v":0}]
[null,null,null,null,null,null,"Spojnice T prečke",null,null,null,null,{"$f":"IF(AND(E11>0,B222>0),B23*2,0)","v":0}]

{"sheet":"1K-OK-2FIX","index":5,"n_rows":37,"n_cols":18,"rows_kept":37,"cut":false,"hidden":false,"merged":[[30,1,30,2],[0,0,0,12],[24,7,24,9],[9,5,15,5],[22,3,22,4],[24,0,26,3],[23,0,23,1],[31,3,31,4],[1,16,1,17],[2,0,2,1],[1,7,1,13],[29,1,29,5],[2,3,2,4],[21,0,21,4],[9,7,9,13],[14,7,14,13],[27,1,27,5],[28,1,28,5],[20,7,20,10],[27,7,27,9],[29,7,29,9],[22,7,22,9],[23,7,23,9],[31,7,31,9],[30,7,30,9],[25,7,25,9],[36,7,36,9],[35,7,35,8],[34,7,34,9],[33,7,33,9],[32,7,32,9],[28,7,28,9],[26,7,26,9]]}
["KROJNA LISTA"]
[null,null,null,null,null,null,null,"PVC",null,null,null,null,null,null,null,null,"Podešavanje"]
[null,null,null,{"$f":"IF(AND(F10>0,A22>0),A22-C3-A3,0)","v":0},null,null,null,null,"Visina","Visina+Var","kom","Širina","Širina+var","kom",null,null,"Štok",{"$f":"IF(D33=\"Aluplast\",50,IF(D33=\"Profi link\",46,\"\"))","v":""}]
[null,null,null,null,null,null,null,"Štok",{"$f":"ABS(F10)","v":0},{"$f":"IF(AND(F10>0,A22>0),ABS(F10+6),0)","v":0},{"$f":"IF(AND(F10>0,A22>0),ABS(2*B23),0)","v":0},{"$f":"ABS(A22)","v":0},{"$f":"IF(AND(F10>0,A22>0),ABS(A22+6),0)","v":0},{"$f":"IF(AND(F10>0,A22>0),ABS(2*B23),0)","v":0},null,null,"Krilo",{"$f":"IF(D33=\"Aluplast\",57,IF(D33=\"Profi link\",57,\"\"))","v":""}]
[null,null,null,null,null,null,null,"Krilo",{"$f":"IF(AND(F10>0,A22>0),ABS(F10-2*R3+2*R5),0)","v":0},{"$f":"IF(AND(F10>0,A22>0),ABS(I5+6),0)","v":0},{"$f":"IF(AND(F10>0,A22>0),ABS(2*B23),0)","v":0},{"$f":"IF(AND(F10>0,A22>0),ABS(C3-R6+(2*R5)),0)","v":0},{"$f":"IF(AND(F10>0,A22>0),ABS(L5+6),0)","v":0},{"$f":"IF(AND(F10>0,A22>0),ABS(2*B23),0)","v":0},null,null,"Preklop",8]
[null,null,null,null,null,null,null,"T Prečka",{"$f":"IF(AND(F10>0,A22>0),ABS(A22-(2*R3)+6),0)","v":0},null,{"$f":"IF(AND(F10>0,A22>0),2*B23,0)","v":0},null,null,null,null,null,"T Prečka",{"$f":"IF(D33=\"Aluplast\",40,IF(D33=\"Profi link\",44,\"\"))","v":""}]
[null,null,null,null,null,null,null,"Lajsna (K)",{"$f":"IF(AND(F10>0,A22>0),SUM(I5-2*R4),0)","v":0},null,{"$f":"IF(AND(F10>0,A22>0),ABS(2*B23),0)","v":0},{"$f":"IF(AND(F10>0,A22>0),SUM(L5-2*R4),0)","v":0},null,{"$f":"IF(AND(F10>0,A22>0),ABS(2*B23),0)","v":0}]
[null,null,null,null,null,null,null,"Lajsna (FL)",{"$f":"IF(AND(F10>0,A22>0),ABS(F10-2*R3),0)","v":0},null,{"$f":"IF(AND(F10>0,A22>0),ABS(2*B23),0)","v":0},{"$f":"IF(AND(F10>0,A22>0),ABS(A3-R3-R6/2),0)","v":0},null,{"$f":"IF(AND(F10>0,A22>0),ABS(2*B23),0)","v":0}]
[null,null,null,null,null,null,null,"Lajsna (FR)",{"$f":"IF(AND(F10>0,A22>0),ABS(F10-2*R3),0)","v":0},null,{"$f":"IF(AND(F10>0,A22>0),ABS(2*B23),0)","v":0},{"$f":"IF(AND(F10>0,A22>0),ABS(D3-R3-R6/2),0)","v":0},null,{"$f":"IF(AND(F10>0,A22>0),ABS(2*B23),0)","v":0},null,null,{"$f":"IF(D32=\"Obradi\",SUMIF(K25,\"L\",M25),0)","v":0}]
[null,null,null,null,null,null,null,"Armatura",null,null,null,null,null,null,null,null,{"$f":"IF(D32=\"Obradi\",SUMIF(K25,\"R\",M25),0)","v":0}]
[null,null,null,null,null,null,null,null,"Visina",null,"kom","Širina",null,"kom"]
[null,null,null,null,null,null,null,"Štok",{"$f":"IF(AND(F10>0,A22>0),I4-110,0)","v":0},null,{"$f":"IF(AND(F10>0,A22>0),ABS(2*B23),0)","v":0},{"$f":"IF(AND(F10>0,A22>0),L4-110,0)","v":0},null,{"$f":"IF(AND(F10>0,A22>0),ABS(2*B23),0)","v":0}]
[null,null,null,null,null,null,null,"Krilo",{"$f":"IF(AND(F10>0,A22>0),I5-130,0)","v":0},null,{"$f":"IF(AND(F10>0,A22>0),ABS(2*B23),0)","v":0},{"$f":"IF(AND(F10>0,A22>0),L5-130,0)","v":0},null,{"$f":"IF(AND(F10>0,A22>0),ABS(2*B23),0)","v":0}]
[null,null,null,null,null,null,null,"Prečka",null,null,{"$f":"IF(AND(F10>0,A22>0),ABS(B23),0)","v":0}]
[null,null,null,null,null,null,null,"Ispuna"]
[null,null,null,null,null,null,null,null,null,"Visina","Širina",null,"kom"]
[null,null,null,null,null,null,null,"Krilo",null,{"$f":"IF(AND(F10>0,A22>0),ABS(I7-10),0)","v":0},{"$f":"IF(AND(F10>0,A22>0),ABS(L7-10),0)","v":0},null,{"$f":"IF(AND(F10>0,A22>0),ABS(B23),0)","v":0}]
[null,null,null,null,null,null,null,"FIX (L)",null,{"$f":"IF(AND(F10>0,A22>0),ABS(I8-10),0)","v":0},{"$f":"IF(AND(F10>0,A22>0),ABS(L8-10),0)","v":0},null,{"$f":"IF(AND(F10>0,A22>0),ABS(B23),0)","v":0}]
[null,null,null,null,null,null,null,"FIX (R",null,{"$f":"IF(AND(F10>0,A22>0),ABS(I9-10),0)","v":0},{"$f":"IF(AND(F10>0,A22>0),ABS(L9-10),0)","v":0},null,{"$f":"IF(AND(F10>0,A22>0),ABS(B23),0)","v":0}]
[null,null,null,null,null,null,null,null,null,null,null,"Falc. Širina:",{"$f":"IF(AND(F10>0,A22>0),L5-40,0)","v":0}]
[null,null,null,null,null,null,null,"Okov                               ",null,null,null,"Falc. Visina:",{"$f":"IF(AND(F10>0,A22>0),I9-40,0)","v":0}]
[null,null,null,null,null,null,null,"Naziv",null,null,"L/R","Velličina","kom"]
["Komada:",null,null,null,null,null,null,"Donji nosač na ramu",null,null,null,null,{"$f":"IF(AND(F10>0,A22>0),B23,0)","v":0}]
["Napomena:",null,null,null,null,null,null,"Gornji nosač na ramu",null,null,null,null,{"$f":"IF(AND(F10>0,A22>0),B23,0)","v":0}]
[null,null,null,null,null,null,null,"Donji falcni nosač na krilu",null,null,{"$f":"C23","v":0},null,{"$f":"IF(AND(F10>0,A22>0),B23,0)","v":0}]
[null,null,null,null,null,null,null,{"$f":"IF(D23=\"Okretni\",\"Lažna Makaza\",IF(D23=\"Okretno/Nagibni\",\"Ruka makaze\",\"Izaberi\"))","v":"Izaberi"},null,null,{"$f":"C23","v":0},{"$f":"IF(D23=\"Okretni\",\"\",IF(D23=\"Okretno/Nagibni\",IF(M20>=1201,\"1201-1600\",IF(M20>=751,\"751-1200\",IF(M20>=501,\"501-750\",IF(M20>=280,\"280-500\",\"Greška\")))),\"Greška\"))","v":"Greška"},{"$f":"B23","v":0}]
[null,null,null,null,null,null,null,"Telo makaze",null,null,null,{"$f":"IF(D23=\"Okretni\",\"0\",IF(D23=\"Okretno/Nagibni\",IF(M20>=1451,\"1451-1600\",IF(M20>=1201,\"1201-1450\",IF(M20>=951,\"951-1200\",IF(M20>=751,\"751-950\",IF(M20>=501,\"501-750\",IF(M20>=401,\"401-500\",IF(M20>=280,\"280-400\",0))))))),\"Greška\"))","v":"Greška"},{"$f":"IF(AND(F10>0,A22>0),IF(D23=\"Okretni\",\"0\",B23),0)","v":0}]
["Kupac:",null,null,null,null,null,null,"Bočni zatvarač",null,null,null,{"$f":"IF(M21>=2101,\"2101-2350\",IF(M21>=1851,\"1851-2100\",IF(M21>=1601,\"1601-1850\",IF(M21>=1351,\"1351-1600\",IF(M21>=1101,\"1101-1350\",IF(M21>=851,\"851-1100\",IF(M21>=721,\"721-850\",IF(M21>=551,\"551-720\",IF(M21>=451,\"451-550\",IF(M21>=350,\"350-450\",\"Greška\"))))))))))","v":"Greška"},{"$f":"IF(AND(F10>0,A22>0),B23,0)","v":0}]
["Adresa:",null,null,null,null,null,null,"Srednji zatvarač po širini",null,null,null,{"$f":"IF(D23=\"Okretni\",\"0\",IF(D23=\"Okretno/Nagibni\",IF(M20>=1201,\"1201-1600\",IF(M20>=951,\"951-1200\",IF(M20>=751,\"751-950\",IF(M20>=280,\"280-750\",\"Greška\")))),\"Greška\"))","v":"Greška"},{"$f":"IF(AND(F10>0,A22>0),IF(D23=\"Okretni\",\"0\",B23),0)","v":0}]
["Tel:",null,null,null,null,null,null,"Ugaonik",null,null,null,null,{"$f":"IF(AND(F10>0,A22>0),IF(D23=\"Okretni\",\"0\",IF(D23=\"Okretno/Nagibni\",B23)),0)","v":0}]
["Datum:",{"$f":"TODAY()","v":"2011-04-11"},null,null,null,null,null,"Pokrivna kapa gornjeg nosača",null,null,null,null,{"$f":"M24","v":0}]
[null,null,"Potvrdi",null,null,null,null,"Pokrivna kapa donjeg falcnog",null,null,{"$f":"C23","v":0},null,{"$f":"M25","v":0}]
[null,null,"Profil",null,null,null,null,"Pokrivna kapa donjeg nosača",null,null,null,null,{"$f":"M23","v":0}]
[null,null,null,null,null,null,null,"Prihvatnik na ramu",null,null,null,null,{"$f":"IF(AND(F10>0,A22>0),B23*4,0)","v":0}]
[null,null,null,null,null,null,null,"Prihvatnik nagiba",null,null,null,null,{"$f":"M29","v":0}]
[null,null,null,null,null,null,null,"Srednja šarka",null,null,null,null,{"$f":"IF(AND(F10>0,A22>0),IF(AND(D23=\"Okretni\",F10>=1200),B23,IF(AND(D23=\"Okretno/Nagibni\",F10>=1200),0,0)),0)","v":0}]
[null,null,null,null,null,null,null,"Spojnica T prečke",null,null,null,null,{"$f":"IF(AND(F10>0,A22>0),B23*4,0)","v":0}]

{"sheet":"2K-OK-2FIX","index":6,"n_rows":39,"n_cols":18,"rows_kept":39,"cut":false,"hidden":false,"merged":[[1,16,1,17],[2,0,2,1],[2,3,2,4],[28,1,28,5],[29,1,29,5],[10,7,10,13],[16,7,16,12],[21,0,21,4],[27,1,27,5],[22,7,22,10],[24,0,26,3],[23,0,23,1],[37,7,37,9],[38,7,38,9],[36,7,36,9],[34,7,34,9],[33,7,33,9],[35,7,35,9],[0,0,0,13],[32,3,32,4],[6,5,17,5],[27,7,27,9],[28,7,28,9],[29,7,29,9],[30,7,30,9],[32,7,32,9],[31,7,31,9],[22,3,22,4],[23,7,23,9],[24,7,24,9],[25,7,25,9],[26,7,26,9],[30,1,30,2],[1,7,1,13]]}
["KROJNA LISTA"]
[null,null,null,null,null,null,null,"PVC",null,null,null,null,null,null,null,null,"Podešavanje"]
[null,null,{"$f":"IF(AND(F7>0,A22>0),A22-D3-A3,0)","v":0},null,null,null,null,null,"Visina","Visina+Var","kom","Širina","Širina+var","kom",null,null,"Štok",{"$f":"IF(D34=\"Aluplast\",50,IF(D34=\"Profi link\",46,\"\"))","v":""}]
[null,null,null,null,null,null,null,"Štok",{"$f":"ABS(F7)","v":0},{"$f":"IF(AND(F7>0,A22>0),ABS(F7+6),0)","v":0},{"$f":"IF(AND(F7>0,A22>0),ABS(2*B23),0)","v":0},{"$f":"ABS(A22)","v":0},{"$f":"IF(AND(F7>0,A22>0),ABS(A22+6),0)","v":0},{"$f":"IF(AND(F7>0,A22>0),ABS(2*B23),0)","v":0},null,null,"Krilo",{"$f":"IF(D34=\"Aluplast\",57,IF(D34=\"Profi link\",57,\"\"))","v":""}]
[null,null,null,null,null,null,null,"Krilo (L)",{"$f":"IF(AND(F7>0,A22>0),ABS(F7-2*R3+2*R5),0)","v":0},{"$f":"IF(AND(F7>0,A22>0),ABS(I5+6),0)","v":0},{"$f":"IF(AND(F7>0,A22>0),ABS(2*B23),0)","v":0},{"$f":"IF(AND(F7>0,A22>0),ABS(A3-R3+R5-R6/2+R5),0)","v":0},{"$f":"IF(AND(F7>0,A22>0),ABS(L5+6),0)","v":0},{"$f":"IF(AND(F7>0,A22>0),ABS(2*B23),0)","v":0},null,null,"Preklop",8]
[null,null,null,null,null,null,null,"Krilo (R)",{"$f":"IF(AND(F7>0,A22>0),ABS(F7-2*R3+2*R5),0)","v":0},{"$f":"IF(AND(F7>0,A22>0),ABS(I6+6),0)","v":0},{"$f":"IF(AND(F7>0,A22>0),2*B23,0)","v":0},{"$f":"IF(AND(F7>0,A22>0),ABS(D3-R3+R5-R6/2+R5),0)","v":0},{"$f":"IF(AND(F7>0,A22>0),ABS(L6+6),0)","v":0},{"$f":"IF(AND(F7>0,A22>0),ABS(2*B23),0)","v":0},null,null,"T Prečka",{"$f":"IF(D34=\"Aluplast\",40,IF(D34=\"Profi link\",44,\"\"))","v":""}]
[null,null,null,null,null,null,null,"Lajsna (KL)",{"$f":"IF(AND(F7>0,A22>0),ABS(I5-2*R4),0)","v":0},null,{"$f":"IF(AND(F7>0,A22>0),ABS(2*B23),0)","v":0},{"$f":"IF(AND(F7>0,A22>0),SUM(L5-2*R4),0)","v":0},null,{"$f":"IF(AND(F7>0,A22>0),ABS(2*B23),0)","v":0}]
[null,null,null,null,null,null,null,"Lajsna (KR)",{"$f":"IF(AND(F7>0,A22>0),ABS(I6-2*R4),0)","v":0},null,{"$f":"IF(AND(F7>0,A22>0),ABS(2*B23),0)","v":0},{"$f":"IF(AND(F7>0,A22>0),ABS(L6-2*R4),0)","v":0},null,{"$f":"IF(AND(F7>0,A22>0),ABS(2*B23),0)","v":0}]
[null,null,null,null,null,null,null,"Lajsna (F)",{"$f":"IF(AND(F7>0,A22>0),ABS(F7-2*R3),0)","v":0},null,{"$f":"IF(AND(F7>0,A22>0),ABS(2*B23),0)","v":0},{"$f":"IF(AND(F7>0,A22>0),ABS(D3-R3-R6/2),0)","v":0},null,{"$f":"IF(AND(F7>0,A22>0),ABS(2*B23),0)","v":0},null,null,{"$f":"IF(D33=\"Obradi\",SUM(SUMIF(K27,{\"L\";\"L/L\"},M27))+SUM(SUMIF(K27,{\"L/R\";\"R/L\"},M27))/2,0)","v":0}]
[null,null,null,null,null,null,null,"T Prečka",{"$f":"IF(AND(F7>0,A22>0),ABS(F7-2*R3+6),0)","v":0},null,{"$f":"IF(AND(F7>0,A22>0),ABS(2*B23),0)","v":0},null,null,null,null,null,{"$f":"IF(D33=\"Obradi\",SUM(SUMIF(K27,{\"R\";\"R/R\"},M27))+SUM(SUMIF(K27,{\"L/R\";\"R/L\"},M27))/2,0)","v":0}]
[null,null,null,null,null,null,null,"Armatura"]
[null,null,null,null,null,null,null,null,"Visina",null,"kom","Širina",null,"kom"]
[null,null,null,null,null,null,null,"Štok",{"$f":"IF(AND(F7>0,A22>0),I4-110,0)","v":0},null,{"$f":"IF(AND(F7>0,A22>0),ABS(2*B23),0)","v":0},{"$f":"IF(AND(F7>0,A22>0),L4-110,0)","v":0},null,{"$f":"IF(AND(F7>0,A22>0),ABS(2*B23),0)","v":0}]
[null,null,null,null,null,null,null,"Krilo (L)",{"$f":"IF(AND(F7>0,A22>0),I5-130,0)","v":0},null,{"$f":"IF(AND(F7>0,A22>0),ABS(2*B23),0)","v":0},{"$f":"IF(AND(F7>0,A22>0),L5-130,0)","v":0},null,{"$f":"IF(AND(F7>0,A22>0),ABS(2*B23),0)","v":0}]
[null,null,null,null,null,null,null,"Krilo (R)",{"$f":"IF(AND(F7>0,A22>0),I6-130,0)","v":0},null,{"$f":"IF(AND(F7>0,A22>0),ABS(2*B23),0)","v":0},{"$f":"IF(AND(F7>0,A22>0),L6-130,0)","v":0},null,{"$f":"IF(AND(F7>0,A22>0),ABS(2*B23),0)","v":0}]
[null,null,null,null,null,null,null,"Prečka",null,null,{"$f":"IF(AND(F7>0,A22>0),ABS(2*B23),0)","v":0},null,null,{"$f":"IF(AND(F7>0,A22>0),ABS(2*B23),0)","v":0}]
[null,null,null,null,null,null,null,"Ispuna"]
[null,null,null,null,null,null,null,null,null,"Visina","Širina",null,"kom"]
[null,null,null,null,null,null,null,"Krilo (L)",null,{"$f":"IF(AND(F7>0,A22>0),ABS(I7-10),0)","v":0},{"$f":"IF(AND(F7>0,A22>0),ABS(L7-10),0)","v":0},null,{"$f":"IF(AND(F7>0,A22>0),ABS(B23),0)","v":0}]
[null,null,null,null,null,null,null,"Krilo (R)",null,{"$f":"IF(AND(F7>0,A22>0),ABS(I8-10),0)","v":0},{"$f":"IF(AND(F7>0,A22>0),ABS(L8-10),0)","v":0},null,{"$f":"IF(AND(F7>0,A22>0),ABS(B23),0)","v":0}]
[null,null,null,null,null,null,null,"FIX",null,{"$f":"IF(AND(F7>0,A22>0),ABS(I9-10),0)","v":0},{"$f":"IF(AND(F7>0,A22>0),ABS(L9-10),0)","v":0},null,{"$f":"IF(AND(F7>0,A22>0),ABS(B23),0)","v":0}]
[null,null,null,null,null,null,null,null,null,null,null,"Falc. Širina:",{"$f":"IF(AND(A3>0,D3>0),L6-40,0)","v":0}]
["Komada:",null,null,null,null,null,null,"Okov                               ",null,null,null,"Falc. Visina:",{"$f":"IF(AND(A3>0,D3>0),I6-40,0)","v":0}]
["Napomena:",null,null,null,null,null,null,"Naziv",null,null,"L/R","Velličina","kom"]
[null,null,null,null,null,null,null,"Donji nosač na ramu",null,null,null,null,{"$f":"IF(AND(F7>0,A22>0),B23*2,0)","v":0}]
[null,null,null,null,null,null,null,"Gornji nosač na ramu",null,null,null,null,{"$f":"IF(AND(F7>0,A22>0),IF(AND(D23=\"Okretni\",F7>=1200),B23*4,B23*2),0)","v":0}]
[null,null,null,null,null,null,null,"Donji falcni nosač na krilu",null,null,{"$f":"C23","v":0},null,{"$f":"IF(AND(F7>0,A22>0),B23*2,0)","v":0}]
["Kupac:",null,null,null,null,null,null,{"$f":"IF(D23=\"Okretni\",\"Lažna makaza\",IF(D23=\"Okretno/Nagibni\",\"Ruka makaze\",\"Izaberi\"))","v":"Izaberi"},null,null,{"$f":"C23","v":0},{"$f":"IF(D23=\"Okretni\",\"\",IF(D23=\"Okretno/Nagibni\",IF(M22>=1201,\"1201-1600\",IF(M22>=751,\"751-1200\",IF(M22>=501,\"501-750\",IF(M22>=280,\"280-500\",\"Greška\")))),\"Greška\"))","v":"Greška"},{"$f":"IF(AND(F7>0,A22>0),B23*2,0)","v":0}]
["Adresa:",null,null,null,null,null,null,"Telo makaze",null,null,null,{"$f":"IF(M22>0,IF(D23=\"Okretni\",\"0\",IF(D23=\"Okretno/Nagibni\",IF(M22>=1451,\"1451-1600\",IF(M22>=1201,\"1201-1450\",IF(M22>=951,\"951-1200\",IF(M22>=751,\"751-950\",IF(M22>=501,\"501-750\",IF(M22>=401,\"401-500\",IF(M22>=280,\"280-400\",\"Greška\"))))))))),\"Greška\")","v":"Greška"},{"$f":"IF(AND(F7>0,A22>0),IF(D23=\"Okretni\",0,IF(D23=\"Okretno/Nagibni\",B23*2)),0)","v":0}]
["Tel:",null,null,null,null,null,null,"Bočni zatvarač",null,null,null,{"$f":"IF(M23>0,IF(M23>=2101,\"2101-2350\",IF(M23>=1851,\"1851-2100\",IF(M23>=1601,\"1601-1850\",IF(M23>=1351,\"1351-1600\",IF(M23>=1101,\"1101-1350\",IF(M23>=851,\"851-1100\",IF(M23>=721,\"721-850\",IF(M23>=551,\"551-720\",IF(M23>=451,\"451-550\",IF(M23>=350,\"350-450\")))))))))),\"Greška\")","v":"Greška"},{"$f":"IF(AND(F7>0,A22>0),B23*2,0)","v":0}]
["Datum:",{"$f":"TODAY()","v":"2011-04-11"},null,null,null,null,null,"Srednji zatvarač po širini",null,null,null,{"$f":"IF(M22>0,IF(D23=\"Okretni\",\"0\",IF(D23=\"Okretno/Nagibni\",IF(M22>=1201,\"1201-1600\",IF(M22>=951,\"951-1200\",IF(M22>=751,\"751-950\",IF(M22>=280,\"280-750\")))))),\"Greška\")","v":"Greška"},{"$f":"IF(AND(F7>0,A22>0),IF(D23=\"Okretni\",0,IF(D23=\"Okretno/Nagibni\",B23*2)),0)","v":0}]
[null,null,null,null,null,null,null,"Ugaonik",null,null,null,null,{"$f":"IF(AND(F7>0,A22>0),IF(D23=\"Okretni\",\"0\",IF(D23=\"Okretno/Nagibni\",B23*2)),0)","v":0}]
[null,null,"Potvrdi",null,null,null,null,"Srednja šarka",null,null,null,null,{"$f":"IF(AND(F7>0,A22>0),IF(AND(D23=\"Okretni\",F7>=1200),B23*2,IF(AND(D23=\"Okretno/Nagibni\",F7>=1200),0,0)),0)","v":0}]
[null,null,"Profil",null,null,null,null,"Pokrivna kapa gornjeg nosača",null,null,null,null,{"$f":"M26","v":0}]
[null,null,null,null,null,null,null,"Pokrivna kapa donjeg nosača",null,null,null,null,{"$f":"M25","v":0}]
[null,null,null,null,null,null,null,"Pokrivna kapa donjeg falcnog",null,null,{"$f":"C23","v":0},null,{"$f":"M27","v":0}]
[null,null,null,null,null,null,null,"Prihvatnik nagiba",null,null,null,null,{"$f":"M31","v":0}]
[null,null,null,null,null,null,null,"Prihvatnik na ramu",null,null,null,null,{"$f":"IF(AND(F7>0,A22>0),B23*7,0)","v":0}]
[null,null,null,null,null,null,null,"Spojnice T prečke",null,null,null,null,{"$f":"IF(AND(F7>0,A22>0),B23*4,0)","v":0}]

{"sheet":"Vrata 1K","index":7,"n_rows":34,"n_cols":18,"rows_kept":34,"cut":false,"hidden":false,"merged":[[0,0,0,12],[1,16,1,17],[9,6,9,12],[1,6,1,12],[20,0,20,3],[1,5,19,5],[1,4,12,4],[13,4,19,4],[31,3,31,4],[24,0,26,3],[32,3,32,4],[27,1,27,5],[28,1,28,5],[29,1,29,5]]}
["KROJNA LISTA"]
[null,null,null,null,1000,2000,"PVC",null,null,null,null,null,null,null,null,null,"Podešavanje"]
[null,null,null,null,null,null,null,"Visina","Visina+Var","kom","Širina","Širina+var","kom",null,null,null,"Štok",{"$f":"IF(D33=\"Aluplast 033\",50,IF(D33=\"Aluplast 034\",50,IF(D33=\"Aluplast 035\",50,IF(D33=\"Profilink 033\",46,IF(D33=\"Profilink 035\",46,\"Izaberi Profil\")))))","v":"Izaberi Profil"}]
[null,null,null,null,null,null,"Štok",{"$f":"ABS(E8-R6)","v":{"$error":"#VALUE!"}},{"$f":"ABS(E8-R6+3)","v":{"$error":"#VALUE!"}},{"$f":"ABS(2*B23)","v":0},{"$f":"ABS(A21)","v":0},{"$f":"ABS(A21+6)","v":6},{"$f":"ABS(B23)","v":0},null,null,null,"Krilo",{"$f":"IF(D33=\"Aluplast 033\",100,IF(D33=\"Aluplast 034\",75,IF(D33=\"Aluplast 035\",70,IF(D33=\"Profilink 033\",95,IF(D33=\"Profilink 035\",75,\"Izaberi profil\")))))","v":"Izaberi profil"}]
[null,null,null,null,null,null,"Krilo",{"$f":"ABS(F2-(R3-R5)-(R6-R5))","v":{"$error":"#VALUE!"}},{"$f":"ABS(H5+6)","v":{"$error":"#VALUE!"}},{"$f":"ABS(2*B23)","v":0},{"$f":"ABS(A21-2*R3+2*R5)","v":{"$error":"#VALUE!"}},{"$f":"ABS(K5+6)","v":{"$error":"#VALUE!"}},{"$f":"ABS(2*B23)","v":0},null,null,null,"Preklop",8]
[null,null,null,null,null,null,"Lajsna",{"$f":"ABS(H5-2*R4)","v":{"$error":"#VALUE!"}},null,{"$f":"ABS(2*B23)","v":0},{"$f":"ABS(K5-2*R4)","v":{"$error":"#VALUE!"}},null,{"$f":"ABS(2*B23)","v":0},null,null,null,"Prag",{"$f":"IF(D33=\"Aluplast 033\",20,IF(D33=\"Aluplast 034\",20,IF(D33=\"Aluplast 035\",20,IF(D33=\"Profilink 033\",20,IF(D33=\"Profilink 035\",20,\"Izaberi profil\")))))","v":"Izaberi profil"}]
[null,null,null,null,null,null,"T Prečka",null,null,null,{"$f":"K5-(2*R4)","v":{"$error":"#VALUE!"}},{"$f":"K7+6","v":{"$error":"#VALUE!"}},{"$f":"B23","v":0},null,null,null,"T prečka",{"$f":"IF(D33=\"Aluplast 033\",40,IF(D33=\"Aluplast 034\",40,IF(D33=\"Aluplast 035\",40,IF(D33=\"Profilink 033\",44,IF(D33=\"Profilink 035\",44,\"Izaberi profil\")))))","v":"Izaberi profil"}]
[]
[]
[null,null,null,null,null,null,"Armatura"]
[null,null,null,null,null,null,null,"Visina",null,"kom","Širina",null,"kom"]
[null,null,null,null,null,null,"Štok",null,null,{"$f":"ABS(2*B23)","v":0},null,null,{"$f":"ABS(2*B23)","v":0}]
[null,null,null,null,null,null,"Krilo",null,null,{"$f":"ABS(2*B23)","v":0},null,null,{"$f":"ABS(2*B23)","v":0}]
[null,null,null,null,1000]
[null,null,null,null,null,null,"Ispuna"]
[null,null,null,null,null,null,"Ispuna","Visina",null,"Širina",null,"kom"]
[null,null,null,null,null,null,null,{"$f":"E2-(R3-R5)-R4-(R7/2)-10","v":{"$error":"#VALUE!"}},null,{"$f":"ABS(SUM($K$5-2*$R$4-10))","v":{"$error":"#VALUE!"}},null,{"$f":"ABS($B$23)","v":0}]
[null,null,null,null,null,null,"Panel",{"$f":"E14-(R7/2)-(R6-R5)-R4-10","v":{"$error":"#VALUE!"}},null,{"$error":"#VALUE!"},null,{"$f":"ABS($B$23)","v":0}]
[null,null,null,null,null,null,"Staklo",{"$f":"F2-(R3-R5)-(R6-R5)-(2*R4)-10","v":{"$error":"#VALUE!"}},null,{"$f":"ABS(SUM($K$5-2*$R$4-10))","v":{"$error":"#VALUE!"}},null,0]
[null,null,null,null,null,null,"Okov"]
[null,null,null,null,null,null,"Naziv",null,"Velličina","kom"]
[null,null,null,null,null,null,"Dr Hanh Šarke",null,null,{"$f":"ABS(3*B23)","v":0}]
["Komada:",null,null,null,null,null,"Brava",null,null,{"$f":"ABS(B23)","v":0}]
[null,null,null,null,null,null,"Uložak brave",null,null,{"$f":"ABS(B23)","v":0}]
[null,null,null,null,null,null,"Šlic pleh",null,{"$f":"C23","v":0},{"$f":"ABS(B23)","v":0}]
[]
[]
["Kupac:"]
["Adresa:"]
["Tel:"]
["Datum:",{"$f":"TODAY()","v":"2011-04-11"}]
[null,null,"Potvrdi"]
[null,null,"Profil"]
[null,null,"Boja"]

{"sheet":"Vrata 2K","index":8,"n_rows":34,"n_cols":18,"rows_kept":34,"cut":false,"hidden":false,"merged":[[7,4,15,4],[0,0,0,12],[1,6,1,12],[1,16,1,17],[2,0,2,1],[2,2,2,3],[7,6,7,12],[13,6,13,11],[21,0,21,3],[22,6,22,8],[23,6,23,8],[24,0,26,3],[24,6,24,8],[25,6,25,8],[26,6,26,8],[30,1,30,2],[31,3,31,4],[27,1,27,5],[28,1,28,5],[29,1,29,5],[18,6,18,9],[19,6,19,8],[21,6,21,8],[20,6,20,8],[27,6,27,8]]}
["KROJNA LISTA"]
[null,null,null,null,null,null,"PVC",null,null,null,null,null,null,null,null,null,"Podešavanje"]
[null,null,{"$f":"IF(AND(E8>0,A22>0),A22-A3,0)","v":0},null,null,null,null,"Visina","Visina+Var","kom","Širina","Širina+var","kom",null,null,null,"Štok",{"$f":"IF(D33=\"Aluplast 033\",50,IF(D33=\"Aluplast 034\",50,IF(D33=\"Aluplast 035\",50,IF(D33=\"Profilink 033\",46,IF(D33=\"Profilink 035\",46,\"Izaberi Profil\")))))","v":"Izaberi Profil"}]
[null,null,null,null,null,null,"Štok",{"$f":"IF(AND(E8>0,A22>0),ABS(E8-R7),0)","v":0},{"$f":"IF(AND(E8>0,A22>0),ABS(E8+3),0)","v":0},{"$f":"IF(AND(E8>0,A22>0),ABS(2*B23),0)","v":0},{"$f":"IF(AND(E8>0,A22>0),ABS(A22),0)","v":0},{"$f":"IF(AND(E8>0,A22>0),ABS(A22+6),0)","v":0},{"$f":"IF(AND(E8>0,A22>0),ABS(B23),0)","v":0},null,null,null,"Krilo",{"$f":"IF(D33=\"Aluplast 033\",100,IF(D33=\"Aluplast 034\",75,IF(D33=\"Aluplast 035\",70,IF(D33=\"Profilink 033\",95,IF(D33=\"Profilink 035\",75,\"Izaberi profil\")))))","v":"Izaberi profil"}]
[null,null,null,null,null,null,"Krilo",{"$f":"IF(AND(E8>0,A22>0),ABS(E8-2*R3+2*R5),0)","v":0},{"$f":"IF(AND(E8>0,A22>0),ABS(A22-2*R3+2*R5+6),0)","v":0},{"$f":"IF(AND(E8>0,A22>0),ABS(2*B23),0)","v":0},{"$f":"IF(AND(E8>0,A22>0),ABS(A3-R3+R5-(R6/2)),0)","v":0},{"$f":"IF(AND(E8>0,A22>0),ABS(K5+6),0)","v":0},{"$f":"IF(AND(E8>0,A22>0),ABS(2*B23),0)","v":0},null,null,null,"Preklop",8]
[null,null,null,null,null,null,"Krilo",{"$f":"IF(AND(E8>0,A22>0),ABS(E8-2*R3+2*R5),0)","v":0},{"$f":"IF(AND(E8>0,A22>0),ABS(A22-2*R3+2*R5+6),0)","v":0},{"$f":"IF(AND(E8>0,A22>0),ABS(2*B23),0)","v":0},{"$f":"IF(AND(E8>0,A22>0),ABS(C3-R3+R5-(R6/2)),0)","v":0},{"$f":"IF(AND(E8>0,A22>0),ABS(K6+6),0)","v":0},{"$f":"IF(AND(E8>0,A22>0),ABS(2*B23),0)","v":0},null,null,null,"Zazor",{"$f":"IF(D33=\"Aluplast 033\",8,IF(D33=\"Aluplast 034\",8,IF(D33=\"Aluplast 035\",8,IF(D33=\"Profilink 033\",14,IF(D33=\"Profilink 035\",14,\"Izaberi Profil\")))))","v":"Izaberi Profil"}]
[null,null,null,null,null,null,"Leteća",{"$f":"IF(AND(E8>0,A22>0),H6-78,0)","v":0},null,{"$f":"IF(AND(E8>0,A22>0),B23,0)","v":0},null,null,null,null,null,null,"Prag",{"$f":"IF(D33=\"Aluplast 033\",20,IF(D33=\"Aluplast 034\",20,IF(D33=\"Aluplast 035\",20,IF(D33=\"Profilink 033\",20,IF(D33=\"Profilink 035\",20,\"Izaberi profil\")))))","v":"Izaberi profil"}]
[null,null,null,null,null,null,"Armatura"]
[null,null,null,null,null,null,null,"Visina",null,"kom","Širina",null,"kom"]
[null,null,null,null,null,null,"Štok",{"$f":"IF(AND(E8>0,A22>0),H4-60,0)","v":0},null,{"$f":"IF(AND(E8>0,A22>0),ABS(2*B23),0)","v":0},{"$f":"IF(AND(E8>0,A22>0),K4-110,0)","v":0},null,{"$f":"IF(AND(E8>0,A22>0),ABS(B23),0)","v":0}]
[null,null,null,null,null,null,"Krilo",{"$f":"IF(AND(E8>0,A22>0),H5-130,0)","v":0},null,{"$f":"IF(AND(E8>0,A22>0),ABS(2*B23),0)","v":0},{"$f":"IF(AND(E8>0,A22>0),K5-130,0)","v":0},null,{"$f":"IF(AND(E8>0,A22>0),ABS(2*B23),0)","v":0}]
[null,null,null,null,null,null,"Krilo",{"$f":"IF(AND(E8>0,A22>0),H6-130,0)","v":0},null,{"$f":"IF(AND(E8>0,A22>0),ABS(2*B23),0)","v":0},{"$f":"IF(AND(E8>0,A22>0),K6-130,0)","v":0},null,{"$f":"IF(AND(E8>0,A22>0),ABS(2*B23),0)","v":0}]
[null,null,null,null,null,null,"Leteća",{"$f":"IF(AND(E8>0,A22>0),H7-10,0)","v":0},null,{"$f":"IF(AND(E8>0,A22>0),B23,0)","v":0}]
[null,null,null,null,null,null,"Ispuna"]
[null,null,null,null,null,null,null,"Visina",null,"Širina",null,"kom"]
[null,null,null,null,null,null,null,{"$f":"IF(AND(E8>0,A22>0),ABS(SUM(H5-2*R4-10)),0)","v":0},null,{"$f":"IF(AND(E8>0,A22>0),ABS(SUM(K5-2*R4-10)),0)","v":0},null,{"$f":"IF(AND(E8>0,A22>0),ABS(B23),0)","v":0}]
[null,null,null,null,null,null,null,{"$f":"IF(AND(E8>0,A22>0),ABS(SUM(H5-2*R4-10)),0)","v":0},null,{"$f":"IF(AND(E8>0,A22>0),ABS(SUM(K6-2*R4-10)),0)","v":0},null,{"$f":"IF(AND(E8>0,A22>0),ABS(B23),0)","v":0}]
[null,null,null,null,null,null,null,null,null,null,"Falc. Širina:",{"$f":"IF(AND(E8>0,A22>0),K5-40,0)","v":0}]
[null,null,null,null,null,null,"Okov                               ",null,null,null,"Falc. Visina:",{"$f":"IF(AND(E8>0,A22>0),H5-40,0)","v":0}]
[null,null,null,null,null,null,"Naziv",null,null,"L/R","Velličina","kom"]
[null,null,null,null,null,null,"Zasun donji",null,null,null,null,{"$f":"B23","v":0}]
[null,null,null,null,null,null,"Zasun gornji",null,null,null,null,{"$f":"B23","v":0}]
["Komada:",null,null,null,null,null,"Čepovi leteće",null,null,null,null,{"$f":"2*J13","v":0}]
["Napomena:",null,null,null,null,null,"Dr. Hanh Šarke",null,null,null,null,{"$f":"5*B23","v":0}]
[null,null,null,null,null,null,"Spojnice T Prečke",null,null,null,null,{"$f":"4*B23","v":0}]
[null,null,null,null,null,null,"Ručka",null,null,null,null,{"$f":"B23","v":0}]
[null,null,null,null,null,null,"Splic pleh",null,null,{"$f":"C23","v":0},null,{"$f":"B23","v":0}]
["Kupac:",null,null,null,null,null,"Cilindar",null,null,null,null,{"$f":"B23","v":0}]
["Adresa:"]
["Tel:"]
["Datum:",{"$f":"TODAY()","v":"2011-04-11"}]
[null,null,"Potvrdi"]
[null,null,"Profil"]
[null,null,"Boja"]

{"sheet":"Poručivanje okova","index":9,"n_rows":55,"n_cols":12,"rows_kept":55,"cut":false,"hidden":false,"merged":[[0,2,0,3]]}
["Okov","Šifra","L/R",null,"Kom",null,"1k-ok","1k-ok-1o","1k-fix","2k-ok-fix","1k-ok-2fix","2k-ok-2fix"]
["Bočni zatvarač"]
["350-450","G-22120-00-0-1",null,null,{"$f":"IF(SUM(G3:L3)=0,\"\",SUM(G3:L3))","v":""},null,{"$f":"IF(AND('k1-OK'!$D$32=\"Obradi\",'k1-OK'!$K$24=A3),'k1-OK'!$L$24,\"\")","v":""},{"$f":"IF(AND('1K-OK-1O'!$D$32=\"Obradi\",'1K-OK-1O'!$K$29=A3),'1K-OK-1O'!$L$29,\"\")","v":""},{"$f":"IF(AND('1K-FIX'!$D$32=\"Obradi\",'1K-FIX'!$K$26=A3),'1K-FIX'!$L$26,\"\")","v":""},{"$f":"IF(AND('2K-OK-FIX'!$D$32=\"Obradi\",'2K-OK-FIX'!$K$33=A3),'2K-OK-FIX'!$L$33,\"\")","v":""},{"$f":"IF(AND('1K-OK-2FIX'!$D$32=\"Obradi\",'1K-OK-2FIX'!$L$28=A3),'1K-OK-2FIX'!$M$28,\"\")","v":""},{"$f":"IF(AND('2K-OK-2FIX'!$D$33=\"Obradi\",'2K-OK-2FIX'!$L$30=A3),'2K-OK-2FIX'!$M$30,\"\")","v":""}]
["451-550","G-22121-00-0-1",null,null,{"$f":"IF(SUM(G4:L4)=0,\"\",SUM(G4:L4))","v":""},null,{"$f":"IF(AND('k1-OK'!$D$32=\"Obradi\",'k1-OK'!$K$24=A4),'k1-OK'!$L$24,\"\")","v":""},{"$f":"IF(AND('1K-OK-1O'!$D$32=\"Obradi\",'1K-OK-1O'!$K$29=A4),'1K-OK-1O'!$L$29,\"\")","v":""},{"$f":"IF(AND('1K-FIX'!$D$32=\"Obradi\",'1K-FIX'!$K$26=A4),'1K-FIX'!$L$26,\"\")","v":""},{"$f":"IF(AND('2K-OK-FIX'!$D$32=\"Obradi\",'2K-OK-FIX'!$K$33=A4),'2K-OK-FIX'!$L$33,\"\")","v":""},{"$f":"IF(AND('1K-OK-2FIX'!$D$32=\"Obradi\",'1K-OK-2FIX'!$L$28=A4),'1K-OK-2FIX'!$M$28,\"\")","v":""},{"$f":"IF(AND('2K-OK-2FIX'!$D$33=\"Obradi\",'2K-OK-2FIX'!$L$30=A4),'2K-OK-2FIX'!$M$30,\"\")","v":""}]
["551-720","G-22122-00-0-1",null,null,{"$f":"IF(SUM(G5:L5)=0,\"\",SUM(G5:L5))","v":""},null,{"$f":"IF(AND('k1-OK'!$D$32=\"Obradi\",'k1-OK'!$K$24=A5),'k1-OK'!$L$24,\"\")","v":""},{"$f":"IF(AND('1K-OK-1O'!$D$32=\"Obradi\",'1K-OK-1O'!$K$29=A5),'1K-OK-1O'!$L$29,\"\")","v":""},{"$f":"IF(AND('1K-FIX'!$D$32=\"Obradi\",'1K-FIX'!$K$26=A5),'1K-FIX'!$L$26,\"\")","v":""},{"$f":"IF(AND('2K-OK-FIX'!$D$32=\"Obradi\",'2K-OK-FIX'!$K$33=A5),'2K-OK-FIX'!$L$33,\"\")","v":""},{"$f":"IF(AND('1K-OK-2FIX'!$D$32=\"Obradi\",'1K-OK-2FIX'!$L$28=A5),'1K-OK-2FIX'!$M$28,\"\")","v":""},{"$f":"IF(AND('2K-OK-2FIX'!$D$33=\"Obradi\",'2K-OK-2FIX'!$L$30=A5),'2K-OK-2FIX'!$M$30,\"\")","v":""}]
["721-850","G-22123-00-0-1",null,null,"",null,{"$f":"IF(AND('k1-OK'!$D$32=\"Obradi\",'k1-OK'!$K$24=A6),'k1-OK'!$L$24,\"\")","v":""},{"$f":"IF(AND('1K-OK-1O'!$D$32=\"Obradi\",'1K-OK-1O'!$K$29=A6),'1K-OK-1O'!$L$29,\"\")","v":""},{"$f":"IF(AND('1K-FIX'!$D$32=\"Obradi\",'1K-FIX'!$K$26=A6),'1K-FIX'!$L$26,\"\")","v":""},{"$f":"IF(AND('2K-OK-FIX'!$D$32=\"Obradi\",'2K-OK-FIX'!$K$33=A6),'2K-OK-FIX'!$L$33,\"\")","v":""},{"$f":"IF(AND('1K-OK-2FIX'!$D$32=\"Obradi\",'1K-OK-2FIX'!$L$28=A6),'1K-OK-2FIX'!$M$28,\"\")","v":""},{"$f":"IF(AND('2K-OK-2FIX'!$D$33=\"Obradi\",'2K-OK-2FIX'!$L$30=A6),'2K-OK-2FIX'!$M$30,\"\")","v":""}]
["851-1100","G-22124-00-0-1",null,null,"",null,{"$f":"IF(AND('k1-OK'!$D$32=\"Obradi\",'k1-OK'!$K$24=A7),'k1-OK'!$L$24,\"\")","v":""},{"$f":"IF(AND('1K-OK-1O'!$D$32=\"Obradi\",'1K-OK-1O'!$K$29=A7),'1K-OK-1O'!$L$29,\"\")","v":""},{"$f":"IF(AND('1K-FIX'!$D$32=\"Obradi\",'1K-FIX'!$K$26=A7),'1K-FIX'!$L$26,\"\")","v":""},{"$f":"IF(AND('2K-OK-FIX'!$D$32=\"Obradi\",'2K-OK-FIX'!$K$33=A7),'2K-OK-FIX'!$L$33,\"\")","v":""},{"$f":"IF(AND('1K-OK-2FIX'!$D$32=\"Obradi\",'1K-OK-2FIX'!$L$28=A7),'1K-OK-2FIX'!$M$28,\"\")","v":""},{"$f":"IF(AND('2K-OK-2FIX'!$D$33=\"Obradi\",'2K-OK-2FIX'!$L$30=A7),'2K-OK-2FIX'!$M$30,\"\")","v":""}]
["1101-1350","G-22125-00-0-1",null,null,"",null,{"$f":"IF(AND('k1-OK'!$D$32=\"Obradi\",'k1-OK'!$K$24=A8),'k1-OK'!$L$24,\"\")","v":""},{"$f":"IF(AND('1K-OK-1O'!$D$32=\"Obradi\",'1K-OK-1O'!$K$29=A8),'1K-OK-1O'!$L$29,\"\")","v":""},{"$f":"IF(AND('1K-FIX'!$D$32=\"Obradi\",'1K-FIX'!$K$26=A8),'1K-FIX'!$L$26,\"\")","v":""},{"$f":"IF(AND('2K-OK-FIX'!$D$32=\"Obradi\",'2K-OK-FIX'!$K$33=A8),'2K-OK-FIX'!$L$33,\"\")","v":""},{"$f":"IF(AND('1K-OK-2FIX'!$D$32=\"Obradi\",'1K-OK-2FIX'!$L$28=A8),'1K-OK-2FIX'!$M$28,\"\")","v":""},{"$f":"IF(AND('2K-OK-2FIX'!$D$33=\"Obradi\",'2K-OK-2FIX'!$L$30=A8),'2K-OK-2FIX'!$M$30,\"\")","v":""}]
["1351-1600","G-22127-00-0-1",null,null,"",null,{"$f":"IF(AND('k1-OK'!$D$32=\"Obradi\",'k1-OK'!$K$24=A9),'k1-OK'!$L$24,\"\")","v":""},{"$f":"IF(AND('1K-OK-1O'!$D$32=\"Obradi\",'1K-OK-1O'!$K$29=A9),'1K-OK-1O'!$L$29,\"\")","v":""},{"$f":"IF(AND('1K-FIX'!$D$32=\"Obradi\",'1K-FIX'!$K$26=A9),'1K-FIX'!$L$26,\"\")","v":""},{"$f":"IF(AND('2K-OK-FIX'!$D$32=\"Obradi\",'2K-OK-FIX'!$K$33=A9),'2K-OK-FIX'!$L$33,\"\")","v":""},{"$f":"IF(AND('1K-OK-2FIX'!$D$32=\"Obradi\",'1K-OK-2FIX'!$L$28=A9),'1K-OK-2FIX'!$M$28,\"\")","v":""},{"$f":"IF(AND('2K-OK-2FIX'!$D$33=\"Obradi\",'2K-OK-2FIX'!$L$30=A9),'2K-OK-2FIX'!$M$30,\"\")","v":""}]
["1601-1850","G-22128-00-0-1",null,null,"",null,{"$f":"IF(AND('k1-OK'!$D$32=\"Obradi\",'k1-OK'!$K$24=A10),'k1-OK'!$L$24,\"\")","v":""},{"$f":"IF(AND('1K-OK-1O'!$D$32=\"Obradi\",'1K-OK-1O'!$K$29=A10),'1K-OK-1O'!$L$29,\"\")","v":""},{"$f":"IF(AND('1K-FIX'!$D$32=\"Obradi\",'1K-FIX'!$K$26=A10),'1K-FIX'!$L$26,\"\")","v":""},{"$f":"IF(AND('2K-OK-FIX'!$D$32=\"Obradi\",'2K-OK-FIX'!$K$33=A10),'2K-OK-FIX'!$L$33,\"\")","v":""},{"$f":"IF(AND('1K-OK-2FIX'!$D$32=\"Obradi\",'1K-OK-2FIX'!$L$28=A10),'1K-OK-2FIX'!$M$28,\"\")","v":""},{"$f":"IF(AND('2K-OK-2FIX'!$D$33=\"Obradi\",'2K-OK-2FIX'!$L$30=A10),'2K-OK-2FIX'!$M$30,\"\")","v":""}]
["1851-2100","G-22133-00-0-1",null,null,"",null,{"$f":"IF(AND('k1-OK'!$D$32=\"Obradi\",'k1-OK'!$K$24=A11),'k1-OK'!$L$24,\"\")","v":""},{"$f":"IF(AND('1K-OK-1O'!$D$32=\"Obradi\",'1K-OK-1O'!$K$29=A11),'1K-OK-1O'!$L$29,\"\")","v":""},{"$f":"IF(AND('1K-FIX'!$D$32=\"Obradi\",'1K-FIX'!$K$26=A11),'1K-FIX'!$L$26,\"\")","v":""},{"$f":"IF(AND('2K-OK-FIX'!$D$32=\"Obradi\",'2K-OK-FIX'!$K$33=A11),'2K-OK-FIX'!$L$33,\"\")","v":""},{"$f":"IF(AND('1K-OK-2FIX'!$D$32=\"Obradi\",'1K-OK-2FIX'!$L$28=A11),'1K-OK-2FIX'!$M$28,\"\")","v":""},{"$f":"IF(AND('2K-OK-2FIX'!$D$33=\"Obradi\",'2K-OK-2FIX'!$L$30=A11),'2K-OK-2FIX'!$M$30,\"\")","v":""}]
["2101-2350","G-22134-00-0-1",null,null,"",null,{"$f":"IF(AND('k1-OK'!$D$32=\"Obradi\",'k1-OK'!$K$24=A12),'k1-OK'!$L$24,\"\")","v":""},{"$f":"IF(AND('1K-OK-1O'!$D$32=\"Obradi\",'1K-OK-1O'!$K$29=A12),'1K-OK-1O'!$L$29,\"\")","v":""},{"$f":"IF(AND('1K-FIX'!$D$32=\"Obradi\",'1K-FIX'!$K$26=A12),'1K-FIX'!$L$26,\"\")","v":""},{"$f":"IF(AND('2K-OK-FIX'!$D$32=\"Obradi\",'2K-OK-FIX'!$K$33=A12),'2K-OK-FIX'!$L$33,\"\")","v":""},{"$f":"IF(AND('1K-OK-2FIX'!$D$32=\"Obradi\",'1K-OK-2FIX'!$L$28=A12),'1K-OK-2FIX'!$M$28,\"\")","v":""},{"$f":"IF(AND('2K-OK-2FIX'!$D$33=\"Obradi\",'2K-OK-2FIX'!$L$30=A12),'2K-OK-2FIX'!$M$30,\"\")","v":""}]
["Telo Makaze"]
["280-400",null,null,null,{"$f":"IF(SUM(G14:L14)=0,\"\",SUM(G14:L14))","v":""},null,{"$f":"IF(AND('k1-OK'!$D$32=\"Obradi\",'k1-OK'!$K$23=A14),'k1-OK'!$L$23,\"\")","v":""},{"$f":"IF(AND('1K-OK-1O'!$D$32=\"Obradi\",'1K-OK-1O'!$K$28=A14),'1K-OK-1O'!$L$28,\"\")","v":""},{"$f":"IF(AND('1K-FIX'!$D$32=\"Obradi\",'1K-FIX'!$K$25=A14),'1K-FIX'!$L$25,\"\")","v":""},{"$f":"IF(AND('2K-OK-FIX'!$D$32=\"Obradi\",'2K-OK-FIX'!$K$32=A14),'2K-OK-FIX'!$L$32,\"\")","v":""},{"$f":"IF(AND('1K-OK-2FIX'!$D$32=\"Obradi\",'1K-OK-2FIX'!$L$27=A14),'1K-OK-2FIX'!$M$27,\"\")","v":""},{"$f":"IF(AND('2K-OK-2FIX'!$D$33=\"Obradi\",'2K-OK-2FIX'!$L$29=A14),'1K-OK-2FIX'!$M$29,\"\")","v":""}]
["401-500",null,null,null,{"$f":"IF(SUM(G15:L15)=0,\"\",SUM(G15:L15))","v":""},null,{"$f":"IF(AND('k1-OK'!$D$32=\"Obradi\",'k1-OK'!$K$23=A15),'k1-OK'!$L$23,\"\")","v":""},{"$f":"IF(AND('1K-OK-1O'!$D$32=\"Obradi\",'1K-OK-1O'!$K$28=A15),'1K-OK-1O'!$L$28,\"\")","v":""},{"$f":"IF(AND('1K-FIX'!$D$32=\"Obradi\",'1K-FIX'!$K$25=A15),'1K-FIX'!$L$25,\"\")","v":""},{"$f":"IF(AND('2K-OK-FIX'!$D$32=\"Obradi\",'2K-OK-FIX'!$K$32=A15),'2K-OK-FIX'!$L$32,\"\")","v":""},{"$f":"IF(AND('1K-OK-2FIX'!$D$32=\"Obradi\",'1K-OK-2FIX'!$L$27=A15),'1K-OK-2FIX'!$M$27,\"\")","v":""},{"$f":"IF(AND('2K-OK-2FIX'!$D$33=\"Obradi\",'2K-OK-2FIX'!$L$29=A15),'1K-OK-2FIX'!$M$29,\"\")","v":""}]
["501-750","6-31512-06-0-1",null,null,"",null,{"$f":"IF(AND('k1-OK'!$D$32=\"Obradi\",'k1-OK'!$K$23=A16),'k1-OK'!$L$23,\"\")","v":""},{"$f":"IF(AND('1K-OK-1O'!$D$32=\"Obradi\",'1K-OK-1O'!$K$28=A16),'1K-OK-1O'!$L$28,\"\")","v":""},{"$f":"IF(AND('1K-FIX'!$D$32=\"Obradi\",'1K-FIX'!$K$25=A16),'1K-FIX'!$L$25,\"\")","v":""},{"$f":"IF(AND('2K-OK-FIX'!$D$32=\"Obradi\",'2K-OK-FIX'!$K$32=A16),'2K-OK-FIX'!$L$32,\"\")","v":""},{"$f":"IF(AND('1K-OK-2FIX'!$D$32=\"Obradi\",'1K-OK-2FIX'!$L$27=A16),'1K-OK-2FIX'!$M$27,\"\")","v":""},{"$f":"IF(AND('2K-OK-2FIX'!$D$33=\"Obradi\",'2K-OK-2FIX'!$L$29=A16),'1K-OK-2FIX'!$M$29,\"\")","v":""}]
["751-950","6-31512-08-0-1",null,null,"",null,{"$f":"IF(AND('k1-OK'!$D$32=\"Obradi\",'k1-OK'!$K$23=A17),'k1-OK'!$L$23,\"\")","v":""},{"$f":"IF(AND('1K-OK-1O'!$D$32=\"Obradi\",'1K-OK-1O'!$K$28=A17),'1K-OK-1O'!$L$28,\"\")","v":""},{"$f":"IF(AND('1K-FIX'!$D$32=\"Obradi\",'1K-FIX'!$K$25=A17),'1K-FIX'!$L$25,\"\")","v":""},{"$f":"IF(AND('2K-OK-FIX'!$D$32=\"Obradi\",'2K-OK-FIX'!$K$32=A17),'2K-OK-FIX'!$L$32,\"\")","v":""},{"$f":"IF(AND('1K-OK-2FIX'!$D$32=\"Obradi\",'1K-OK-2FIX'!$L$27=A17),'1K-OK-2FIX'!$M$27,\"\")","v":""},{"$f":"IF(AND('2K-OK-2FIX'!$D$33=\"Obradi\",'2K-OK-2FIX'!$L$29=A17),'1K-OK-2FIX'!$M$29,\"\")","v":""}]
["951-1200","6-31512-10-0-1",null,null,"",null,{"$f":"IF(AND('k1-OK'!$D$32=\"Obradi\",'k1-OK'!$K$23=A18),'k1-OK'!$L$23,\"\")","v":""},{"$f":"IF(AND('1K-OK-1O'!$D$32=\"Obradi\",'1K-OK-1O'!$K$28=A18),'1K-OK-1O'!$L$28,\"\")","v":""},{"$f":"IF(AND('1K-FIX'!$D$32=\"Obradi\",'1K-FIX'!$K$25=A18),'1K-FIX'!$L$25,\"\")","v":""},{"$f":"IF(AND('2K-OK-FIX'!$D$32=\"Obradi\",'2K-OK-FIX'!$K$32=A18),'2K-OK-FIX'!$L$32,\"\")","v":""},{"$f":"IF(AND('1K-OK-2FIX'!$D$32=\"Obradi\",'1K-OK-2FIX'!$L$27=A18),'1K-OK-2FIX'!$M$27,\"\")","v":""},{"$f":"IF(AND('2K-OK-2FIX'!$D$33=\"Obradi\",'2K-OK-2FIX'!$L$29=A18),'1K-OK-2FIX'!$M$29,\"\")","v":""}]
["1201-1450","6-31512-12-0-1",null,null,"",null,{"$f":"IF(AND('k1-OK'!$D$32=\"Obradi\",'k1-OK'!$K$23=A19),'k1-OK'!$L$23,\"\")","v":""},{"$f":"IF(AND('1K-OK-1O'!$D$32=\"Obradi\",'1K-OK-1O'!$K$28=A19),'1K-OK-1O'!$L$28,\"\")","v":""},{"$f":"IF(AND('1K-FIX'!$D$32=\"Obradi\",'1K-FIX'!$K$25=A19),'1K-FIX'!$L$25,\"\")","v":""},{"$f":"IF(AND('2K-OK-FIX'!$D$32=\"Obradi\",'2K-OK-FIX'!$K$32=A19),'2K-OK-FIX'!$L$32,\"\")","v":""},{"$f":"IF(AND('1K-OK-2FIX'!$D$32=\"Obradi\",'1K-OK-2FIX'!$L$27=A19),'1K-OK-2FIX'!$M$27,\"\")","v":""},{"$f":"IF(AND('2K-OK-2FIX'!$D$33=\"Obradi\",'2K-OK-2FIX'!$L$29=A19),'1K-OK-2FIX'!$M$29,\"\")","v":""}]
["1451-1600","6-31512-12-0-1",null,null,"",null,{"$f":"IF(AND('k1-OK'!$D$32=\"Obradi\",'k1-OK'!$K$23=A20),'k1-OK'!$L$23,\"\")","v":""},{"$f":"IF(AND('1K-OK-1O'!$D$32=\"Obradi\",'1K-OK-1O'!$K$28=A20),'1K-OK-1O'!$L$28,\"\")","v":""},{"$f":"IF(AND('1K-FIX'!$D$32=\"Obradi\",'1K-FIX'!$K$25=A20),'1K-FIX'!$L$25,\"\")","v":""},{"$f":"IF(AND('2K-OK-FIX'!$D$32=\"Obradi\",'2K-OK-FIX'!$K$32=A20),'2K-OK-FIX'!$L$32,\"\")","v":""},{"$f":"IF(AND('1K-OK-2FIX'!$D$32=\"Obradi\",'1K-OK-2FIX'!$L$27=A20),'1K-OK-2FIX'!$M$27,\"\")","v":""},{"$f":"IF(AND('2K-OK-2FIX'!$D$33=\"Obradi\",'2K-OK-2FIX'!$L$29=A20),'1K-OK-2FIX'!$M$29,\"\")","v":""}]
["Ruka makaze"]
["280-500","6-31690-20-L/R-1",null,null,null,null,{"$f":"IF(AND('k1-OK'!$D$32=\"Obradi\",'k1-OK'!$K$22=A22),'k1-OK'!$L$22,\"\")","v":""},{"$f":"IF(AND('1K-OK-1O'!$D$32=\"Obradi\",'1K-OK-1O'!$K$27=A22),'1K-OK-1O'!$L$27,\"\")","v":""},{"$f":"IF(AND('1K-FIX'!$D$32=\"Obradi\",'1K-FIX'!$K$24=A22),'1K-FIX'!$L$24,\"\")","v":""},{"$f":"IF(AND('2K-OK-FIX'!$D$32=\"Obradi\",'2K-OK-FIX'!$K$30=A22),'2K-OK-FIX'!$L$30,\"\")","v":""},{"$f":"IF(AND('1K-OK-2FIX'!$D$32=\"Obradi\",'1K-OK-2FIX'!$L$26=A22),'1K-OK-2FIX'!$M$26,\"\")","v":""},{"$f":"IF(AND('2K-OK-2FIX'!$D$33=\"Obradi\",'2K-OK-2FIX'!$L$28=A22),'2K-OK-2FIX'!$M$28,\"\")","v":""}]
["501-750","6-31691-20-L/R-1",null,null,null,null,{"$f":"IF(AND('k1-OK'!$D$32=\"Obradi\",'k1-OK'!$K$22=A23),'k1-OK'!$L$22,\"\")","v":""},{"$f":"IF(AND('1K-OK-1O'!$D$32=\"Obradi\",'1K-OK-1O'!$K$27=A23),'1K-OK-1O'!$L$27,\"\")","v":""},{"$f":"IF(AND('1K-FIX'!$D$32=\"Obradi\",'1K-FIX'!$K$24=A23),'1K-FIX'!$L$24,\"\")","v":""},{"$f":"IF(AND('2K-OK-FIX'!$D$32=\"Obradi\",'2K-OK-FIX'!$K$30=A23),'2K-OK-FIX'!$L$30,\"\")","v":""},{"$f":"IF(AND('1K-OK-2FIX'!$D$32=\"Obradi\",'1K-OK-2FIX'!$L$26=A23),'1K-OK-2FIX'!$M$26,\"\")","v":""},{"$f":"IF(AND('2K-OK-2FIX'!$D$33=\"Obradi\",'2K-OK-2FIX'!$L$28=A23),'2K-OK-2FIX'!$M$28,\"\")","v":""}]
["751-1200","6-31692-20-L/R-1",null,null,null,null,{"$f":"IF(AND('k1-OK'!$D$32=\"Obradi\",'k1-OK'!$K$22=A24),'k1-OK'!$L$22,\"\")","v":""},{"$f":"IF(AND('1K-OK-1O'!$D$32=\"Obradi\",'1K-OK-1O'!$K$27=A24),'1K-OK-1O'!$L$27,\"\")","v":""},{"$f":"IF(AND('1K-FIX'!$D$32=\"Obradi\",'1K-FIX'!$K$24=A24),'1K-FIX'!$L$24,\"\")","v":""},{"$f":"IF(AND('2K-OK-FIX'!$D$32=\"Obradi\",'2K-OK-FIX'!$K$30=A24),'2K-OK-FIX'!$L$30,\"\")","v":""},{"$f":"IF(AND('1K-OK-2FIX'!$D$32=\"Obradi\",'1K-OK-2FIX'!$L$26=A24),'1K-OK-2FIX'!$M$26,\"\")","v":""},{"$f":"IF(AND('2K-OK-2FIX'!$D$33=\"Obradi\",'2K-OK-2FIX'!$L$28=A24),'2K-OK-2FIX'!$M$28,\"\")","v":""}]
["1201-1600","6-31693-20-L/R-1",null,null,null,null,{"$f":"IF(AND('k1-OK'!$D$32=\"Obradi\",'k1-OK'!$K$22=A25),'k1-OK'!$L$22,\"\")","v":""},{"$f":"IF(AND('1K-OK-1O'!$D$32=\"Obradi\",'1K-OK-1O'!$K$27=A25),'1K-OK-1O'!$L$27,\"\")","v":""},{"$f":"IF(AND('1K-FIX'!$D$32=\"Obradi\",'1K-FIX'!$K$24=A25),'1K-FIX'!$L$24,\"\")","v":""},{"$f":"IF(AND('2K-OK-FIX'!$D$32=\"Obradi\",'2K-OK-FIX'!$K$30=A25),'2K-OK-FIX'!$L$30,\"\")","v":""},{"$f":"IF(AND('1K-OK-2FIX'!$D$32=\"Obradi\",'1K-OK-2FIX'!$L$26=A25),'1K-OK-2FIX'!$M$26,\"\")","v":""},{"$f":"IF(AND('2K-OK-2FIX'!$D$33=\"Obradi\",'2K-OK-2FIX'!$L$28=A25),'2K-OK-2FIX'!$M$28,\"\")","v":""}]
["Srednji zatvarač po širini"]
["280-750","6-32012-00-0-1",null,null,{"$f":"IF(SUM(G27:L27)=0,\"\",SUM(G27:L27))","v":""},null,{"$f":"IF(AND('k1-OK'!$D$32=\"Obradi\",'k1-OK'!$K$25=A27),'k1-OK'!$L$25,\"\")","v":""},{"$f":"IF(AND('1K-OK-1O'!$D$32=\"Obradi\",'1K-OK-1O'!$K$30=A27),'1K-OK-1O'!$L$30,\"\")","v":""},{"$f":"IF(AND('1K-FIX'!$D$32=\"Obradi\",'1K-FIX'!$K$27=A27),'1K-FIX'!$L$27,\"\")","v":""},{"$f":"IF(AND('2K-OK-FIX'!$D$32=\"Obradi\",'2K-OK-FIX'!$K$34=A27),'2K-OK-FIX'!$L$34,\"\")","v":""},{"$f":"IF(AND('1K-OK-2FIX'!$D$32=\"Obradi\",'1K-OK-2FIX'!$L$29=A27),'1K-OK-2FIX'!$M$29,\"\")","v":""},{"$f":"IF(AND('2K-OK-2FIX'!$D$33=\"Obradi\",'2K-OK-2FIX'!$L$31=A27),'1K-OK-2FIX'!$M$31,\"\")","v":""}]
["751-950","6-32076-05-0-1",null,null,{"$f":"IF(SUM(G28:L28)=0,\"\",SUM(G28:L28))","v":""},null,{"$f":"IF(AND('k1-OK'!$D$32=\"Obradi\",'k1-OK'!$K$25=A28),'k1-OK'!$L$25,\"\")","v":""},{"$f":"IF(AND('1K-OK-1O'!$D$32=\"Obradi\",'1K-OK-1O'!$K$30=A28),'1K-OK-1O'!$L$30,\"\")","v":""},{"$f":"IF(AND('1K-FIX'!$D$32=\"Obradi\",'1K-FIX'!$K$27=A28),'1K-FIX'!$L$27,\"\")","v":""},{"$f":"IF(AND('2K-OK-FIX'!$D$32=\"Obradi\",'2K-OK-FIX'!$K$34=A28),'2K-OK-FIX'!$L$34,\"\")","v":""},{"$f":"IF(AND('1K-OK-2FIX'!$D$32=\"Obradi\",'1K-OK-2FIX'!$L$29=A28),'1K-OK-2FIX'!$M$29,\"\")","v":""},{"$f":"IF(AND('2K-OK-2FIX'!$D$33=\"Obradi\",'2K-OK-2FIX'!$L$31=A28),'1K-OK-2FIX'!$M$31,\"\")","v":""}]
["951-1200","6-32076-07-0-1",null,null,"",null,{"$f":"IF(AND('k1-OK'!$D$32=\"Obradi\",'k1-OK'!$K$25=A29),'k1-OK'!$L$25,\"\")","v":""},{"$f":"IF(AND('1K-OK-1O'!$D$32=\"Obradi\",'1K-OK-1O'!$K$30=A29),'1K-OK-1O'!$L$30,\"\")","v":""},{"$f":"IF(AND('1K-FIX'!$D$32=\"Obradi\",'1K-FIX'!$K$27=A29),'1K-FIX'!$L$27,\"\")","v":""},{"$f":"IF(AND('2K-OK-FIX'!$D$32=\"Obradi\",'2K-OK-FIX'!$K$34=A29),'2K-OK-FIX'!$L$34,\"\")","v":""},{"$f":"IF(AND('1K-OK-2FIX'!$D$32=\"Obradi\",'1K-OK-2FIX'!$L$29=A29),'1K-OK-2FIX'!$M$29,\"\")","v":""},{"$f":"IF(AND('2K-OK-2FIX'!$D$33=\"Obradi\",'2K-OK-2FIX'!$L$31=A29),'1K-OK-2FIX'!$M$31,\"\")","v":""}]
["1201-1600","6-32076-10-0-1",null,null,"",null,{"$f":"IF(AND('k1-OK'!$D$32=\"Obradi\",'k1-OK'!$K$25=A30),'k1-OK'!$L$25,\"\")","v":""},{"$f":"IF(AND('1K-OK-1O'!$D$32=\"Obradi\",'1K-OK-1O'!$K$30=A30),'1K-OK-1O'!$L$30,\"\")","v":""},{"$f":"IF(AND('1K-FIX'!$D$32=\"Obradi\",'1K-FIX'!$K$27=A30),'1K-FIX'!$L$27,\"\")","v":""},{"$f":"IF(AND('2K-OK-FIX'!$D$32=\"Obradi\",'2K-OK-FIX'!$K$34=A30),'2K-OK-FIX'!$L$34,\"\")","v":""},{"$f":"IF(AND('1K-OK-2FIX'!$D$32=\"Obradi\",'1K-OK-2FIX'!$L$29=A30),'1K-OK-2FIX'!$M$29,\"\")","v":""},{"$f":"IF(AND('2K-OK-2FIX'!$D$33=\"Obradi\",'2K-OK-2FIX'!$L$31=A30),'1K-OK-2FIX'!$M$31,\"\")","v":""}]
["Šarke"]
["Donji nosač na ramu","6-28743-03-0-7",null,null,{"$f":"IF(SUM(G32:L32)=0,\"\",SUM(G32:L32))","v":""},null,{"$f":"IF('k1-OK'!$D$32=\"Obradi\",'k1-OK'!$L19,\"\")","v":""},{"$f":"IF('1K-OK-1O'!$D$32=\"Obradi\",'1K-OK-1O'!$L23,\"\")","v":""},{"$f":"IF('1K-FIX'!$D$32=\"Obradi\",'1K-FIX'!$L21,\"\")","v":""},{"$f":"IF('2K-OK-FIX'!$D$32=\"Obradi\",'2K-OK-FIX'!$L27,\"\")","v":""},{"$f":"IF('1K-OK-2FIX'!$D$32=\"Obradi\",'1K-OK-2FIX'!$M23,\"\")","v":""},{"$f":"IF('2K-OK-2FIX'!$D$33=\"Obradi\",'2K-OK-2FIX'!$M25,\"\")","v":""}]
["Gornji nosač na ramu","6-31636-03-0-1",null,null,{"$f":"IF(SUM(G33:L33)=0,\"\",SUM(G33:L33))","v":""},null,{"$f":"IF('k1-OK'!$D$32=\"Obradi\",'k1-OK'!$L20,\"\")","v":""},{"$f":"IF('1K-OK-1O'!$D$32=\"Obradi\",'1K-OK-1O'!$L24,\"\")","v":""},{"$f":"IF('1K-FIX'!$D$32=\"Obradi\",'1K-FIX'!$L22,\"\")","v":""},{"$f":"IF('2K-OK-FIX'!$D$32=\"Obradi\",'2K-OK-FIX'!$L28,\"\")","v":""},{"$f":"IF('1K-OK-2FIX'!$D$32=\"Obradi\",'1K-OK-2FIX'!$M24,\"\")","v":""},{"$f":"IF('2K-OK-2FIX'!$D$33=\"Obradi\",'2K-OK-2FIX'!$M26,\"\")","v":""}]
["Donji falcni nosač na krilu","6-31522-20-L/R-1",{"$f":"SUM('k1-OK:Vrata 1K'!Q9)","v":0},{"$f":"SUM('k1-OK:Vrata 1K'!Q10)","v":0},"",null,{"$f":"IF('k1-OK'!$D$32=\"Obradi\",'k1-OK'!$L21,\"\")","v":""},{"$f":"IF('1K-OK-1O'!$D$32=\"Obradi\",'1K-OK-1O'!$L25,\"\")","v":""},{"$f":"IF('1K-FIX'!$D$32=\"Obradi\",'1K-FIX'!$L23,\"\")","v":""},{"$f":"IF('2K-OK-FIX'!$D$32=\"Obradi\",'2K-OK-FIX'!$L29,\"\")","v":""},{"$f":"IF('1K-OK-2FIX'!$D$32=\"Obradi\",'1K-OK-2FIX'!$M25,\"\")","v":""},{"$f":"IF('2K-OK-2FIX'!$D$33=\"Obradi\",'2K-OK-2FIX'!$M27,\"\")","v":""}]
["Ostalo"]
["Ugaonik","6-32021-00-0-1",null,null,{"$f":"IF(SUM(G36:L36)=0,\"\",SUM(G36:L36))","v":""},null,{"$f":"IF('k1-OK'!$D$32=\"Obradi\",'k1-OK'!$L26,\"\")","v":""},{"$f":"IF('1K-OK-1O'!$D$32=\"Obradi\",'1K-OK-1O'!$L31,\"\")","v":""},{"$f":"IF('1K-FIX'!$D$32=\"Obradi\",'1K-FIX'!$L28,\"\")","v":""},{"$f":"IF('2K-OK-FIX'!$D$32=\"Obradi\",'2K-OK-FIX'!$L35,\"\")","v":""},{"$f":"IF('1K-OK-2FIX'!$D$32=\"Obradi\",'1K-OK-2FIX'!$M30,\"\")","v":""},{"$f":"IF('2K-OK-2FIX'!$D$33=\"Obradi\",'2K-OK-2FIX'!$M32,\"\")","v":""}]
["Ručka prozora","6-28072-00-0-7",null,null,{"$f":"IF(SUM(G37:L37)=0,\"\",SUM(G37:L37))","v":""}]
["Monoblok 92mm bela","K-16758-05-0-7",null,null,""]
["Sigurnosna brava 35/92",null,null,null,""]
["Sigurnosna brava 28/92",null,null,null,""]
["Brava 35/92",null,null,null,""]
["brava 25/92",null,null,null,""]
["Zasun donji","6-22916-00-0-1",null,null,"",null,null,{"$f":"IF('1K-OK-1O'!$D$32=\"Obradi\",'1K-OK-1O'!$L33,\"\")","v":""},null,{"$f":"IF('2K-OK-FIX'!$D$32=\"Obradi\",'2K-OK-FIX'!$L37,\"\")","v":""}]
["Zasun gornji","6-22917-00-0-1",null,null,"",null,null,{"$f":"IF('1K-OK-1O'!$D$32=\"Obradi\",'1K-OK-1O'!$L34,\"\")","v":""},null,{"$f":"IF('2K-OK-FIX'!$D$32=\"Obradi\",'2K-OK-FIX'!$L38,\"\")","v":""}]
["Šlic pleh za dvokrilna vrata","6-31661-1A-L/R-1",null,null,""]
["Šlic pleh za jednokrilna vrata","6-31601-07L/R-1",null,null,""]
["Cilindar-Uložak 40-50",null,null,null,""]
["Prihvatnik na štulpu","E-11794-12-0-1",null,null,"",null,{"$f":"IF('k1-OK'!$D$32=\"Obradi\",'k1-OK'!$L30,\"\")","v":""},{"$f":"IF('1K-OK-1O'!$D$32=\"Obradi\",'1K-OK-1O'!$L40,\"\")","v":""},{"$f":"IF('1K-FIX'!$D$32=\"Obradi\",'1K-FIX'!$L33,\"\")","v":""},{"$f":"IF('2K-OK-FIX'!$D$32=\"Obradi\",'2K-OK-FIX'!$L44,\"\")","v":""},{"$f":"IF('1K-OK-2FIX'!$D$32=\"Obradi\",'1K-OK-2FIX'!$M34,\"\")","v":""},{"$f":"IF('2K-OK-2FIX'!$D$33=\"Obradi\",'2K-OK-2FIX'!$M38,\"\")","v":""}]
["Prihvatnik na ramu","9-34907-00-0-1",null,null,"",null,null,{"$f":"IF('1K-OK-1O'!$D$32=\"Obradi\",'1K-OK-1O'!$L41,\"\")","v":""},null,{"$f":"IF('2K-OK-FIX'!$D$32=\"Obradi\",'2K-OK-FIX'!$L45,\"\")","v":""}]
["Prihvatnik zasuna","9-36227-00-0-1",null,null,"",null,{"$f":"IF('k1-OK'!$D$32=\"Obradi\",'k1-OK'!$L31,\"\")","v":""},{"$f":"IF('1K-OK-1O'!$D$32=\"Obradi\",'1K-OK-1O'!$L39,\"\")","v":""},{"$f":"IF('1K-FIX'!$D$32=\"Obradi\",'1K-FIX'!$L32,\"\")","v":""},{"$f":"IF('2K-OK-FIX'!$D$32=\"Obradi\",'2K-OK-FIX'!$L43,\"\")","v":""},{"$f":"IF('1K-OK-2FIX'!$D$32=\"Obradi\",'1K-OK-2FIX'!$M35,\"\")","v":""},{"$f":"IF('2K-OK-2FIX'!$D$33=\"Obradi\",'2K-OK-2FIX'!$M37,\"\")","v":""}]
["Prihvatnik nagiba","9-39847-00-0-1",null,null,""]
["DR. Hanh šarke - srednja (100kg)","H-00171-00-0-7",null,null,"",null,{"$f":"IF('k1-OK'!$D$32=\"Obradi\",'k1-OK'!$L29,\"\")","v":""},{"$f":"IF('1K-OK-1O'!$D$32=\"Obradi\",'1K-OK-1O'!$L23,\"\")","v":""},{"$f":"IF('1K-FIX'!$D$32=\"Obradi\",'1K-FIX'!$L21,\"\")","v":""},{"$f":"IF('2K-OK-FIX'!$D$32=\"Obradi\",'2K-OK-FIX'!$L27,\"\")","v":""},{"$f":"IF('1K-OK-2FIX'!$D$32=\"Obradi\",'1K-OK-2FIX'!$M23,\"\")","v":""},{"$f":"IF('2K-OK-2FIX'!$D$33=\"Obradi\",'2K-OK-2FIX'!$M25,\"\")","v":""}]
["Pokrivna kapa donjeg nosača na ramu","9-35461-00-0-7",null,null,"",null,{"$f":"IF('k1-OK'!$D$32=\"Obradi\",'k1-OK'!$L27,\"\")","v":""},{"$f":"IF('1K-OK-1O'!$D$32=\"Obradi\",'1K-OK-1O'!$L25,\"\")","v":""},{"$f":"IF('1K-FIX'!$D$32=\"Obradi\",'1K-FIX'!$L22,\"\")","v":""},{"$f":"IF('2K-OK-FIX'!$D$32=\"Obradi\",'2K-OK-FIX'!$L28,\"\")","v":""},{"$f":"IF('1K-OK-2FIX'!$D$32=\"Obradi\",'1K-OK-2FIX'!$M24,\"\")","v":""},{"$f":"IF('2K-OK-2FIX'!$D$33=\"Obradi\",'2K-OK-2FIX'!$M26,\"\")","v":""}]
["Pokrivna kapa gornjeg nosača na ramu","K-16791-00-0-7",null,null,"",null,{"$f":"IF('k1-OK'!$D$32=\"Obradi\",'k1-OK'!$L28,\"\")","v":""},{"$f":"IF('1K-OK-1O'!$D$32=\"Obradi\",'1K-OK-1O'!$L43,\"\")","v":""},{"$f":"IF('1K-FIX'!$D$32=\"Obradi\",'1K-FIX'!$L23,\"\")","v":""},{"$f":"IF('2K-OK-FIX'!$D$32=\"Obradi\",'2K-OK-FIX'!$L29,\"\")","v":""},{"$f":"IF('1K-OK-2FIX'!$D$32=\"Obradi\",'1K-OK-2FIX'!$M25,\"\")","v":""},{"$f":"IF('2K-OK-2FIX'!$D$33=\"Obradi\",'2K-OK-2FIX'!$M27,\"\")","v":""}]
["Pokrivna kapa donjeg falnog nosača","9-37725-00-L/R-7"]

{"sheet":"Otpremnica","index":10,"n_rows":47,"n_cols":18,"rows_kept":47,"cut":false,"hidden":false,"merged":[[17,4,17,5],[17,7,17,8],[0,0,1,8],[6,0,7,8],[10,1,10,2],[11,1,11,2],[12,1,12,2],[13,1,13,2],[15,2,15,3],[15,4,15,5],[15,7,15,8],[16,4,16,5],[16,7,16,8],[18,4,18,5],[18,7,18,8],[19,4,19,5],[19,7,19,8],[20,4,20,5],[20,7,20,8],[21,4,21,5],[21,7,21,8],[22,4,22,5],[22,7,22,8],[23,4,23,5],[23,7,23,8],[24,4,24,5],[24,7,24,8],[25,4,25,5],[25,7,25,8],[26,4,26,5],[26,7,26,8],[27,4,27,5],[27,7,27,8],[28,4,28,5],[28,7,28,8],[29,4,29,5],[29,7,29,8],[30,4,30,5],[30,7,30,8],[31,4,31,5],[31,7,31,8],[32,4,32,5],[32,7,32,8],[33,4,33,5],[33,7,33,8],[34,4,34,5],[34,7,34,8],[35,4,35,5],[35,7,35,8],[36,4,36,5],[36,7,36,8],[37,4,37,5],[37,7,37,8],[38,4,38,5],[38,7,38,8],[39,4,39,5],[39,7,39,8],[40,4,40,5],[40,7,40,8],[41,4,41,5],[41,7,41,8],[48,0,48,1],[48,7,48,8],[42,4,42,5],[42,7,42,8],[43,4,43,5],[43,7,43,8],[46,0,46,1],[46,7,46,8]]}
["SS MAGIS"]
[]
[]
[{"$f":"TODAY()","v":"2011-04-11"},null,null,null,null,null,null,null,null,null,null,null,null,null,null,"Dim1","Dim2","No"]
[null,null,null,null,null,null,null,null,null,null,null,null,null,null,"k1-OK",{"$f":"IF(INDIRECT(\"'\"&$O5&\"'!D32\")=\"Obradi\",INDIRECT(\"'\"&$O5&\"'!A21\"),\"\")","v":""},{"$f":"IF(INDIRECT(\"'\"&$O5&\"'!D32\")=\"Obradi\",INDIRECT(\"'\"&$O5&\"'!E8\"),\"\")","v":""},{"$f":"IF(INDIRECT(\"'\"&$O5&\"'!D32\")=\"Obradi\",INDIRECT(\"'\"&$O5&\"'!B23\"),\"\")","v":""}]
[null,null,null,null,null,null,null,null,null,null,null,null,null,null,"1K-OK-1O",{"$f":"IF(INDIRECT(\"'\"&$O6&\"'!D32\")=\"Obradi\",INDIRECT(\"'\"&$O6&\"'!A22\"),\"\")","v":""},{"$f":"IF(INDIRECT(\"'\"&$O6&\"'!D32\")=\"Obradi\",INDIRECT(\"'\"&$O6&\"'!E8\"),\"\")","v":""},{"$f":"IF(INDIRECT(\"'\"&$O6&\"'!D32\")=\"Obradi\",INDIRECT(\"'\"&$O6&\"'!B23\"),\"\")","v":""}]
["OTPREMNICA",null,null,null,null,null,null,null,null,null,null,null,null,null,"1K-FIX",{"$f":"IF(INDIRECT(\"'\"&$O7&\"'!D32\")=\"Obradi\",INDIRECT(\"'\"&$O7&\"'!A22\"),\"\")","v":""},"",""]
[null,null,null,null,null,null,null,null,null,null,null,null,null,null,"2K-OK-FIX",{"$f":"IF(INDIRECT(\"'\"&$O8&\"'!D32\")=\"Obradi\",INDIRECT(\"'\"&$O8&\"'!B22\"),\"\")","v":""},{"$f":"IF(INDIRECT(\"'\"&$O8&\"'!D32\")=\"Obradi\",INDIRECT(\"'\"&$O8&\"'!E11\"),\"\")","v":""},""]
[null,null,null,null,null,null,null,null,null,null,null,null,null,null,"1K-OK-2FIX",{"$f":"IF(INDIRECT(\"'\"&$O9&\"'!D32\")=\"Obradi\",INDIRECT(\"'\"&$O9&\"'!A22\"),\"\")","v":""},{"$f":"IF(INDIRECT(\"'\"&$O9&\"'!D32\")=\"Obradi\",INDIRECT(\"'\"&$O9&\"'!F10\"),\"\")","v":""},""]
[null,null,null,null,null,null,null,null,null,null,null,null,null,null,"2K-OK-2FIX",{"$f":"IF(INDIRECT(\"'\"&$O10&\"'!D33\")=\"Obradi\",INDIRECT(\"'\"&$O10&\"'!A22\"),\"\")","v":""},{"$f":"IF(INDIRECT(\"'\"&$O10&\"'!D33\")=\"Obradi\",INDIRECT(\"'\"&$O10&\"'!F7\"),\"\")","v":""},{"$f":"IF(INDIRECT(\"'\"&$O10&\"'!D33\")=\"Obradi\",INDIRECT(\"'\"&$O10&\"'!B23\"),\"\")","v":""}]
["Kupac:",null,null,null,null,null,null,null,null,null,null,null,null,null,"Vrata 1K",{"$f":"IF(INDIRECT(\"'\"&$O11&\"'!D32\")=\"Obradi\",INDIRECT(\"'\"&$O11&\"'!A21\"),\"\")","v":""},"",""]
["Adresa:",null,null,null,null,null,null,null,null,null,null,null,null,null,"Vrata 2K","","",""]
["Telefon:"]
["Fax:"]
[]
["Auto no.","sheet name","dimension",null,"Cena po komadu",null,"No:","Sum"]
[null,{"$f":"IFERROR(INDEX(O$5:O$11,SMALL(IF(ISNUMBER(P$5:P$11),ROW(O$5:O$11)-ROW(O$5)+1),ROWS($A$1:$A1))),\"\")","v":""},{"$f":"IFERROR(INDEX(P$5:P$11,SMALL(IF(ISNUMBER(P$5:P$11),ROW(P$5:P$11)-ROW(P$5)+1),ROWS($A$1:$A1))),\"\")","v":""},{"$f":"IFERROR(INDEX(Q$5:Q$11,SMALL(IF(ISNUMBER(Q$5:Q$11),ROW(Q$5:Q$11)-ROW(Q$5)+1),ROWS($A$1:$A1))),\"\")","v":""},null,null,{"$f":"IFERROR(INDEX(R$5:R$11,SMALL(IF(ISNUMBER(R$5:R$11),ROW(R$5:R$11)-ROW(R$5)+1),ROWS($A$1:$A1))),\"\")","v":""}]
[null,{"$f":"IFERROR(INDEX(O5:O12,SMALL(IF(ISNUMBER(O5:O12),ROW(O5:O12)-ROW(O$5)+1),ROWS($A$1:$A2))),\"\")","v":""},{"$f":"IFERROR(INDEX(P$5:P$11,SMALL(IF(ISNUMBER(P$5:P$11),ROW(P$5:P$11)-ROW(P$5)+1),ROWS($A$1:$A2))),\"\")","v":""},{"$f":"IFERROR(INDEX(Q$5:Q$11,SMALL(IF(ISNUMBER(Q$5:Q$11),ROW(Q$5:Q$11)-ROW(Q$5)+1),ROWS($A$1:$A2))),\"\")","v":""},null,null,{"$f":"IFERROR(INDEX(R$5:R$11,SMALL(IF(ISNUMBER(R$5:R$11),ROW(R$5:R$11)-ROW(R$5)+1),ROWS($A$1:$A2))),\"\")","v":""}]
[null,{"$f":"IFERROR(INDEX(O$5:O$11,SMALL(IF(ISNUMBER(P$5:P$11),ROW(O$5:O$11)-ROW(O$5)+1),ROWS($A$1:$A3))),\"\")","v":""},{"$f":"IFERROR(INDEX(P$5:P$11,SMALL(IF(ISNUMBER(P$5:P$11),ROW(P$5:P$11)-ROW(P$5)+1),ROWS($A$1:$A3))),\"\")","v":""},{"$f":"IFERROR(INDEX(Q$5:Q$11,SMALL(IF(ISNUMBER(Q$5:Q$11),ROW(Q$5:Q$11)-ROW(Q$5)+1),ROWS($A$1:$A3))),\"\")","v":""},null,null,{"$f":"IFERROR(INDEX(R$5:R$11,SMALL(IF(ISNUMBER(R$5:R$11),ROW(R$5:R$11)-ROW(R$5)+1),ROWS($A$1:$A3))),\"\")","v":""}]
[null,{"$f":"IFERROR(INDEX(O$5:O$11,SMALL(IF(ISNUMBER(P$5:P$11),ROW(O$5:O$11)-ROW(O$5)+1),ROWS($A$1:$A4))),\"\")","v":""},{"$f":"IFERROR(INDEX(P$5:P$11,SMALL(IF(ISNUMBER(P$5:P$11),ROW(P$5:P$11)-ROW(P$5)+1),ROWS($A$1:$A4))),\"\")","v":""},{"$f":"IFERROR(INDEX(Q$5:Q$11,SMALL(IF(ISNUMBER(Q$5:Q$11),ROW(Q$5:Q$11)-ROW(Q$5)+1),ROWS($A$1:$A4))),\"\")","v":""},null,null,{"$f":"IFERROR(INDEX(R$5:R$11,SMALL(IF(ISNUMBER(R$5:R$11),ROW(R$5:R$11)-ROW(R$5)+1),ROWS($A$1:$A4))),\"\")","v":""}]
[null,{"$f":"IFERROR(INDEX(O$5:O$11,SMALL(IF(ISNUMBER(P$5:P$11),ROW(O$5:O$11)-ROW(O$5)+1),ROWS($A$1:$A5))),\"\")","v":""},{"$f":"IFERROR(INDEX(P$5:P$11,SMALL(IF(ISNUMBER(P$5:P$11),ROW(P$5:P$11)-ROW(P$5)+1),ROWS($A$1:$A5))),\"\")","v":""},{"$f":"IFERROR(INDEX(Q$5:Q$11,SMALL(IF(ISNUMBER(Q$5:Q$11),ROW(Q$5:Q$11)-ROW(Q$5)+1),ROWS($A$1:$A5))),\"\")","v":""},null,null,{"$f":"IFERROR(INDEX(R$5:R$11,SMALL(IF(ISNUMBER(R$5:R$11),ROW(R$5:R$11)-ROW(R$5)+1),ROWS($A$1:$A5))),\"\")","v":""}]
[null,{"$f":"IFERROR(INDEX(O$5:O$11,SMALL(IF(ISNUMBER(P$5:P$11),ROW(O$5:O$11)-ROW(O$5)+1),ROWS($A$1:$A6))),\"\")","v":""},{"$f":"IFERROR(INDEX(P$5:P$11,SMALL(IF(ISNUMBER(P$5:P$11),ROW(P$5:P$11)-ROW(P$5)+1),ROWS($A$1:$A6))),\"\")","v":""},{"$f":"IFERROR(INDEX(Q$5:Q$11,SMALL(IF(ISNUMBER(Q$5:Q$11),ROW(Q$5:Q$11)-ROW(Q$5)+1),ROWS($A$1:$A6))),\"\")","v":""},null,null,{"$f":"IFERROR(INDEX(R$5:R$11,SMALL(IF(ISNUMBER(R$5:R$11),ROW(R$5:R$11)-ROW(R$5)+1),ROWS($A$1:$A6))),\"\")","v":""}]
[null,{"$f":"IFERROR(INDEX(O$5:O$11,SMALL(IF(ISNUMBER(P$5:P$11),ROW(O$5:O$11)-ROW(O$5)+1),ROWS($A$1:$A7))),\"\")","v":""},{"$f":"IFERROR(INDEX(P$5:P$11,SMALL(IF(ISNUMBER(P$5:P$11),ROW(P$5:P$11)-ROW(P$5)+1),ROWS($A$1:$A7))),\"\")","v":""},{"$f":"IFERROR(INDEX(Q$5:Q$11,SMALL(IF(ISNUMBER(Q$5:Q$11),ROW(Q$5:Q$11)-ROW(Q$5)+1),ROWS($A$1:$A7))),\"\")","v":""},null,null,{"$f":"IFERROR(INDEX(R$5:R$11,SMALL(IF(ISNUMBER(R$5:R$11),ROW(R$5:R$11)-ROW(R$5)+1),ROWS($A$1:$A7))),\"\")","v":""}]
[null,{"$f":"IFERROR(INDEX(O$5:O$11,SMALL(IF(ISNUMBER(P$5:P$11),ROW(O$5:O$11)-ROW(O$5)+1),ROWS($A$1:$A8))),\"\")","v":""},{"$f":"IFERROR(INDEX(P$5:P$11,SMALL(IF(ISNUMBER(P$5:P$11),ROW(P$5:P$11)-ROW(P$5)+1),ROWS($A$1:$A8))),\"\")","v":""},{"$f":"IFERROR(INDEX(Q$5:Q$11,SMALL(IF(ISNUMBER(Q$5:Q$11),ROW(Q$5:Q$11)-ROW(Q$5)+1),ROWS($A$1:$A8))),\"\")","v":""},null,null,{"$f":"IFERROR(INDEX(R$5:R$11,SMALL(IF(ISNUMBER(R$5:R$11),ROW(R$5:R$11)-ROW(R$5)+1),ROWS($A$1:$A8))),\"\")","v":""}]
[null,{"$f":"IFERROR(INDEX(O$5:O$11,SMALL(IF(ISNUMBER(P$5:P$11),ROW(O$5:O$11)-ROW(O$5)+1),ROWS($A$1:$A9))),\"\")","v":""},{"$f":"IFERROR(INDEX(P$5:P$11,SMALL(IF(ISNUMBER(P$5:P$11),ROW(P$5:P$11)-ROW(P$5)+1),ROWS($A$1:$A9))),\"\")","v":""},{"$f":"IFERROR(INDEX(Q$5:Q$11,SMALL(IF(ISNUMBER(Q$5:Q$11),ROW(Q$5:Q$11)-ROW(Q$5)+1),ROWS($A$1:$A9))),\"\")","v":""},null,null,{"$f":"IFERROR(INDEX(R$5:R$11,SMALL(IF(ISNUMBER(R$5:R$11),ROW(R$5:R$11)-ROW(R$5)+1),ROWS($A$1:$A9))),\"\")","v":""}]
[null,{"$f":"IFERROR(INDEX(O$5:O$11,SMALL(IF(ISNUMBER(P$5:P$11),ROW(O$5:O$11)-ROW(O$5)+1),ROWS($A$1:$A10))),\"\")","v":""},{"$f":"IFERROR(INDEX(P$5:P$11,SMALL(IF(ISNUMBER(P$5:P$11),ROW(P$5:P$11)-ROW(P$5)+1),ROWS($A$1:$A10))),\"\")","v":""},{"$f":"IFERROR(INDEX(Q$5:Q$11,SMALL(IF(ISNUMBER(Q$5:Q$11),ROW(Q$5:Q$11)-ROW(Q$5)+1),ROWS($A$1:$A10))),\"\")","v":""},null,null,{"$f":"IFERROR(INDEX(R$5:R$11,SMALL(IF(ISNUMBER(R$5:R$11),ROW(R$5:R$11)-ROW(R$5)+1),ROWS($A$1:$A10))),\"\")","v":""}]
[null,{"$f":"IFERROR(INDEX(O$5:O$11,SMALL(IF(ISNUMBER(P$5:P$11),ROW(O$5:O$11)-ROW(O$5)+1),ROWS($A$1:$A11))),\"\")","v":""},{"$f":"IFERROR(INDEX(P$5:P$11,SMALL(IF(ISNUMBER(P$5:P$11),ROW(P$5:P$11)-ROW(P$5)+1),ROWS($A$1:$A11))),\"\")","v":""},{"$f":"IFERROR(INDEX(Q$5:Q$11,SMALL(IF(ISNUMBER(Q$5:Q$11),ROW(Q$5:Q$11)-ROW(Q$5)+1),ROWS($A$1:$A11))),\"\")","v":""},null,null,{"$f":"IFERROR(INDEX(R$5:R$11,SMALL(IF(ISNUMBER(R$5:R$11),ROW(R$5:R$11)-ROW(R$5)+1),ROWS($A$1:$A11))),\"\")","v":""}]
[null,{"$f":"IFERROR(INDEX(O$5:O$11,SMALL(IF(ISNUMBER(P$5:P$11),ROW(O$5:O$11)-ROW(O$5)+1),ROWS($A$1:$A12))),\"\")","v":""},{"$f":"IFERROR(INDEX(P$5:P$11,SMALL(IF(ISNUMBER(P$5:P$11),ROW(P$5:P$11)-ROW(P$5)+1),ROWS($A$1:$A12))),\"\")","v":""},{"$f":"IFERROR(INDEX(Q$5:Q$11,SMALL(IF(ISNUMBER(Q$5:Q$11),ROW(Q$5:Q$11)-ROW(Q$5)+1),ROWS($A$1:$A12))),\"\")","v":""},null,null,{"$f":"IFERROR(INDEX(R$5:R$11,SMALL(IF(ISNUMBER(R$5:R$11),ROW(R$5:R$11)-ROW(R$5)+1),ROWS($A$1:$A12))),\"\")","v":""}]
[null,{"$f":"IFERROR(INDEX(O$5:O$11,SMALL(IF(ISNUMBER(P$5:P$11),ROW(O$5:O$11)-ROW(O$5)+1),ROWS($A$1:$A13))),\"\")","v":""},{"$f":"IFERROR(INDEX(P$5:P$11,SMALL(IF(ISNUMBER(P$5:P$11),ROW(P$5:P$11)-ROW(P$5)+1),ROWS($A$1:$A13))),\"\")","v":""},{"$f":"IFERROR(INDEX(Q$5:Q$11,SMALL(IF(ISNUMBER(Q$5:Q$11),ROW(Q$5:Q$11)-ROW(Q$5)+1),ROWS($A$1:$A13))),\"\")","v":""},null,null,{"$f":"IFERROR(INDEX(R$5:R$11,SMALL(IF(ISNUMBER(R$5:R$11),ROW(R$5:R$11)-ROW(R$5)+1),ROWS($A$1:$A13))),\"\")","v":""}]
[null,{"$f":"IFERROR(INDEX(O$5:O$11,SMALL(IF(ISNUMBER(P$5:P$11),ROW(O$5:O$11)-ROW(O$5)+1),ROWS($A$1:$A14))),\"\")","v":""},{"$f":"IFERROR(INDEX(P$5:P$11,SMALL(IF(ISNUMBER(P$5:P$11),ROW(P$5:P$11)-ROW(P$5)+1),ROWS($A$1:$A14))),\"\")","v":""},{"$f":"IFERROR(INDEX(Q$5:Q$11,SMALL(IF(ISNUMBER(Q$5:Q$11),ROW(Q$5:Q$11)-ROW(Q$5)+1),ROWS($A$1:$A14))),\"\")","v":""},null,null,{"$f":"IFERROR(INDEX(R$5:R$11,SMALL(IF(ISNUMBER(R$5:R$11),ROW(R$5:R$11)-ROW(R$5)+1),ROWS($A$1:$A14))),\"\")","v":""}]
[null,{"$f":"IFERROR(INDEX(O$5:O$11,SMALL(IF(ISNUMBER(P$5:P$11),ROW(O$5:O$11)-ROW(O$5)+1),ROWS($A$1:$A15))),\"\")","v":""},{"$f":"IFERROR(INDEX(P$5:P$11,SMALL(IF(ISNUMBER(P$5:P$11),ROW(P$5:P$11)-ROW(P$5)+1),ROWS($A$1:$A15))),\"\")","v":""},{"$f":"IFERROR(INDEX(Q$5:Q$11,SMALL(IF(ISNUMBER(Q$5:Q$11),ROW(Q$5:Q$11)-ROW(Q$5)+1),ROWS($A$1:$A15))),\"\")","v":""},null,null,{"$f":"IFERROR(INDEX(R$5:R$11,SMALL(IF(ISNUMBER(R$5:R$11),ROW(R$5:R$11)-ROW(R$5)+1),ROWS($A$1:$A15))),\"\")","v":""}]
[null,{"$f":"IFERROR(INDEX(O$5:O$11,SMALL(IF(ISNUMBER(P$5:P$11),ROW(O$5:O$11)-ROW(O$5)+1),ROWS($A$1:$A16))),\"\")","v":""},{"$f":"IFERROR(INDEX(P$5:P$11,SMALL(IF(ISNUMBER(P$5:P$11),ROW(P$5:P$11)-ROW(P$5)+1),ROWS($A$1:$A16))),\"\")","v":""},{"$f":"IFERROR(INDEX(Q$5:Q$11,SMALL(IF(ISNUMBER(Q$5:Q$11),ROW(Q$5:Q$11)-ROW(Q$5)+1),ROWS($A$1:$A16))),\"\")","v":""},null,null,{"$f":"IFERROR(INDEX(R$5:R$11,SMALL(IF(ISNUMBER(R$5:R$11),ROW(R$5:R$11)-ROW(R$5)+1),ROWS($A$1:$A16))),\"\")","v":""}]
[null,{"$f":"IFERROR(INDEX(O$5:O$11,SMALL(IF(ISNUMBER(P$5:P$11),ROW(O$5:O$11)-ROW(O$5)+1),ROWS($A$1:$A17))),\"\")","v":""},{"$f":"IFERROR(INDEX(P$5:P$11,SMALL(IF(ISNUMBER(P$5:P$11),ROW(P$5:P$11)-ROW(P$5)+1),ROWS($A$1:$A17))),\"\")","v":""},{"$f":"IFERROR(INDEX(Q$5:Q$11,SMALL(IF(ISNUMBER(Q$5:Q$11),ROW(Q$5:Q$11)-ROW(Q$5)+1),ROWS($A$1:$A17))),\"\")","v":""},null,null,{"$f":"IFERROR(INDEX(R$5:R$11,SMALL(IF(ISNUMBER(R$5:R$11),ROW(R$5:R$11)-ROW(R$5)+1),ROWS($A$1:$A17))),\"\")","v":""}]
[null,{"$f":"IFERROR(INDEX(O$5:O$11,SMALL(IF(ISNUMBER(P$5:P$11),ROW(O$5:O$11)-ROW(O$5)+1),ROWS($A$1:$A18))),\"\")","v":""},{"$f":"IFERROR(INDEX(P$5:P$11,SMALL(IF(ISNUMBER(P$5:P$11),ROW(P$5:P$11)-ROW(P$5)+1),ROWS($A$1:$A18))),\"\")","v":""},{"$f":"IFERROR(INDEX(Q$5:Q$11,SMALL(IF(ISNUMBER(Q$5:Q$11),ROW(Q$5:Q$11)-ROW(Q$5)+1),ROWS($A$1:$A18))),\"\")","v":""},null,null,{"$f":"IFERROR(INDEX(R$5:R$11,SMALL(IF(ISNUMBER(R$5:R$11),ROW(R$5:R$11)-ROW(R$5)+1),ROWS($A$1:$A18))),\"\")","v":""}]
[null,{"$f":"IFERROR(INDEX(O$5:O$11,SMALL(IF(ISNUMBER(P$5:P$11),ROW(O$5:O$11)-ROW(O$5)+1),ROWS($A$1:$A19))),\"\")","v":""},{"$f":"IFERROR(INDEX(P$5:P$11,SMALL(IF(ISNUMBER(P$5:P$11),ROW(P$5:P$11)-ROW(P$5)+1),ROWS($A$1:$A19))),\"\")","v":""},{"$f":"IFERROR(INDEX(Q$5:Q$11,SMALL(IF(ISNUMBER(Q$5:Q$11),ROW(Q$5:Q$11)-ROW(Q$5)+1),ROWS($A$1:$A19))),\"\")","v":""},null,null,{"$f":"IFERROR(INDEX(R$5:R$11,SMALL(IF(ISNUMBER(R$5:R$11),ROW(R$5:R$11)-ROW(R$5)+1),ROWS($A$1:$A19))),\"\")","v":""}]
[null,{"$f":"IFERROR(INDEX(O$5:O$11,SMALL(IF(ISNUMBER(P$5:P$11),ROW(O$5:O$11)-ROW(O$5)+1),ROWS($A$1:$A20))),\"\")","v":""},{"$f":"IFERROR(INDEX(P$5:P$11,SMALL(IF(ISNUMBER(P$5:P$11),ROW(P$5:P$11)-ROW(P$5)+1),ROWS($A$1:$A20))),\"\")","v":""},{"$f":"IFERROR(INDEX(Q$5:Q$11,SMALL(IF(ISNUMBER(Q$5:Q$11),ROW(Q$5:Q$11)-ROW(Q$5)+1),ROWS($A$1:$A20))),\"\")","v":""},null,null,{"$f":"IFERROR(INDEX(R$5:R$11,SMALL(IF(ISNUMBER(R$5:R$11),ROW(R$5:R$11)-ROW(R$5)+1),ROWS($A$1:$A20))),\"\")","v":""}]
[null,{"$f":"IFERROR(INDEX(O$5:O$11,SMALL(IF(ISNUMBER(P$5:P$11),ROW(O$5:O$11)-ROW(O$5)+1),ROWS($A$1:$A21))),\"\")","v":""},{"$f":"IFERROR(INDEX(P$5:P$11,SMALL(IF(ISNUMBER(P$5:P$11),ROW(P$5:P$11)-ROW(P$5)+1),ROWS($A$1:$A21))),\"\")","v":""},{"$f":"IFERROR(INDEX(Q$5:Q$11,SMALL(IF(ISNUMBER(Q$5:Q$11),ROW(Q$5:Q$11)-ROW(Q$5)+1),ROWS($A$1:$A21))),\"\")","v":""},null,null,{"$f":"IFERROR(INDEX(R$5:R$11,SMALL(IF(ISNUMBER(R$5:R$11),ROW(R$5:R$11)-ROW(R$5)+1),ROWS($A$1:$A21))),\"\")","v":""}]
[null,{"$f":"IFERROR(INDEX(O$5:O$11,SMALL(IF(ISNUMBER(P$5:P$11),ROW(O$5:O$11)-ROW(O$5)+1),ROWS($A$1:$A22))),\"\")","v":""},{"$f":"IFERROR(INDEX(P$5:P$11,SMALL(IF(ISNUMBER(P$5:P$11),ROW(P$5:P$11)-ROW(P$5)+1),ROWS($A$1:$A22))),\"\")","v":""},{"$f":"IFERROR(INDEX(Q$5:Q$11,SMALL(IF(ISNUMBER(Q$5:Q$11),ROW(Q$5:Q$11)-ROW(Q$5)+1),ROWS($A$1:$A22))),\"\")","v":""},null,null,{"$f":"IFERROR(INDEX(R$5:R$11,SMALL(IF(ISNUMBER(R$5:R$11),ROW(R$5:R$11)-ROW(R$5)+1),ROWS($A$1:$A22))),\"\")","v":""}]
[null,{"$f":"IFERROR(INDEX(O$5:O$11,SMALL(IF(ISNUMBER(P$5:P$11),ROW(O$5:O$11)-ROW(O$5)+1),ROWS($A$1:$A23))),\"\")","v":""},{"$f":"IFERROR(INDEX(P$5:P$11,SMALL(IF(ISNUMBER(P$5:P$11),ROW(P$5:P$11)-ROW(P$5)+1),ROWS($A$1:$A23))),\"\")","v":""},{"$f":"IFERROR(INDEX(Q$5:Q$11,SMALL(IF(ISNUMBER(Q$5:Q$11),ROW(Q$5:Q$11)-ROW(Q$5)+1),ROWS($A$1:$A23))),\"\")","v":""},null,null,{"$f":"IFERROR(INDEX(R$5:R$11,SMALL(IF(ISNUMBER(R$5:R$11),ROW(R$5:R$11)-ROW(R$5)+1),ROWS($A$1:$A23))),\"\")","v":""}]
[null,{"$f":"IFERROR(INDEX(O$5:O$11,SMALL(IF(ISNUMBER(P$5:P$11),ROW(O$5:O$11)-ROW(O$5)+1),ROWS($A$1:$A24))),\"\")","v":""},{"$f":"IFERROR(INDEX(P$5:P$11,SMALL(IF(ISNUMBER(P$5:P$11),ROW(P$5:P$11)-ROW(P$5)+1),ROWS($A$1:$A24))),\"\")","v":""},{"$f":"IFERROR(INDEX(Q$5:Q$11,SMALL(IF(ISNUMBER(Q$5:Q$11),ROW(Q$5:Q$11)-ROW(Q$5)+1),ROWS($A$1:$A24))),\"\")","v":""},null,null,{"$f":"IFERROR(INDEX(R$5:R$11,SMALL(IF(ISNUMBER(R$5:R$11),ROW(R$5:R$11)-ROW(R$5)+1),ROWS($A$1:$A24))),\"\")","v":""}]
[null,{"$f":"IFERROR(INDEX(O$5:O$11,SMALL(IF(ISNUMBER(P$5:P$11),ROW(O$5:O$11)-ROW(O$5)+1),ROWS($A$1:$A25))),\"\")","v":""},{"$f":"IFERROR(INDEX(P$5:P$11,SMALL(IF(ISNUMBER(P$5:P$11),ROW(P$5:P$11)-ROW(P$5)+1),ROWS($A$1:$A25))),\"\")","v":""},{"$f":"IFERROR(INDEX(Q$5:Q$11,SMALL(IF(ISNUMBER(Q$5:Q$11),ROW(Q$5:Q$11)-ROW(Q$5)+1),ROWS($A$1:$A25))),\"\")","v":""},null,null,{"$f":"IFERROR(INDEX(R$5:R$11,SMALL(IF(ISNUMBER(R$5:R$11),ROW(R$5:R$11)-ROW(R$5)+1),ROWS($A$1:$A25))),\"\")","v":""}]
[null,{"$f":"IFERROR(INDEX(O$5:O$11,SMALL(IF(ISNUMBER(P$5:P$11),ROW(O$5:O$11)-ROW(O$5)+1),ROWS($A$1:$A26))),\"\")","v":""},{"$f":"IFERROR(INDEX(P$5:P$11,SMALL(IF(ISNUMBER(P$5:P$11),ROW(P$5:P$11)-ROW(P$5)+1),ROWS($A$1:$A26))),\"\")","v":""},{"$f":"IFERROR(INDEX(Q$5:Q$11,SMALL(IF(ISNUMBER(Q$5:Q$11),ROW(Q$5:Q$11)-ROW(Q$5)+1),ROWS($A$1:$A26))),\"\")","v":""},null,null,{"$f":"IFERROR(INDEX(R$5:R$11,SMALL(IF(ISNUMBER(R$5:R$11),ROW(R$5:R$11)-ROW(R$5)+1),ROWS($A$1:$A26))),\"\")","v":""}]
[null,{"$f":"IFERROR(INDEX(O$5:O$11,SMALL(IF(ISNUMBER(P$5:P$11),ROW(O$5:O$11)-ROW(O$5)+1),ROWS($A$1:$A27))),\"\")","v":""},{"$f":"IFERROR(INDEX(P$5:P$11,SMALL(IF(ISNUMBER(P$5:P$11),ROW(P$5:P$11)-ROW(P$5)+1),ROWS($A$1:$A27))),\"\")","v":""},{"$f":"IFERROR(INDEX(Q$5:Q$11,SMALL(IF(ISNUMBER(Q$5:Q$11),ROW(Q$5:Q$11)-ROW(Q$5)+1),ROWS($A$1:$A27))),\"\")","v":""},null,null,{"$f":"IFERROR(INDEX(R$5:R$11,SMALL(IF(ISNUMBER(R$5:R$11),ROW(R$5:R$11)-ROW(R$5)+1),ROWS($A$1:$A27))),\"\")","v":""}]
[null,{"$f":"IFERROR(INDEX(O$5:O$11,SMALL(IF(ISNUMBER(P$5:P$11),ROW(O$5:O$11)-ROW(O$5)+1),ROWS($A$1:$A28))),\"\")","v":""},{"$f":"IFERROR(INDEX(P$5:P$11,SMALL(IF(ISNUMBER(P$5:P$11),ROW(P$5:P$11)-ROW(P$5)+1),ROWS($A$1:$A28))),\"\")","v":""},{"$f":"IFERROR(INDEX(Q$5:Q$11,SMALL(IF(ISNUMBER(Q$5:Q$11),ROW(Q$5:Q$11)-ROW(Q$5)+1),ROWS($A$1:$A28))),\"\")","v":""},null,null,{"$f":"IFERROR(INDEX(R$5:R$11,SMALL(IF(ISNUMBER(R$5:R$11),ROW(R$5:R$11)-ROW(R$5)+1),ROWS($A$1:$A28))),\"\")","v":""}]
[]
[]
["Kupac",null,null,null,null,null,null,"Robu izdao"]