{"text_format":"1","workbook":"xlsx","n_sheets":2,"sheets":["Faktura","Klijenti"],"not_rendered":{"charts":0,"images":0,"macros":1,"external_links":0,"defined_names":8,"comments":1,"pivot_tables":0},"unopened":[],"bounds":{"document_bytes":16777216,"sheet_cells":100000,"rows_first":2000,"rows_last":500,"rows_between":2000,"halvings":0,"cell_chars":16384,"cell_head_chars":4096},"cells_cut":0,"cells_raw":0,"read":"whole","date_system":"1900"}

{"sheet":"Faktura","index":0,"n_rows":54,"n_cols":10,"rows_kept":54,"cut":false,"hidden":false,"merged":[[16,2,17,2],[16,3,17,3],[16,4,17,4],[0,6,0,9],[10,6,10,9],[11,6,11,9],[9,6,9,9],[8,6,8,9],[17,6,17,8],[10,1,10,2],[11,1,11,2],[12,1,12,2],[14,6,14,8],[15,6,15,8],[16,6,16,8],[12,6,12,9],[39,4,39,5],[53,0,53,2],[53,7,53,9],[36,1,36,2],[19,5,20,5],[19,6,20,6],[19,7,20,7],[19,8,20,8],[19,9,20,9],[19,0,20,0],[19,1,20,2],[19,3,20,3],[19,4,20,4]]}
[null,null,null,null,null,null,"logo firme"]
[]
[]
[]
[]
[]
[]
[]
[null,null,null,null,null,null,"NAZIV FIRME"]
[null,null,null,null,null,null,"adresa"]
[null,"klijent    > > > > >",null,null,null,null,"mesto"]
[null,{"$f":"VLOOKUP($B$11,[0]!kupci,2,FALSE)","v":"adresa"},null,null,null,null,"Tekući račun: "]
[null,{"$f":"VLOOKUP($B$11,[0]!kupci,3,FALSE)","v":"mesto"},null,null,null,null,"PIB: "]
[null,"PIB:",{"$f":"VLOOKUP($B$11,[0]!kupci,4,FALSE)","v":"pib"}]
[null,null,null,null,null,null,"Mesto izdavanja",null,null,"Datum izdavanja"]
[null,null,null,null,null,null,"Niš",null,null,"2010-01-01"]
[null,null,"RAČUN br.:",0,"/10",null,"Datum prometa dobara i usluga",null,null,"Datum valute"]
[null,null,null,null,null,null,{"$f":"J16","v":"2010-01-01"},null,null,{"$f":"J16+7","v":"2010-01-08"}]
[]
["R.b.","Vrsta dobara i usluga                    (Kliše za štampu)",null,"J.M.","Količina","Cena po J.M.","Poreska osnovica","Stopa PDV(%)","Iznos obrač. PDV","Ukupna   naknada"]
[]
[1,null,null,"cm2",null,null,{"$f":"SUM(E22*F22)","v":0},0.18,{"$f":"SUM(G22*H22)","v":0},{"$f":"SUM(G22+I22)","v":0}]
[2,null,null,"cm2",null,{"$f":"F22","v":0},{"$f":"SUM(E23*F23)","v":0},0.18,{"$f":"SUM(G23*H23)","v":0},{"$f":"SUM(G23+I23)","v":0}]
[3,null,null,"cm2",null,{"$f":"F23","v":0},0,0.18,0,0]
[4,null,null,"cm2",null,0,0,0.18,0,0]
[5,null,null,"cm2",null,0,0,0.18,0,0]
[6,null,null,"cm2",null,0,0,0.18,0,0]
[7,null,null,"cm2",null,0,0,0.18,0,0]
[8,null,null,"cm2",null,0,0,0.18,0,0]
[9,null,null,"cm2",null,0,0,0.18,0,0]
[10,null,null,"cm2",null,0,0,0.18,0,0]
[11,null,null,"cm2",null,0,0,0.18,0,0]
[12,null,null,"cm2",null,{"$f":"F32","v":0},0,0.18,0,0]
[13,null,null,"cm2",null,0,0,0.18,0,0]
[14,null,null,"cm2",null,0,0,0.18,0,0]
[15,null,null,"cm2",null,0,0,0.18,0,0]
[]
[]
[null,null,null,null,null,"Ukupno:",{"$f":"SUM(G22:G36)","v":0},null,{"$f":"SUM(I22:I36)","v":0},{"$f":"SUM(J22:J36)","v":0}]
[null,null,null,null,"Avansne uplate:",null,null,null,null,0]
[null,null,null,null,null,"Za uplatu:",null,null,null,{"$f":"SUM(J39-J40)","v":0}]
[null,null,null,null,null,"Slovima:",{"$f":"slovima(J41)","v":" 0/100din."}]
[]
[]
[]
["Napomena o poreskom oslobođenju:  NEMA"]
[]
[]
[]
[]
[]
[]
[]
["Kupac:",null,null,null,null,null,null,"Fakturisao:"]

{"sheet":"Klijenti","index":1,"n_rows":102,"n_cols":7,"rows_kept":102,"cut":false,"hidden":false,"merged":[]}
["R.b.","Klijent","Adresa","Mesto","PIB","Telefon","Mobilni"]
[1,"klijent    > > > > >","adresa","mesto","pib"]
[2]
[3]
[4]
[5]
[6]
[7]
[8]
[9]
[10]
[11]
[12]
[13]
[14]
[15]
[16]
[17]
[18]
[19]
[20]
[21]
[22]
[23]
[24]
[25]
[26]
[27]
[28]
[29]
[30]
[31]
[32]
[33]
[34]
[35]
[36]
[37]
[38]
[39]
[40]
[41]
[42]
[43]
[44]
[45]
[46]
[47]
[48]
[49]
[50]
[51]
[52]
[53]
[54]
[55]
[56]
[57]
[58]
[59]
[60]
[61]
[62]
[63]
[64]
[65]
[66]
[67]
[68]
[69]
[70]
[71]
[72]
[73]
[74]
[75]
[76]
[77]
[78]
[79]
[80]
[81]
[82]
[83]
[84]
[85]
[86]
[87]
[88]
[89]
[90]
[91]
[92]
[93]
[94]
[95]
[96]
[97]
[98]
[99]
[100]
[101]